[INFO] Scanning for projects...
[INFO]                                                                         
[INFO] ------------------------------------------------------------------------
[INFO] Building Apache Commons Lang 3.4
[INFO] ------------------------------------------------------------------------
[INFO] 
[INFO] --- maven-enforcer-plugin:1.3.1:enforce (enforce-maven-3) @ commons-lang3 ---
[INFO] 
[INFO] --- build-helper-maven-plugin:1.8:parse-version (parse-version) @ commons-lang3 ---
[INFO] 
[INFO] --- maven-antrun-plugin:1.8:run (javadoc.resources) @ commons-lang3 ---
[INFO] Executing tasks

main:
[INFO] Executed tasks
[INFO] 
[INFO] --- maven-remote-resources-plugin:1.5:process (default) @ commons-lang3 ---
[INFO] 
[INFO] --- buildnumber-maven-plugin:1.3:create (default) @ commons-lang3 ---
[INFO] Executing: /bin/sh -c cd /home/perham/Study/LittleDarwin/Cases/commons-lang3-3.4-src && svn --non-interactive info
[INFO] Working directory: /home/perham/Study/LittleDarwin/Cases/commons-lang3-3.4-src
[INFO] Storing buildNumber: ?????? at timestamp: 1438672400432
[INFO] Executing: /bin/sh -c cd /home/perham/Study/LittleDarwin/Cases/commons-lang3-3.4-src && svn --non-interactive info
[INFO] Working directory: /home/perham/Study/LittleDarwin/Cases/commons-lang3-3.4-src
[INFO] Storing buildScmBranch: UNKNOWN_BRANCH
[INFO] 
[INFO] --- maven-resources-plugin:2.7:resources (default-resources) @ commons-lang3 ---
[INFO] Using 'ISO-8859-1' encoding to copy filtered resources.
[INFO] Copying 0 resource
[INFO] Copying 2 resources to META-INF
[INFO] 
[INFO] --- maven-compiler-plugin:3.2:compile (default-compile) @ commons-lang3 ---
[INFO] Changes detected - recompiling the module!
[INFO] Compiling 133 source files to /home/perham/Study/LittleDarwin/Cases/commons-lang3-3.4-src/target/classes
[INFO] /home/perham/Study/LittleDarwin/Cases/commons-lang3-3.4-src/src/main/java/org/apache/commons/lang3/SerializationUtils.java: /home/perham/Study/LittleDarwin/Cases/commons-lang3-3.4-src/src/main/java/org/apache/commons/lang3/SerializationUtils.java uses unchecked or unsafe operations.
[INFO] /home/perham/Study/LittleDarwin/Cases/commons-lang3-3.4-src/src/main/java/org/apache/commons/lang3/SerializationUtils.java: Recompile with -Xlint:unchecked for details.
[INFO] 
[INFO] --- maven-bundle-plugin:2.5.3:manifest (bundle-manifest) @ commons-lang3 ---
[INFO] 
[INFO] --- animal-sniffer-maven-plugin:1.13:check (checkAPIcompatibility) @ commons-lang3 ---
[INFO] Checking unresolved references to org.codehaus.mojo.signature:java16:1.0
[INFO] 
[INFO] --- maven-resources-plugin:2.7:testResources (default-testResources) @ commons-lang3 ---
[INFO] Using 'ISO-8859-1' encoding to copy filtered resources.
[INFO] Copying 2 resources
[INFO] Copying 2 resources to META-INF
[INFO] 
[INFO] --- maven-compiler-plugin:3.2:testCompile (default-testCompile) @ commons-lang3 ---
[INFO] Nothing to compile - all classes are up to date
[INFO] 
[INFO] --- maven-surefire-plugin:2.18:test (default-test) @ commons-lang3 ---
[INFO] Surefire report directory: /home/perham/Study/LittleDarwin/Cases/commons-lang3-3.4-src/target/surefire-reports

-------------------------------------------------------
 T E S T S
-------------------------------------------------------
Running org.apache.commons.lang3.ValidateTest
Tests run: 63, Failures: 0, Errors: 0, Skipped: 0, Time elapsed: 0.033 sec - in org.apache.commons.lang3.ValidateTest
Running org.apache.commons.lang3.LocaleUtilsTest
Tests run: 15, Failures: 0, Errors: 0, Skipped: 0, Time elapsed: 0.016 sec - in org.apache.commons.lang3.LocaleUtilsTest
Running org.apache.commons.lang3.tuple.MutableTripleTest
Tests run: 8, Failures: 0, Errors: 0, Skipped: 0, Time elapsed: 0.011 sec - in org.apache.commons.lang3.tuple.MutableTripleTest
Running org.apache.commons.lang3.tuple.TripleTest
Tests run: 10, Failures: 0, Errors: 0, Skipped: 0, Time elapsed: 0.01 sec - in org.apache.commons.lang3.tuple.TripleTest
Running org.apache.commons.lang3.tuple.ImmutablePairTest
Tests run: 6, Failures: 0, Errors: 0, Skipped: 0, Time elapsed: 0 sec - in org.apache.commons.lang3.tuple.ImmutablePairTest
Running org.apache.commons.lang3.tuple.MutablePairTest
Tests run: 8, Failures: 0, Errors: 0, Skipped: 0, Time elapsed: 0.001 sec - in org.apache.commons.lang3.tuple.MutablePairTest
Running org.apache.commons.lang3.tuple.ImmutableTripleTest
Tests run: 6, Failures: 0, Errors: 0, Skipped: 0, Time elapsed: 0.001 sec - in org.apache.commons.lang3.tuple.ImmutableTripleTest
Running org.apache.commons.lang3.tuple.PairTest
Tests run: 9, Failures: 0, Errors: 0, Skipped: 0, Time elapsed: 0 sec - in org.apache.commons.lang3.tuple.PairTest
Running org.apache.commons.lang3.StringUtilsIsTest
Tests run: 8, Failures: 0, Errors: 0, Skipped: 0, Time elapsed: 0.008 sec - in org.apache.commons.lang3.StringUtilsIsTest
Running org.apache.commons.lang3.JavaVersionTest
Tests run: 3, Failures: 0, Errors: 0, Skipped: 0, Time elapsed: 0 sec - in org.apache.commons.lang3.JavaVersionTest
Running org.apache.commons.lang3.builder.NoFieldNamesToStringStyleTest
Tests run: 8, Failures: 8, Errors: 0, Skipped: 0, Time elapsed: 0.017 sec <<< FAILURE! - in org.apache.commons.lang3.builder.NoFieldNamesToStringStyleTest
testObjectArray(org.apache.commons.lang3.builder.NoFieldNamesToStringStyleTest)  Time elapsed: 0.013 sec  <<< FAILURE!
org.junit.ComparisonFailure: expected:<...c7b[{<null>,5,{3,6}}[]]> but was:<...c7b[{<null>,5,{3,6}}[,<null>]>
	at org.junit.Assert.assertEquals(Assert.java:115)
	at org.junit.Assert.assertEquals(Assert.java:144)
	at org.apache.commons.lang3.builder.NoFieldNamesToStringStyleTest.testObjectArray(NoFieldNamesToStringStyleTest.java:104)

testBlank(org.apache.commons.lang3.builder.NoFieldNamesToStringStyleTest)  Time elapsed: 0 sec  <<< FAILURE!
org.junit.ComparisonFailure: expected:<...ng.Integer@3edcbc7b[[]]> but was:<...ng.Integer@3edcbc7b[[<null>]>
	at org.junit.Assert.assertEquals(Assert.java:115)
	at org.junit.Assert.assertEquals(Assert.java:144)
	at org.apache.commons.lang3.builder.NoFieldNamesToStringStyleTest.testBlank(NoFieldNamesToStringStyleTest.java:53)

testLong(org.apache.commons.lang3.builder.NoFieldNamesToStringStyleTest)  Time elapsed: 0.001 sec  <<< FAILURE!
org.junit.ComparisonFailure: expected:<...g.Integer@3edcbc7b[3[]]> but was:<...g.Integer@3edcbc7b[3[,<null>]>
	at org.junit.Assert.assertEquals(Assert.java:115)
	at org.junit.Assert.assertEquals(Assert.java:144)
	at org.apache.commons.lang3.builder.NoFieldNamesToStringStyleTest.testLong(NoFieldNamesToStringStyleTest.java:96)

testLongArrayArray(org.apache.commons.lang3.builder.NoFieldNamesToStringStyleTest)  Time elapsed: 0 sec  <<< FAILURE!
org.junit.ComparisonFailure: expected:<...b[{{1,2},<null>,{5}}[]]> but was:<...b[{{1,2},<null>,{5}}[,<null>]>
	at org.junit.Assert.assertEquals(Assert.java:115)
	at org.junit.Assert.assertEquals(Assert.java:144)
	at org.apache.commons.lang3.builder.NoFieldNamesToStringStyleTest.testLongArrayArray(NoFieldNamesToStringStyleTest.java:124)

testLongArray(org.apache.commons.lang3.builder.NoFieldNamesToStringStyleTest)  Time elapsed: 0 sec  <<< FAILURE!
org.junit.ComparisonFailure: expected:<...@3edcbc7b[{1,2,-3,4}[]]> but was:<...@3edcbc7b[{1,2,-3,4}[,<null>]>
	at org.junit.Assert.assertEquals(Assert.java:115)
	at org.junit.Assert.assertEquals(Assert.java:144)
	at org.apache.commons.lang3.builder.NoFieldNamesToStringStyleTest.testLongArray(NoFieldNamesToStringStyleTest.java:114)

testObject(org.apache.commons.lang3.builder.NoFieldNamesToStringStyleTest)  Time elapsed: 0.001 sec  <<< FAILURE!
org.junit.ComparisonFailure: expected:<...eger@3edcbc7b[<null>[]]> but was:<...eger@3edcbc7b[<null>[,<null>]>
	at org.junit.Assert.assertEquals(Assert.java:115)
	at org.junit.Assert.assertEquals(Assert.java:144)
	at org.apache.commons.lang3.builder.NoFieldNamesToStringStyleTest.testObject(NoFieldNamesToStringStyleTest.java:70)

testPerson(org.apache.commons.lang3.builder.NoFieldNamesToStringStyleTest)  Time elapsed: 0.001 sec  <<< FAILURE!
org.junit.ComparisonFailure: expected:<...90[Ron Paul,72,false[]]> but was:<...90[Ron Paul,72,false[,<null>]>
	at org.junit.Assert.assertEquals(Assert.java:115)
	at org.junit.Assert.assertEquals(Assert.java:144)
	at org.apache.commons.lang3.builder.NoFieldNamesToStringStyleTest.testPerson(NoFieldNamesToStringStyleTest.java:91)

testAppendSuper(org.apache.commons.lang3.builder.NoFieldNamesToStringStyleTest)  Time elapsed: 0 sec  <<< FAILURE!
org.junit.ComparisonFailure: expected:<...ng.Integer@3edcbc7b[[]]> but was:<...ng.Integer@3edcbc7b[[<null>]>
	at org.junit.Assert.assertEquals(Assert.java:115)
	at org.junit.Assert.assertEquals(Assert.java:144)
	at org.apache.commons.lang3.builder.NoFieldNamesToStringStyleTest.testAppendSuper(NoFieldNamesToStringStyleTest.java:58)

Running org.apache.commons.lang3.builder.ShortPrefixToStringStyleTest
Tests run: 8, Failures: 8, Errors: 0, Skipped: 0, Time elapsed: 0.002 sec <<< FAILURE! - in org.apache.commons.lang3.builder.ShortPrefixToStringStyleTest
testObjectArray(org.apache.commons.lang3.builder.ShortPrefixToStringStyleTest)  Time elapsed: 0 sec  <<< FAILURE!
org.junit.ComparisonFailure: expected:<...ger[{<null>,5,{3,6}}[]]> but was:<...ger[{<null>,5,{3,6}}[,<null>]>
	at org.junit.Assert.assertEquals(Assert.java:115)
	at org.junit.Assert.assertEquals(Assert.java:144)
	at org.apache.commons.lang3.builder.ShortPrefixToStringStyleTest.testObjectArray(ShortPrefixToStringStyleTest.java:104)

testBlank(org.apache.commons.lang3.builder.ShortPrefixToStringStyleTest)  Time elapsed: 0 sec  <<< FAILURE!
org.junit.ComparisonFailure: expected:<Integer[[]]> but was:<Integer[[<null>]>
	at org.junit.Assert.assertEquals(Assert.java:115)
	at org.junit.Assert.assertEquals(Assert.java:144)
	at org.apache.commons.lang3.builder.ShortPrefixToStringStyleTest.testBlank(ShortPrefixToStringStyleTest.java:53)

testLong(org.apache.commons.lang3.builder.ShortPrefixToStringStyleTest)  Time elapsed: 0 sec  <<< FAILURE!
org.junit.ComparisonFailure: expected:<Integer[3[]]> but was:<Integer[3[,<null>]>
	at org.junit.Assert.assertEquals(Assert.java:115)
	at org.junit.Assert.assertEquals(Assert.java:144)
	at org.apache.commons.lang3.builder.ShortPrefixToStringStyleTest.testLong(ShortPrefixToStringStyleTest.java:96)

testLongArrayArray(org.apache.commons.lang3.builder.ShortPrefixToStringStyleTest)  Time elapsed: 0 sec  <<< FAILURE!
org.junit.ComparisonFailure: expected:<...r[{{1,2},<null>,{5}}[]]> but was:<...r[{{1,2},<null>,{5}}[,<null>]>
	at org.junit.Assert.assertEquals(Assert.java:115)
	at org.junit.Assert.assertEquals(Assert.java:144)
	at org.apache.commons.lang3.builder.ShortPrefixToStringStyleTest.testLongArrayArray(ShortPrefixToStringStyleTest.java:124)

testLongArray(org.apache.commons.lang3.builder.ShortPrefixToStringStyleTest)  Time elapsed: 0.001 sec  <<< FAILURE!
org.junit.ComparisonFailure: expected:<Integer[{1,2,-3,4}[]]> but was:<Integer[{1,2,-3,4}[,<null>]>
	at org.junit.Assert.assertEquals(Assert.java:115)
	at org.junit.Assert.assertEquals(Assert.java:144)
	at org.apache.commons.lang3.builder.ShortPrefixToStringStyleTest.testLongArray(ShortPrefixToStringStyleTest.java:114)

testObject(org.apache.commons.lang3.builder.ShortPrefixToStringStyleTest)  Time elapsed: 0 sec  <<< FAILURE!
org.junit.ComparisonFailure: expected:<Integer[<null>[]]> but was:<Integer[<null>[,<null>]>
	at org.junit.Assert.assertEquals(Assert.java:115)
	at org.junit.Assert.assertEquals(Assert.java:144)
	at org.apache.commons.lang3.builder.ShortPrefixToStringStyleTest.testObject(ShortPrefixToStringStyleTest.java:70)

testPerson(org.apache.commons.lang3.builder.ShortPrefixToStringStyleTest)  Time elapsed: 0.001 sec  <<< FAILURE!
org.junit.ComparisonFailure: expected:<...c,age=45,smoker=true[]]> but was:<...c,age=45,smoker=true[,<null>]>
	at org.junit.Assert.assertEquals(Assert.java:115)
	at org.junit.Assert.assertEquals(Assert.java:144)
	at org.apache.commons.lang3.builder.ShortPrefixToStringStyleTest.testPerson(ShortPrefixToStringStyleTest.java:91)

testAppendSuper(org.apache.commons.lang3.builder.ShortPrefixToStringStyleTest)  Time elapsed: 0 sec  <<< FAILURE!
org.junit.ComparisonFailure: expected:<Integer[[]]> but was:<Integer[[<null>]>
	at org.junit.Assert.assertEquals(Assert.java:115)
	at org.junit.Assert.assertEquals(Assert.java:144)
	at org.apache.commons.lang3.builder.ShortPrefixToStringStyleTest.testAppendSuper(ShortPrefixToStringStyleTest.java:58)

Running org.apache.commons.lang3.builder.DiffResultTest
Tests run: 9, Failures: 1, Errors: 0, Skipped: 0, Time elapsed: 0.007 sec <<< FAILURE! - in org.apache.commons.lang3.builder.DiffResultTest
testToStringOutput(org.apache.commons.lang3.builder.DiffResultTest)  Time elapsed: 0.005 sec  <<< FAILURE!
org.junit.ComparisonFailure: expected:<...mptyClass[test=false[] differs from DiffResultTest.EmptyClass[test=true]]> but was:<...mptyClass[test=false[,<null> differs from DiffResultTest.EmptyClass[test=true,<null>]>
	at org.junit.Assert.assertEquals(Assert.java:115)
	at org.junit.Assert.assertEquals(Assert.java:144)
	at org.apache.commons.lang3.builder.DiffResultTest.testToStringOutput(DiffResultTest.java:95)

Running org.apache.commons.lang3.builder.CompareToBuilderTest
Tests run: 48, Failures: 0, Errors: 0, Skipped: 0, Time elapsed: 0.019 sec - in org.apache.commons.lang3.builder.CompareToBuilderTest
Running org.apache.commons.lang3.builder.MultilineRecursiveToStringStyleTest
Tests run: 10, Failures: 10, Errors: 0, Skipped: 0, Time elapsed: 0.014 sec <<< FAILURE! - in org.apache.commons.lang3.builder.MultilineRecursiveToStringStyleTest
doubleArray(org.apache.commons.lang3.builder.MultilineRecursiveToStringStyleTest)  Time elapsed: 0.001 sec  <<< FAILURE!
org.junit.ComparisonFailure: expected:<...  stringArray=<null>[
]]> but was:<...  stringArray=<null>[,
  <null>]>
	at org.junit.Assert.assertEquals(Assert.java:115)
	at org.junit.Assert.assertEquals(Assert.java:144)
	at org.apache.commons.lang3.builder.MultilineRecursiveToStringStyleTest.doubleArray(MultilineRecursiveToStringStyleTest.java:167)

stringArray(org.apache.commons.lang3.builder.MultilineRecursiveToStringStyleTest)  Time elapsed: 0.001 sec  <<< FAILURE!
org.junit.ComparisonFailure: expected:<...y={
    a,
    A
  }[
]]> but was:<...y={
    a,
    A
  }[,
  <null>]>
	at org.junit.Assert.assertEquals(Assert.java:115)
	at org.junit.Assert.assertEquals(Assert.java:144)
	at org.apache.commons.lang3.builder.MultilineRecursiveToStringStyleTest.stringArray(MultilineRecursiveToStringStyleTest.java:203)

simpleObject(org.apache.commons.lang3.builder.MultilineRecursiveToStringStyleTest)  Time elapsed: 0.001 sec  <<< FAILURE!
org.junit.ComparisonFailure: expected:<...0,
  date=2014.10.15[
]]> but was:<...0,
  date=2014.10.15[,
  <null>]>
	at org.junit.Assert.assertEquals(Assert.java:115)
	at org.junit.Assert.assertEquals(Assert.java:144)
	at org.apache.commons.lang3.builder.MultilineRecursiveToStringStyleTest.simpleObject(MultilineRecursiveToStringStyleTest.java:42)

longArray(org.apache.commons.lang3.builder.MultilineRecursiveToStringStyleTest)  Time elapsed: 0.001 sec  <<< FAILURE!
org.junit.ComparisonFailure: expected:<...  stringArray=<null>[
]]> but was:<...  stringArray=<null>[,
  <null>]>
	at org.junit.Assert.assertEquals(Assert.java:115)
	at org.junit.Assert.assertEquals(Assert.java:144)
	at org.apache.commons.lang3.builder.MultilineRecursiveToStringStyleTest.longArray(MultilineRecursiveToStringStyleTest.java:185)

intArray(org.apache.commons.lang3.builder.MultilineRecursiveToStringStyleTest)  Time elapsed: 0 sec  <<< FAILURE!
org.junit.ComparisonFailure: expected:<...  stringArray=<null>[
]]> but was:<...  stringArray=<null>[,
  <null>]>
	at org.junit.Assert.assertEquals(Assert.java:115)
	at org.junit.Assert.assertEquals(Assert.java:144)
	at org.apache.commons.lang3.builder.MultilineRecursiveToStringStyleTest.intArray(MultilineRecursiveToStringStyleTest.java:149)

nestedAndArray(org.apache.commons.lang3.builder.MultilineRecursiveToStringStyleTest)  Time elapsed: 0.002 sec  <<< FAILURE!
org.junit.ComparisonFailure: expected:<...     date=2014.10.14[
    ],
    org.apache.commons.lang3.builder.MultilineRecursiveToStringStyleTest$Transaction@6d8c8c3e[
      amount=50.0,
      date=2014.10.15
    ]
  }
]]> but was:<...     date=2014.10.14[,
      <null>,
    org.apache.commons.lang3.builder.MultilineRecursiveToStringStyleTest$Transaction@6d8c8c3e[
      amount=50.0,
      date=2014.10.15,
      <null>
  },
  <null>]>
	at org.junit.Assert.assertEquals(Assert.java:115)
	at org.junit.Assert.assertEquals(Assert.java:144)
	at org.apache.commons.lang3.builder.MultilineRecursiveToStringStyleTest.nestedAndArray(MultilineRecursiveToStringStyleTest.java:80)

charArray(org.apache.commons.lang3.builder.MultilineRecursiveToStringStyleTest)  Time elapsed: 0 sec  <<< FAILURE!
org.junit.ComparisonFailure: expected:<...  stringArray=<null>[
]]> but was:<...  stringArray=<null>[,
  <null>]>
	at org.junit.Assert.assertEquals(Assert.java:115)
	at org.junit.Assert.assertEquals(Assert.java:144)
	at org.apache.commons.lang3.builder.MultilineRecursiveToStringStyleTest.charArray(MultilineRecursiveToStringStyleTest.java:131)

nestedElements(org.apache.commons.lang3.builder.MultilineRecursiveToStringStyleTest)  Time elapsed: 0.001 sec  <<< FAILURE!
org.junit.ComparisonFailure: expected:<...1[
    name=ASF Bank[
  ],
  accounts=<null>
]]> but was:<...1[
    name=ASF Bank[,
    <null>,
  accounts=<null>,
  <null>]>
	at org.junit.Assert.assertEquals(Assert.java:115)
	at org.junit.Assert.assertEquals(Assert.java:144)
	at org.apache.commons.lang3.builder.MultilineRecursiveToStringStyleTest.nestedElements(MultilineRecursiveToStringStyleTest.java:57)

boolArray(org.apache.commons.lang3.builder.MultilineRecursiveToStringStyleTest)  Time elapsed: 0.001 sec  <<< FAILURE!
org.junit.ComparisonFailure: expected:<...  stringArray=<null>[
]]> but was:<...  stringArray=<null>[,
  <null>]>
	at org.junit.Assert.assertEquals(Assert.java:115)
	at org.junit.Assert.assertEquals(Assert.java:144)
	at org.apache.commons.lang3.builder.MultilineRecursiveToStringStyleTest.boolArray(MultilineRecursiveToStringStyleTest.java:113)

noArray(org.apache.commons.lang3.builder.MultilineRecursiveToStringStyleTest)  Time elapsed: 0.006 sec  <<< FAILURE!
org.junit.ComparisonFailure: expected:<...  stringArray=<null>[
]]> but was:<...  stringArray=<null>[,
  <null>]>
	at org.junit.Assert.assertEquals(Assert.java:115)
	at org.junit.Assert.assertEquals(Assert.java:144)
	at org.apache.commons.lang3.builder.MultilineRecursiveToStringStyleTest.noArray(MultilineRecursiveToStringStyleTest.java:94)

Running org.apache.commons.lang3.builder.RecursiveToStringStyleTest
Tests run: 8, Failures: 8, Errors: 0, Skipped: 0, Time elapsed: 0.001 sec <<< FAILURE! - in org.apache.commons.lang3.builder.RecursiveToStringStyleTest
testObjectArray(org.apache.commons.lang3.builder.RecursiveToStringStyleTest)  Time elapsed: 0 sec  <<< FAILURE!
org.junit.ComparisonFailure: expected:<...c7b[{<null>,5,{3,6}}[]]> but was:<...c7b[{<null>,5,{3,6}}[,<null>]>
	at org.junit.Assert.assertEquals(Assert.java:115)
	at org.junit.Assert.assertEquals(Assert.java:144)
	at org.apache.commons.lang3.builder.RecursiveToStringStyleTest.testObjectArray(RecursiveToStringStyleTest.java:107)

testBlank(org.apache.commons.lang3.builder.RecursiveToStringStyleTest)  Time elapsed: 0.001 sec  <<< FAILURE!
org.junit.ComparisonFailure: expected:<...ng.Integer@3edcbc7b[[]]> but was:<...ng.Integer@3edcbc7b[[<null>]>
	at org.junit.Assert.assertEquals(Assert.java:115)
	at org.junit.Assert.assertEquals(Assert.java:144)
	at org.apache.commons.lang3.builder.RecursiveToStringStyleTest.testBlank(RecursiveToStringStyleTest.java:52)

testLong(org.apache.commons.lang3.builder.RecursiveToStringStyleTest)  Time elapsed: 0 sec  <<< FAILURE!
org.junit.ComparisonFailure: expected:<...g.Integer@3edcbc7b[3[]]> but was:<...g.Integer@3edcbc7b[3[,<null>]>
	at org.junit.Assert.assertEquals(Assert.java:115)
	at org.junit.Assert.assertEquals(Assert.java:144)
	at org.apache.commons.lang3.builder.RecursiveToStringStyleTest.testLong(RecursiveToStringStyleTest.java:99)

testLongArrayArray(org.apache.commons.lang3.builder.RecursiveToStringStyleTest)  Time elapsed: 0 sec  <<< FAILURE!
org.junit.ComparisonFailure: expected:<...b[{{1,2},<null>,{5}}[]]> but was:<...b[{{1,2},<null>,{5}}[,<null>]>
	at org.junit.Assert.assertEquals(Assert.java:115)
	at org.junit.Assert.assertEquals(Assert.java:144)
	at org.apache.commons.lang3.builder.RecursiveToStringStyleTest.testLongArrayArray(RecursiveToStringStyleTest.java:127)

testLongArray(org.apache.commons.lang3.builder.RecursiveToStringStyleTest)  Time elapsed: 0 sec  <<< FAILURE!
org.junit.ComparisonFailure: expected:<...@3edcbc7b[{1,2,-3,4}[]]> but was:<...@3edcbc7b[{1,2,-3,4}[,<null>]>
	at org.junit.Assert.assertEquals(Assert.java:115)
	at org.junit.Assert.assertEquals(Assert.java:144)
	at org.apache.commons.lang3.builder.RecursiveToStringStyleTest.testLongArray(RecursiveToStringStyleTest.java:117)

testObject(org.apache.commons.lang3.builder.RecursiveToStringStyleTest)  Time elapsed: 0 sec  <<< FAILURE!
org.junit.ComparisonFailure: expected:<...eger@3edcbc7b[<null>[]]> but was:<...eger@3edcbc7b[<null>[,<null>]>
	at org.junit.Assert.assertEquals(Assert.java:115)
	at org.junit.Assert.assertEquals(Assert.java:144)
	at org.apache.commons.lang3.builder.RecursiveToStringStyleTest.testObject(RecursiveToStringStyleTest.java:69)

testPerson(org.apache.commons.lang3.builder.RecursiveToStringStyleTest)  Time elapsed: 0 sec  <<< FAILURE!
org.junit.ComparisonFailure: expected:<...907c4e[title=Manager[]]]> but was:<...907c4e[title=Manager[,<null>,<null>]>
	at org.junit.Assert.assertEquals(Assert.java:115)
	at org.junit.Assert.assertEquals(Assert.java:144)
	at org.apache.commons.lang3.builder.RecursiveToStringStyleTest.testPerson(RecursiveToStringStyleTest.java:93)

testAppendSuper(org.apache.commons.lang3.builder.RecursiveToStringStyleTest)  Time elapsed: 0 sec  <<< FAILURE!
org.junit.ComparisonFailure: expected:<...ng.Integer@3edcbc7b[[]]> but was:<...ng.Integer@3edcbc7b[[<null>]>
	at org.junit.Assert.assertEquals(Assert.java:115)
	at org.junit.Assert.assertEquals(Assert.java:144)
	at org.apache.commons.lang3.builder.RecursiveToStringStyleTest.testAppendSuper(RecursiveToStringStyleTest.java:57)

Running org.apache.commons.lang3.builder.DefaultToStringStyleTest
Tests run: 8, Failures: 8, Errors: 0, Skipped: 0, Time elapsed: 0.001 sec <<< FAILURE! - in org.apache.commons.lang3.builder.DefaultToStringStyleTest
testObjectArray(org.apache.commons.lang3.builder.DefaultToStringStyleTest)  Time elapsed: 0 sec  <<< FAILURE!
org.junit.ComparisonFailure: expected:<...c7b[{<null>,5,{3,6}}[]]> but was:<...c7b[{<null>,5,{3,6}}[,<null>]>
	at org.junit.Assert.assertEquals(Assert.java:115)
	at org.junit.Assert.assertEquals(Assert.java:144)
	at org.apache.commons.lang3.builder.DefaultToStringStyleTest.testObjectArray(DefaultToStringStyleTest.java:104)

testBlank(org.apache.commons.lang3.builder.DefaultToStringStyleTest)  Time elapsed: 0 sec  <<< FAILURE!
org.junit.ComparisonFailure: expected:<...ng.Integer@3edcbc7b[[]]> but was:<...ng.Integer@3edcbc7b[[<null>]>
	at org.junit.Assert.assertEquals(Assert.java:115)
	at org.junit.Assert.assertEquals(Assert.java:144)
	at org.apache.commons.lang3.builder.DefaultToStringStyleTest.testBlank(DefaultToStringStyleTest.java:53)

testLong(org.apache.commons.lang3.builder.DefaultToStringStyleTest)  Time elapsed: 0 sec  <<< FAILURE!
org.junit.ComparisonFailure: expected:<...g.Integer@3edcbc7b[3[]]> but was:<...g.Integer@3edcbc7b[3[,<null>]>
	at org.junit.Assert.assertEquals(Assert.java:115)
	at org.junit.Assert.assertEquals(Assert.java:144)
	at org.apache.commons.lang3.builder.DefaultToStringStyleTest.testLong(DefaultToStringStyleTest.java:96)

testLongArrayArray(org.apache.commons.lang3.builder.DefaultToStringStyleTest)  Time elapsed: 0 sec  <<< FAILURE!
org.junit.ComparisonFailure: expected:<...b[{{1,2},<null>,{5}}[]]> but was:<...b[{{1,2},<null>,{5}}[,<null>]>
	at org.junit.Assert.assertEquals(Assert.java:115)
	at org.junit.Assert.assertEquals(Assert.java:144)
	at org.apache.commons.lang3.builder.DefaultToStringStyleTest.testLongArrayArray(DefaultToStringStyleTest.java:124)

testLongArray(org.apache.commons.lang3.builder.DefaultToStringStyleTest)  Time elapsed: 0 sec  <<< FAILURE!
org.junit.ComparisonFailure: expected:<...@3edcbc7b[{1,2,-3,4}[]]> but was:<...@3edcbc7b[{1,2,-3,4}[,<null>]>
	at org.junit.Assert.assertEquals(Assert.java:115)
	at org.junit.Assert.assertEquals(Assert.java:144)
	at org.apache.commons.lang3.builder.DefaultToStringStyleTest.testLongArray(DefaultToStringStyleTest.java:114)

testObject(org.apache.commons.lang3.builder.DefaultToStringStyleTest)  Time elapsed: 0 sec  <<< FAILURE!
org.junit.ComparisonFailure: expected:<...eger@3edcbc7b[<null>[]]> but was:<...eger@3edcbc7b[<null>[,<null>]>
	at org.junit.Assert.assertEquals(Assert.java:115)
	at org.junit.Assert.assertEquals(Assert.java:144)
	at org.apache.commons.lang3.builder.DefaultToStringStyleTest.testObject(DefaultToStringStyleTest.java:70)

testPerson(org.apache.commons.lang3.builder.DefaultToStringStyleTest)  Time elapsed: 0 sec  <<< FAILURE!
org.junit.ComparisonFailure: expected:<...,age=33,smoker=false[]]> but was:<...,age=33,smoker=false[,<null>]>
	at org.junit.Assert.assertEquals(Assert.java:115)
	at org.junit.Assert.assertEquals(Assert.java:144)
	at org.apache.commons.lang3.builder.DefaultToStringStyleTest.testPerson(DefaultToStringStyleTest.java:91)

testAppendSuper(org.apache.commons.lang3.builder.DefaultToStringStyleTest)  Time elapsed: 0 sec  <<< FAILURE!
org.junit.ComparisonFailure: expected:<...ng.Integer@3edcbc7b[[]]> but was:<...ng.Integer@3edcbc7b[[<null>]>
	at org.junit.Assert.assertEquals(Assert.java:115)
	at org.junit.Assert.assertEquals(Assert.java:144)
	at org.apache.commons.lang3.builder.DefaultToStringStyleTest.testAppendSuper(DefaultToStringStyleTest.java:58)

Running org.apache.commons.lang3.builder.ReflectionToStringBuilderExcludeTest
Tests run: 11, Failures: 0, Errors: 0, Skipped: 0, Time elapsed: 0.001 sec - in org.apache.commons.lang3.builder.ReflectionToStringBuilderExcludeTest
Running org.apache.commons.lang3.builder.StandardToStringStyleTest
Tests run: 8, Failures: 8, Errors: 0, Skipped: 0, Time elapsed: 0.001 sec <<< FAILURE! - in org.apache.commons.lang3.builder.StandardToStringStyleTest
testObjectArray(org.apache.commons.lang3.builder.StandardToStringStyleTest)  Time elapsed: 0 sec  <<< FAILURE!
org.junit.ComparisonFailure: expected:<...[[%NULL%, 5, [3, 6]][]]> but was:<...[[%NULL%, 5, [3, 6]][,%NULL%]>
	at org.junit.Assert.assertEquals(Assert.java:115)
	at org.junit.Assert.assertEquals(Assert.java:144)
	at org.apache.commons.lang3.builder.StandardToStringStyleTest.testObjectArray(StandardToStringStyleTest.java:119)

testBlank(org.apache.commons.lang3.builder.StandardToStringStyleTest)  Time elapsed: 0 sec  <<< FAILURE!
org.junit.ComparisonFailure: expected:<Integer[[]]> but was:<Integer[[%NULL%]>
	at org.junit.Assert.assertEquals(Assert.java:115)
	at org.junit.Assert.assertEquals(Assert.java:144)
	at org.apache.commons.lang3.builder.StandardToStringStyleTest.testBlank(StandardToStringStyleTest.java:68)

testLong(org.apache.commons.lang3.builder.StandardToStringStyleTest)  Time elapsed: 0 sec  <<< FAILURE!
org.junit.ComparisonFailure: expected:<Integer[3[]]> but was:<Integer[3[,%NULL%]>
	at org.junit.Assert.assertEquals(Assert.java:115)
	at org.junit.Assert.assertEquals(Assert.java:144)
	at org.apache.commons.lang3.builder.StandardToStringStyleTest.testLong(StandardToStringStyleTest.java:111)

testLongArrayArray(org.apache.commons.lang3.builder.StandardToStringStyleTest)  Time elapsed: 0 sec  <<< FAILURE!
org.junit.ComparisonFailure: expected:<...[1, 2], %NULL%, [5]][]]> but was:<...[1, 2], %NULL%, [5]][,%NULL%]>
	at org.junit.Assert.assertEquals(Assert.java:115)
	at org.junit.Assert.assertEquals(Assert.java:144)
	at org.apache.commons.lang3.builder.StandardToStringStyleTest.testLongArrayArray(StandardToStringStyleTest.java:139)

testLongArray(org.apache.commons.lang3.builder.StandardToStringStyleTest)  Time elapsed: 0 sec  <<< FAILURE!
org.junit.ComparisonFailure: expected:<...nteger[[1, 2, -3, 4][]]> but was:<...nteger[[1, 2, -3, 4][,%NULL%]>
	at org.junit.Assert.assertEquals(Assert.java:115)
	at org.junit.Assert.assertEquals(Assert.java:144)
	at org.apache.commons.lang3.builder.StandardToStringStyleTest.testLongArray(StandardToStringStyleTest.java:129)

testObject(org.apache.commons.lang3.builder.StandardToStringStyleTest)  Time elapsed: 0.001 sec  <<< FAILURE!
org.junit.ComparisonFailure: expected:<Integer[%NULL%[]]> but was:<Integer[%NULL%[,%NULL%]>
	at org.junit.Assert.assertEquals(Assert.java:115)
	at org.junit.Assert.assertEquals(Assert.java:144)
	at org.apache.commons.lang3.builder.StandardToStringStyleTest.testObject(StandardToStringStyleTest.java:85)

testPerson(org.apache.commons.lang3.builder.StandardToStringStyleTest)  Time elapsed: 0 sec  <<< FAILURE!
org.junit.ComparisonFailure: expected:<...,age=19,smoker=false[]]> but was:<...,age=19,smoker=false[,%NULL%]>
	at org.junit.Assert.assertEquals(Assert.java:115)
	at org.junit.Assert.assertEquals(Assert.java:144)
	at org.apache.commons.lang3.builder.StandardToStringStyleTest.testPerson(StandardToStringStyleTest.java:106)

testAppendSuper(org.apache.commons.lang3.builder.StandardToStringStyleTest)  Time elapsed: 0 sec  <<< FAILURE!
org.junit.ComparisonFailure: expected:<Integer[[]]> but was:<Integer[[%NULL%]>
	at org.junit.Assert.assertEquals(Assert.java:115)
	at org.junit.Assert.assertEquals(Assert.java:144)
	at org.apache.commons.lang3.builder.StandardToStringStyleTest.testAppendSuper(StandardToStringStyleTest.java:73)

Running org.apache.commons.lang3.builder.ToStringStyleTest
Tests run: 12, Failures: 0, Errors: 0, Skipped: 0, Time elapsed: 0.009 sec - in org.apache.commons.lang3.builder.ToStringStyleTest
Running org.apache.commons.lang3.builder.DiffTest
Tests run: 4, Failures: 0, Errors: 0, Skipped: 0, Time elapsed: 0 sec - in org.apache.commons.lang3.builder.DiffTest
Running org.apache.commons.lang3.builder.SimpleToStringStyleTest
Tests run: 8, Failures: 8, Errors: 0, Skipped: 0, Time elapsed: 0.001 sec <<< FAILURE! - in org.apache.commons.lang3.builder.SimpleToStringStyleTest
testObjectArray(org.apache.commons.lang3.builder.SimpleToStringStyleTest)  Time elapsed: 0 sec  <<< FAILURE!
org.junit.ComparisonFailure: expected:<{<null>,5,{3,6}}[]> but was:<{<null>,5,{3,6}}[,<null>]>
	at org.junit.Assert.assertEquals(Assert.java:115)
	at org.junit.Assert.assertEquals(Assert.java:144)
	at org.apache.commons.lang3.builder.SimpleToStringStyleTest.testObjectArray(SimpleToStringStyleTest.java:102)

testBlank(org.apache.commons.lang3.builder.SimpleToStringStyleTest)  Time elapsed: 0 sec  <<< FAILURE!
org.junit.ComparisonFailure: expected:<[]> but was:<[<null>]>
	at org.junit.Assert.assertEquals(Assert.java:115)
	at org.junit.Assert.assertEquals(Assert.java:144)
	at org.apache.commons.lang3.builder.SimpleToStringStyleTest.testBlank(SimpleToStringStyleTest.java:52)

testLong(org.apache.commons.lang3.builder.SimpleToStringStyleTest)  Time elapsed: 0 sec  <<< FAILURE!
org.junit.ComparisonFailure: expected:<3[]> but was:<3[,<null>]>
	at org.junit.Assert.assertEquals(Assert.java:115)
	at org.junit.Assert.assertEquals(Assert.java:144)
	at org.apache.commons.lang3.builder.SimpleToStringStyleTest.testLong(SimpleToStringStyleTest.java:94)

testLongArrayArray(org.apache.commons.lang3.builder.SimpleToStringStyleTest)  Time elapsed: 0 sec  <<< FAILURE!
org.junit.ComparisonFailure: expected:<{{1,2},<null>,{5}}[]> but was:<{{1,2},<null>,{5}}[,<null>]>
	at org.junit.Assert.assertEquals(Assert.java:115)
	at org.junit.Assert.assertEquals(Assert.java:144)
	at org.apache.commons.lang3.builder.SimpleToStringStyleTest.testLongArrayArray(SimpleToStringStyleTest.java:122)

testLongArray(org.apache.commons.lang3.builder.SimpleToStringStyleTest)  Time elapsed: 0 sec  <<< FAILURE!
org.junit.ComparisonFailure: expected:<{1,2,-3,4}[]> but was:<{1,2,-3,4}[,<null>]>
	at org.junit.Assert.assertEquals(Assert.java:115)
	at org.junit.Assert.assertEquals(Assert.java:144)
	at org.apache.commons.lang3.builder.SimpleToStringStyleTest.testLongArray(SimpleToStringStyleTest.java:112)

testObject(org.apache.commons.lang3.builder.SimpleToStringStyleTest)  Time elapsed: 0 sec  <<< FAILURE!
org.junit.ComparisonFailure: expected:<<null>[]> but was:<<null>[,<null>]>
	at org.junit.Assert.assertEquals(Assert.java:115)
	at org.junit.Assert.assertEquals(Assert.java:144)
	at org.apache.commons.lang3.builder.SimpleToStringStyleTest.testObject(SimpleToStringStyleTest.java:69)

testPerson(org.apache.commons.lang3.builder.SimpleToStringStyleTest)  Time elapsed: 0 sec  <<< FAILURE!
org.junit.ComparisonFailure: expected:<...e Q. Public,47,false[]> but was:<...e Q. Public,47,false[,<null>]>
	at org.junit.Assert.assertEquals(Assert.java:115)
	at org.junit.Assert.assertEquals(Assert.java:144)
	at org.apache.commons.lang3.builder.SimpleToStringStyleTest.testPerson(SimpleToStringStyleTest.java:89)

testAppendSuper(org.apache.commons.lang3.builder.SimpleToStringStyleTest)  Time elapsed: 0 sec  <<< FAILURE!
org.junit.ComparisonFailure: expected:<[]> but was:<[<null>]>
	at org.junit.Assert.assertEquals(Assert.java:115)
	at org.junit.Assert.assertEquals(Assert.java:144)
	at org.apache.commons.lang3.builder.SimpleToStringStyleTest.testAppendSuper(SimpleToStringStyleTest.java:57)

Running org.apache.commons.lang3.builder.MultiLineToStringStyleTest
Tests run: 8, Failures: 8, Errors: 0, Skipped: 0, Time elapsed: 0.001 sec <<< FAILURE! - in org.apache.commons.lang3.builder.MultiLineToStringStyleTest
testObjectArray(org.apache.commons.lang3.builder.MultiLineToStringStyleTest)  Time elapsed: 0 sec  <<< FAILURE!
org.junit.ComparisonFailure: expected:<...
  {<null>,5,{3,6}}
[]]> but was:<...
  {<null>,5,{3,6}}
[  <null>]>
	at org.junit.Assert.assertEquals(Assert.java:115)
	at org.junit.Assert.assertEquals(Assert.java:144)
	at org.apache.commons.lang3.builder.MultiLineToStringStyleTest.testObjectArray(MultiLineToStringStyleTest.java:105)

testBlank(org.apache.commons.lang3.builder.MultiLineToStringStyleTest)  Time elapsed: 0 sec  <<< FAILURE!
org.junit.ComparisonFailure: expected:<...g.Integer@3edcbc7b[
[]]> but was:<...g.Integer@3edcbc7b[
[  <null>]>
	at org.junit.Assert.assertEquals(Assert.java:115)
	at org.junit.Assert.assertEquals(Assert.java:144)
	at org.apache.commons.lang3.builder.MultiLineToStringStyleTest.testBlank(MultiLineToStringStyleTest.java:54)

testLong(org.apache.commons.lang3.builder.MultiLineToStringStyleTest)  Time elapsed: 0 sec  <<< FAILURE!
org.junit.ComparisonFailure: expected:<...teger@3edcbc7b[
  3
[]]> but was:<...teger@3edcbc7b[
  3
[  <null>]>
	at org.junit.Assert.assertEquals(Assert.java:115)
	at org.junit.Assert.assertEquals(Assert.java:144)
	at org.apache.commons.lang3.builder.MultiLineToStringStyleTest.testLong(MultiLineToStringStyleTest.java:97)

testLongArrayArray(org.apache.commons.lang3.builder.MultiLineToStringStyleTest)  Time elapsed: 0 sec  <<< FAILURE!
org.junit.ComparisonFailure: expected:<... {{1,2},<null>,{5}}
[]]> but was:<... {{1,2},<null>,{5}}
[  <null>]>
	at org.junit.Assert.assertEquals(Assert.java:115)
	at org.junit.Assert.assertEquals(Assert.java:144)
	at org.apache.commons.lang3.builder.MultiLineToStringStyleTest.testLongArrayArray(MultiLineToStringStyleTest.java:125)

testLongArray(org.apache.commons.lang3.builder.MultiLineToStringStyleTest)  Time elapsed: 0 sec  <<< FAILURE!
org.junit.ComparisonFailure: expected:<...cbc7b[
  {1,2,-3,4}
[]]> but was:<...cbc7b[
  {1,2,-3,4}
[  <null>]>
	at org.junit.Assert.assertEquals(Assert.java:115)
	at org.junit.Assert.assertEquals(Assert.java:144)
	at org.apache.commons.lang3.builder.MultiLineToStringStyleTest.testLongArray(MultiLineToStringStyleTest.java:115)

testObject(org.apache.commons.lang3.builder.MultiLineToStringStyleTest)  Time elapsed: 0 sec  <<< FAILURE!
org.junit.ComparisonFailure: expected:<...@3edcbc7b[
  <null>
[]]> but was:<...@3edcbc7b[
  <null>
[  <null>]>
	at org.junit.Assert.assertEquals(Assert.java:115)
	at org.junit.Assert.assertEquals(Assert.java:144)
	at org.apache.commons.lang3.builder.MultiLineToStringStyleTest.testObject(MultiLineToStringStyleTest.java:71)

testPerson(org.apache.commons.lang3.builder.MultiLineToStringStyleTest)  Time elapsed: 0 sec  <<< FAILURE!
org.junit.ComparisonFailure: expected:<...ge=25
  smoker=true
[]]> but was:<...ge=25
  smoker=true
[  <null>]>
	at org.junit.Assert.assertEquals(Assert.java:115)
	at org.junit.Assert.assertEquals(Assert.java:144)
	at org.apache.commons.lang3.builder.MultiLineToStringStyleTest.testPerson(MultiLineToStringStyleTest.java:92)

testAppendSuper(org.apache.commons.lang3.builder.MultiLineToStringStyleTest)  Time elapsed: 0 sec  <<< FAILURE!
org.junit.ComparisonFailure: expected:<...g.Integer@3edcbc7b[
[]]> but was:<...g.Integer@3edcbc7b[
[  <null>]>
	at org.junit.Assert.assertEquals(Assert.java:115)
	at org.junit.Assert.assertEquals(Assert.java:144)
	at org.apache.commons.lang3.builder.MultiLineToStringStyleTest.testAppendSuper(MultiLineToStringStyleTest.java:59)

Running org.apache.commons.lang3.builder.ToStringStyleConcurrencyTest
Tests run: 3, Failures: 0, Errors: 0, Skipped: 0, Time elapsed: 4.159 sec - in org.apache.commons.lang3.builder.ToStringStyleConcurrencyTest
Running org.apache.commons.lang3.builder.ReflectionToStringBuilderMutateInspectConcurrencyTest
Tests run: 1, Failures: 0, Errors: 0, Skipped: 1, Time elapsed: 0.001 sec - in org.apache.commons.lang3.builder.ReflectionToStringBuilderMutateInspectConcurrencyTest
Running org.apache.commons.lang3.builder.ToStringBuilderTest
Tests run: 142, Failures: 75, Errors: 67, Skipped: 0, Time elapsed: 0.103 sec <<< FAILURE! - in org.apache.commons.lang3.builder.ToStringBuilderTest
test_setUpToClass_valid(org.apache.commons.lang3.builder.ToStringBuilderTest)  Time elapsed: 0.002 sec  <<< FAILURE!
java.lang.AssertionError: Expected null, actual: {org.apache.commons.lang3.builder.DiffResultTest$SimpleClass@55ab936b=null, org.apache.commons.lang3.builder.DiffResultTest$SimpleClass@6e9c45d0=null} expected null, but was:<{org.apache.commons.lang3.builder.DiffResultTest$SimpleClass@55ab936b=null, org.apache.commons.lang3.builder.DiffResultTest$SimpleClass@6e9c45d0=null}>
	at org.junit.Assert.fail(Assert.java:88)
	at org.junit.Assert.failNotNull(Assert.java:755)
	at org.junit.Assert.assertNull(Assert.java:737)
	at org.apache.commons.lang3.builder.ToStringBuilderTest.validateNullToStringStyleRegistry(ToStringBuilderTest.java:595)
	at org.apache.commons.lang3.builder.ToStringBuilderTest.after(ToStringBuilderTest.java:48)

testCharArray(org.apache.commons.lang3.builder.ToStringBuilderTest)  Time elapsed: 0.001 sec  <<< FAILURE!
org.junit.ComparisonFailure: expected:<...r@3edcbc7b[{A,2,_,D}[]]> but was:<...r@3edcbc7b[{A,2,_,D}[,<null>]>
	at org.junit.Assert.assertEquals(Assert.java:115)
	at org.junit.Assert.assertEquals(Assert.java:144)
	at org.apache.commons.lang3.builder.ToStringBuilderTest.testCharArray(ToStringBuilderTest.java:767)

testCharArray(org.apache.commons.lang3.builder.ToStringBuilderTest)  Time elapsed: 0.001 sec  <<< FAILURE!
java.lang.AssertionError: Expected null, actual: {org.apache.commons.lang3.builder.DiffResultTest$SimpleClass@55ab936b=null, org.apache.commons.lang3.builder.DiffResultTest$SimpleClass@6e9c45d0=null, 5=null} expected null, but was:<{org.apache.commons.lang3.builder.DiffResultTest$SimpleClass@55ab936b=null, org.apache.commons.lang3.builder.DiffResultTest$SimpleClass@6e9c45d0=null, 5=null}>
	at org.junit.Assert.fail(Assert.java:88)
	at org.junit.Assert.failNotNull(Assert.java:755)
	at org.junit.Assert.assertNull(Assert.java:737)
	at org.apache.commons.lang3.builder.ToStringBuilderTest.validateNullToStringStyleRegistry(ToStringBuilderTest.java:595)
	at org.apache.commons.lang3.builder.ToStringBuilderTest.after(ToStringBuilderTest.java:48)

testReflectionHierarchyArrayList(org.apache.commons.lang3.builder.ToStringBuilderTest)  Time elapsed: 0.009 sec  <<< ERROR!
org.junit.AssumptionViolatedException: got: <false>, expected: is <true>
	at org.junit.Assume.assumeThat(Assume.java:95)
	at org.junit.Assume.assumeTrue(Assume.java:41)
	at org.junit.Assume.assumeFalse(Assume.java:48)
	at org.apache.commons.lang3.builder.ToStringBuilderTest.testReflectionHierarchyArrayList(ToStringBuilderTest.java:319)

testReflectionHierarchyArrayList(org.apache.commons.lang3.builder.ToStringBuilderTest)  Time elapsed: 0.009 sec  <<< FAILURE!
java.lang.AssertionError: Expected null, actual: {org.apache.commons.lang3.builder.DiffResultTest$SimpleClass@55ab936b=null, org.apache.commons.lang3.builder.DiffResultTest$SimpleClass@6e9c45d0=null, 5=null} expected null, but was:<{org.apache.commons.lang3.builder.DiffResultTest$SimpleClass@55ab936b=null, org.apache.commons.lang3.builder.DiffResultTest$SimpleClass@6e9c45d0=null, 5=null}>
	at org.junit.Assert.fail(Assert.java:88)
	at org.junit.Assert.failNotNull(Assert.java:755)
	at org.junit.Assert.assertNull(Assert.java:737)
	at org.apache.commons.lang3.builder.ToStringBuilderTest.validateNullToStringStyleRegistry(ToStringBuilderTest.java:595)
	at org.apache.commons.lang3.builder.ToStringBuilderTest.after(ToStringBuilderTest.java:48)

testReflectionNull(org.apache.commons.lang3.builder.ToStringBuilderTest)  Time elapsed: 0.001 sec  <<< FAILURE!
java.lang.AssertionError: Expected null, actual: {org.apache.commons.lang3.builder.DiffResultTest$SimpleClass@55ab936b=null, org.apache.commons.lang3.builder.DiffResultTest$SimpleClass@6e9c45d0=null, 5=null} expected null, but was:<{org.apache.commons.lang3.builder.DiffResultTest$SimpleClass@55ab936b=null, org.apache.commons.lang3.builder.DiffResultTest$SimpleClass@6e9c45d0=null, 5=null}>
	at org.junit.Assert.fail(Assert.java:88)
	at org.junit.Assert.failNotNull(Assert.java:755)
	at org.junit.Assert.assertNull(Assert.java:737)
	at org.apache.commons.lang3.builder.ToStringBuilderTest.validateNullToStringStyleRegistry(ToStringBuilderTest.java:595)
	at org.apache.commons.lang3.builder.ToStringBuilderTest.after(ToStringBuilderTest.java:48)

testDoubleArrayArray(org.apache.commons.lang3.builder.ToStringBuilderTest)  Time elapsed: 0 sec  <<< FAILURE!
org.junit.ComparisonFailure: expected:<...29686},<null>,{NaN}}[]]> but was:<...29686},<null>,{NaN}}[,<null>]>
	at org.junit.Assert.assertEquals(Assert.java:115)
	at org.junit.Assert.assertEquals(Assert.java:144)
	at org.apache.commons.lang3.builder.ToStringBuilderTest.testDoubleArrayArray(ToStringBuilderTest.java:857)

testDoubleArrayArray(org.apache.commons.lang3.builder.ToStringBuilderTest)  Time elapsed: 0.001 sec  <<< FAILURE!
java.lang.AssertionError: Expected null, actual: {org.apache.commons.lang3.builder.DiffResultTest$SimpleClass@55ab936b=null, org.apache.commons.lang3.builder.DiffResultTest$SimpleClass@6e9c45d0=null, 5=null} expected null, but was:<{org.apache.commons.lang3.builder.DiffResultTest$SimpleClass@55ab936b=null, org.apache.commons.lang3.builder.DiffResultTest$SimpleClass@6e9c45d0=null, 5=null}>
	at org.junit.Assert.fail(Assert.java:88)
	at org.junit.Assert.failNotNull(Assert.java:755)
	at org.junit.Assert.assertNull(Assert.java:737)
	at org.apache.commons.lang3.builder.ToStringBuilderTest.validateNullToStringStyleRegistry(ToStringBuilderTest.java:595)
	at org.apache.commons.lang3.builder.ToStringBuilderTest.after(ToStringBuilderTest.java:48)

testReflectionBoolean(org.apache.commons.lang3.builder.ToStringBuilderTest)  Time elapsed: 0 sec  <<< FAILURE!
org.junit.ComparisonFailure: expected:<...@6b6a4b18[value=true[]]> but was:<...@6b6a4b18[value=true[,<null>]>
	at org.junit.Assert.assertEquals(Assert.java:115)
	at org.junit.Assert.assertEquals(Assert.java:144)
	at org.apache.commons.lang3.builder.ToStringBuilderTest.testReflectionBoolean(ToStringBuilderTest.java:116)

testReflectionBoolean(org.apache.commons.lang3.builder.ToStringBuilderTest)  Time elapsed: 0.001 sec  <<< FAILURE!
java.lang.AssertionError: Expected null, actual: {org.apache.commons.lang3.builder.DiffResultTest$SimpleClass@55ab936b=null, org.apache.commons.lang3.builder.DiffResultTest$SimpleClass@6e9c45d0=null, 5=null} expected null, but was:<{org.apache.commons.lang3.builder.DiffResultTest$SimpleClass@55ab936b=null, org.apache.commons.lang3.builder.DiffResultTest$SimpleClass@6e9c45d0=null, 5=null}>
	at org.junit.Assert.fail(Assert.java:88)
	at org.junit.Assert.failNotNull(Assert.java:755)
	at org.junit.Assert.assertNull(Assert.java:737)
	at org.apache.commons.lang3.builder.ToStringBuilderTest.validateNullToStringStyleRegistry(ToStringBuilderTest.java:595)
	at org.apache.commons.lang3.builder.ToStringBuilderTest.after(ToStringBuilderTest.java:48)

testObjectArray(org.apache.commons.lang3.builder.ToStringBuilderTest)  Time elapsed: 0 sec  <<< FAILURE!
org.junit.ComparisonFailure: expected:<...c7b[{<null>,5,{3,6}}[]]> but was:<...c7b[{<null>,5,{3,6}}[,<null>]>
	at org.junit.Assert.assertEquals(Assert.java:115)
	at org.junit.Assert.assertEquals(Assert.java:144)
	at org.apache.commons.lang3.builder.ToStringBuilderTest.testObjectArray(ToStringBuilderTest.java:717)

testObjectArray(org.apache.commons.lang3.builder.ToStringBuilderTest)  Time elapsed: 0 sec  <<< FAILURE!
java.lang.AssertionError: Expected null, actual: {org.apache.commons.lang3.builder.DiffResultTest$SimpleClass@55ab936b=null, org.apache.commons.lang3.builder.DiffResultTest$SimpleClass@6e9c45d0=null} expected null, but was:<{org.apache.commons.lang3.builder.DiffResultTest$SimpleClass@55ab936b=null, org.apache.commons.lang3.builder.DiffResultTest$SimpleClass@6e9c45d0=null}>
	at org.junit.Assert.fail(Assert.java:88)
	at org.junit.Assert.failNotNull(Assert.java:755)
	at org.junit.Assert.assertNull(Assert.java:737)
	at org.apache.commons.lang3.builder.ToStringBuilderTest.validateNullToStringStyleRegistry(ToStringBuilderTest.java:595)
	at org.apache.commons.lang3.builder.ToStringBuilderTest.after(ToStringBuilderTest.java:48)

testObjectBuild(org.apache.commons.lang3.builder.ToStringBuilderTest)  Time elapsed: 0.001 sec  <<< FAILURE!
org.junit.ComparisonFailure: expected:<...eger@3edcbc7b[<null>[]]> but was:<...eger@3edcbc7b[<null>[,<null>]>
	at org.junit.Assert.assertEquals(Assert.java:115)
	at org.junit.Assert.assertEquals(Assert.java:144)
	at org.apache.commons.lang3.builder.ToStringBuilderTest.testObjectBuild(ToStringBuilderTest.java:641)

testObjectBuild(org.apache.commons.lang3.builder.ToStringBuilderTest)  Time elapsed: 0.001 sec  <<< FAILURE!
java.lang.AssertionError: Expected null, actual: {org.apache.commons.lang3.builder.DiffResultTest$SimpleClass@55ab936b=null, org.apache.commons.lang3.builder.DiffResultTest$SimpleClass@6e9c45d0=null, 5=null} expected null, but was:<{org.apache.commons.lang3.builder.DiffResultTest$SimpleClass@55ab936b=null, org.apache.commons.lang3.builder.DiffResultTest$SimpleClass@6e9c45d0=null, 5=null}>
	at org.junit.Assert.fail(Assert.java:88)
	at org.junit.Assert.failNotNull(Assert.java:755)
	at org.junit.Assert.assertNull(Assert.java:737)
	at org.apache.commons.lang3.builder.ToStringBuilderTest.validateNullToStringStyleRegistry(ToStringBuilderTest.java:595)
	at org.apache.commons.lang3.builder.ToStringBuilderTest.after(ToStringBuilderTest.java:48)

testObjectCycle(org.apache.commons.lang3.builder.ToStringBuilderTest)  Time elapsed: 0.001 sec  <<< FAILURE!
org.junit.ComparisonFailure: expected:<...ObjectCycle@6ed0cc34[]]]> but was:<...ObjectCycle@6ed0cc34[,<null>,<null>]>
	at org.junit.Assert.assertEquals(Assert.java:115)
	at org.junit.Assert.assertEquals(Assert.java:144)
	at org.apache.commons.lang3.builder.ToStringBuilderTest.testObjectCycle(ToStringBuilderTest.java:892)

testObjectCycle(org.apache.commons.lang3.builder.ToStringBuilderTest)  Time elapsed: 0.002 sec  <<< ERROR!
java.util.ConcurrentModificationException: null
	at java.util.WeakHashMap$HashIterator.nextEntry(WeakHashMap.java:882)
	at java.util.WeakHashMap$EntryIterator.next(WeakHashMap.java:921)
	at java.util.WeakHashMap$EntryIterator.next(WeakHashMap.java:919)
	at java.util.AbstractMap.toString(AbstractMap.java:518)
	at java.lang.String.valueOf(String.java:2847)
	at java.lang.StringBuilder.append(StringBuilder.java:128)
	at org.apache.commons.lang3.builder.ToStringBuilderTest.validateNullToStringStyleRegistry(ToStringBuilderTest.java:595)
	at org.apache.commons.lang3.builder.ToStringBuilderTest.after(ToStringBuilderTest.java:48)

testReflectionHierarchy(org.apache.commons.lang3.builder.ToStringBuilderTest)  Time elapsed: 0.001 sec  <<< FAILURE!
org.junit.ComparisonFailure: expected:<...ixtureA@536b4ad8[a=a[]]> but was:<...ixtureA@536b4ad8[a=a[,<null>]>
	at org.junit.Assert.assertEquals(Assert.java:115)
	at org.junit.Assert.assertEquals(Assert.java:144)
	at org.apache.commons.lang3.builder.ToStringBuilderTest.testReflectionHierarchy(ToStringBuilderTest.java:338)

testReflectionHierarchy(org.apache.commons.lang3.builder.ToStringBuilderTest)  Time elapsed: 0.001 sec  <<< ERROR!
java.util.ConcurrentModificationException: null
	at java.util.WeakHashMap$HashIterator.nextEntry(WeakHashMap.java:882)
	at java.util.WeakHashMap$EntryIterator.next(WeakHashMap.java:921)
	at java.util.WeakHashMap$EntryIterator.next(WeakHashMap.java:919)
	at java.util.AbstractMap.toString(AbstractMap.java:518)
	at java.lang.String.valueOf(String.java:2847)
	at java.lang.StringBuilder.append(StringBuilder.java:128)
	at org.apache.commons.lang3.builder.ToStringBuilderTest.validateNullToStringStyleRegistry(ToStringBuilderTest.java:595)
	at org.apache.commons.lang3.builder.ToStringBuilderTest.after(ToStringBuilderTest.java:48)

testSelfInstanceTwoVarsReflectionObjectCycle(org.apache.commons.lang3.builder.ToStringBuilderTest)  Time elapsed: 0.001 sec  <<< FAILURE!
org.junit.ComparisonFailure: expected:<...rType=The Other Type[]]> but was:<...rType=The Other Type[,<null>]>
	at org.junit.Assert.assertEquals(Assert.java:115)
	at org.junit.Assert.assertEquals(Assert.java:144)
	at org.apache.commons.lang3.builder.ToStringBuilderTest.testSelfInstanceTwoVarsReflectionObjectCycle(ToStringBuilderTest.java:549)

testSelfInstanceTwoVarsReflectionObjectCycle(org.apache.commons.lang3.builder.ToStringBuilderTest)  Time elapsed: 0.001 sec  <<< ERROR!
java.util.ConcurrentModificationException: null
	at java.util.WeakHashMap$HashIterator.nextEntry(WeakHashMap.java:882)
	at java.util.WeakHashMap$EntryIterator.next(WeakHashMap.java:921)
	at java.util.WeakHashMap$EntryIterator.next(WeakHashMap.java:919)
	at java.util.AbstractMap.toString(AbstractMap.java:518)
	at java.lang.String.valueOf(String.java:2847)
	at java.lang.StringBuilder.append(StringBuilder.java:128)
	at org.apache.commons.lang3.builder.ToStringBuilderTest.validateNullToStringStyleRegistry(ToStringBuilderTest.java:595)
	at org.apache.commons.lang3.builder.ToStringBuilderTest.after(ToStringBuilderTest.java:48)

testAppendToStringUsingMultiLineStyle(org.apache.commons.lang3.builder.ToStringBuilderTest)  Time elapsed: 0.001 sec  <<< ERROR!
java.util.ConcurrentModificationException: null
	at java.util.WeakHashMap$HashIterator.nextEntry(WeakHashMap.java:882)
	at java.util.WeakHashMap$EntryIterator.next(WeakHashMap.java:921)
	at java.util.WeakHashMap$EntryIterator.next(WeakHashMap.java:919)
	at java.util.AbstractMap.toString(AbstractMap.java:518)
	at java.lang.String.valueOf(String.java:2847)
	at java.lang.StringBuilder.append(StringBuilder.java:128)
	at org.apache.commons.lang3.builder.ToStringBuilderTest.validateNullToStringStyleRegistry(ToStringBuilderTest.java:595)
	at org.apache.commons.lang3.builder.ToStringBuilderTest.after(ToStringBuilderTest.java:48)

testShortArrayArray(org.apache.commons.lang3.builder.ToStringBuilderTest)  Time elapsed: 0.001 sec  <<< FAILURE!
org.junit.ComparisonFailure: expected:<...b[{{1,2},<null>,{5}}[]]> but was:<...b[{{1,2},<null>,{5}}[,<null>]>
	at org.junit.Assert.assertEquals(Assert.java:115)
	at org.junit.Assert.assertEquals(Assert.java:144)
	at org.apache.commons.lang3.builder.ToStringBuilderTest.testShortArrayArray(ToStringBuilderTest.java:827)

testShortArrayArray(org.apache.commons.lang3.builder.ToStringBuilderTest)  Time elapsed: 0.001 sec  <<< ERROR!
java.util.ConcurrentModificationException: null
	at java.util.WeakHashMap$HashIterator.nextEntry(WeakHashMap.java:882)
	at java.util.WeakHashMap$EntryIterator.next(WeakHashMap.java:921)
	at java.util.WeakHashMap$EntryIterator.next(WeakHashMap.java:919)
	at java.util.AbstractMap.toString(AbstractMap.java:518)
	at java.lang.String.valueOf(String.java:2847)
	at java.lang.StringBuilder.append(StringBuilder.java:128)
	at org.apache.commons.lang3.builder.ToStringBuilderTest.validateNullToStringStyleRegistry(ToStringBuilderTest.java:595)
	at org.apache.commons.lang3.builder.ToStringBuilderTest.after(ToStringBuilderTest.java:48)

testBooleanArrayArray(org.apache.commons.lang3.builder.ToStringBuilderTest)  Time elapsed: 0.001 sec  <<< FAILURE!
org.junit.ComparisonFailure: expected:<...lse},<null>,{false}}[]]> but was:<...lse},<null>,{false}}[,<null>]>
	at org.junit.Assert.assertEquals(Assert.java:115)
	at org.junit.Assert.assertEquals(Assert.java:144)
	at org.apache.commons.lang3.builder.ToStringBuilderTest.testBooleanArrayArray(ToStringBuilderTest.java:877)

testBooleanArrayArray(org.apache.commons.lang3.builder.ToStringBuilderTest)  Time elapsed: 0.001 sec  <<< ERROR!
java.util.ConcurrentModificationException: null
	at java.util.WeakHashMap$HashIterator.nextEntry(WeakHashMap.java:882)
	at java.util.WeakHashMap$EntryIterator.next(WeakHashMap.java:921)
	at java.util.WeakHashMap$EntryIterator.next(WeakHashMap.java:919)
	at java.util.AbstractMap.toString(AbstractMap.java:518)
	at java.lang.String.valueOf(String.java:2847)
	at java.lang.StringBuilder.append(StringBuilder.java:128)
	at org.apache.commons.lang3.builder.ToStringBuilderTest.validateNullToStringStyleRegistry(ToStringBuilderTest.java:595)
	at org.apache.commons.lang3.builder.ToStringBuilderTest.after(ToStringBuilderTest.java:48)

testFloatArray(org.apache.commons.lang3.builder.ToStringBuilderTest)  Time elapsed: 0.001 sec  <<< FAILURE!
org.junit.ComparisonFailure: expected:<...2.9876,-3.00001,4.3}[]]> but was:<...2.9876,-3.00001,4.3}[,<null>]>
	at org.junit.Assert.assertEquals(Assert.java:115)
	at org.junit.Assert.assertEquals(Assert.java:144)
	at org.apache.commons.lang3.builder.ToStringBuilderTest.testFloatArray(ToStringBuilderTest.java:787)

testFloatArray(org.apache.commons.lang3.builder.ToStringBuilderTest)  Time elapsed: 0.001 sec  <<< ERROR!
java.util.ConcurrentModificationException: null
	at java.util.WeakHashMap$HashIterator.nextEntry(WeakHashMap.java:882)
	at java.util.WeakHashMap$EntryIterator.next(WeakHashMap.java:921)
	at java.util.WeakHashMap$EntryIterator.next(WeakHashMap.java:919)
	at java.util.AbstractMap.toString(AbstractMap.java:518)
	at java.lang.String.valueOf(String.java:2847)
	at java.lang.StringBuilder.append(StringBuilder.java:128)
	at org.apache.commons.lang3.builder.ToStringBuilderTest.validateNullToStringStyleRegistry(ToStringBuilderTest.java:595)
	at org.apache.commons.lang3.builder.ToStringBuilderTest.after(ToStringBuilderTest.java:48)

testInt(org.apache.commons.lang3.builder.ToStringBuilderTest)  Time elapsed: 0.001 sec  <<< FAILURE!
org.junit.ComparisonFailure: expected:<...g.Integer@3edcbc7b[3[]]> but was:<...g.Integer@3edcbc7b[3[,<null>]>
	at org.junit.Assert.assertEquals(Assert.java:115)
	at org.junit.Assert.assertEquals(Assert.java:144)
	at org.apache.commons.lang3.builder.ToStringBuilderTest.testInt(ToStringBuilderTest.java:665)

testInt(org.apache.commons.lang3.builder.ToStringBuilderTest)  Time elapsed: 0.001 sec  <<< ERROR!
java.util.ConcurrentModificationException: null
	at java.util.WeakHashMap$HashIterator.nextEntry(WeakHashMap.java:882)
	at java.util.WeakHashMap$EntryIterator.next(WeakHashMap.java:921)
	at java.util.WeakHashMap$EntryIterator.next(WeakHashMap.java:919)
	at java.util.AbstractMap.toString(AbstractMap.java:518)
	at java.lang.String.valueOf(String.java:2847)
	at java.lang.StringBuilder.append(StringBuilder.java:128)
	at org.apache.commons.lang3.builder.ToStringBuilderTest.validateNullToStringStyleRegistry(ToStringBuilderTest.java:595)
	at org.apache.commons.lang3.builder.ToStringBuilderTest.after(ToStringBuilderTest.java:48)

testByteArray(org.apache.commons.lang3.builder.ToStringBuilderTest)  Time elapsed: 0 sec  <<< FAILURE!
org.junit.ComparisonFailure: expected:<...@3edcbc7b[{1,2,-3,4}[]]> but was:<...@3edcbc7b[{1,2,-3,4}[,<null>]>
	at org.junit.Assert.assertEquals(Assert.java:115)
	at org.junit.Assert.assertEquals(Assert.java:144)
	at org.apache.commons.lang3.builder.ToStringBuilderTest.testByteArray(ToStringBuilderTest.java:757)

testByteArray(org.apache.commons.lang3.builder.ToStringBuilderTest)  Time elapsed: 0 sec  <<< ERROR!
java.util.ConcurrentModificationException: null
	at java.util.WeakHashMap$HashIterator.nextEntry(WeakHashMap.java:882)
	at java.util.WeakHashMap$EntryIterator.next(WeakHashMap.java:921)
	at java.util.WeakHashMap$EntryIterator.next(WeakHashMap.java:919)
	at java.util.AbstractMap.toString(AbstractMap.java:518)
	at java.lang.String.valueOf(String.java:2847)
	at java.lang.StringBuilder.append(StringBuilder.java:128)
	at org.apache.commons.lang3.builder.ToStringBuilderTest.validateNullToStringStyleRegistry(ToStringBuilderTest.java:595)
	at org.apache.commons.lang3.builder.ToStringBuilderTest.after(ToStringBuilderTest.java:48)

testReflectionArrayCycle(org.apache.commons.lang3.builder.ToStringBuilderTest)  Time elapsed: 0 sec  <<< FAILURE!
org.junit.ComparisonFailure: expected:<...ng.Object;@756535fa}[]]> but was:<...ng.Object;@756535fa}[<null>]>
	at org.junit.Assert.assertEquals(Assert.java:115)
	at org.junit.Assert.assertEquals(Assert.java:144)
	at org.apache.commons.lang3.builder.ToStringBuilderTest.testReflectionArrayCycle(ToStringBuilderTest.java:402)

testReflectionArrayCycle(org.apache.commons.lang3.builder.ToStringBuilderTest)  Time elapsed: 0 sec  <<< ERROR!
java.util.ConcurrentModificationException: null
	at java.util.WeakHashMap$HashIterator.nextEntry(WeakHashMap.java:882)
	at java.util.WeakHashMap$EntryIterator.next(WeakHashMap.java:921)
	at java.util.WeakHashMap$EntryIterator.next(WeakHashMap.java:919)
	at java.util.AbstractMap.toString(AbstractMap.java:518)
	at java.lang.String.valueOf(String.java:2847)
	at java.lang.StringBuilder.append(StringBuilder.java:128)
	at org.apache.commons.lang3.builder.ToStringBuilderTest.validateNullToStringStyleRegistry(ToStringBuilderTest.java:595)
	at org.apache.commons.lang3.builder.ToStringBuilderTest.after(ToStringBuilderTest.java:48)

testReflectionLongArrayArray(org.apache.commons.lang3.builder.ToStringBuilderTest)  Time elapsed: 0 sec  <<< FAILURE!
org.junit.ComparisonFailure: expected:<...c[{{1,2},<null>,{5}}[]]> but was:<...c[{{1,2},<null>,{5}}[<null>]>
	at org.junit.Assert.assertEquals(Assert.java:115)
	at org.junit.Assert.assertEquals(Assert.java:144)
	at org.apache.commons.lang3.builder.ToStringBuilderTest.testReflectionLongArrayArray(ToStringBuilderTest.java:253)

testReflectionLongArrayArray(org.apache.commons.lang3.builder.ToStringBuilderTest)  Time elapsed: 0 sec  <<< ERROR!
java.util.ConcurrentModificationException: null
	at java.util.WeakHashMap$HashIterator.nextEntry(WeakHashMap.java:882)
	at java.util.WeakHashMap$EntryIterator.next(WeakHashMap.java:921)
	at java.util.WeakHashMap$EntryIterator.next(WeakHashMap.java:919)
	at java.util.AbstractMap.toString(AbstractMap.java:518)
	at java.lang.String.valueOf(String.java:2847)
	at java.lang.StringBuilder.append(StringBuilder.java:128)
	at org.apache.commons.lang3.builder.ToStringBuilderTest.validateNullToStringStyleRegistry(ToStringBuilderTest.java:595)
	at org.apache.commons.lang3.builder.ToStringBuilderTest.after(ToStringBuilderTest.java:48)

testBlank(org.apache.commons.lang3.builder.ToStringBuilderTest)  Time elapsed: 0.001 sec  <<< FAILURE!
org.junit.ComparisonFailure: expected:<...ng.Integer@3edcbc7b[[]]> but was:<...ng.Integer@3edcbc7b[[<null>]>
	at org.junit.Assert.assertEquals(Assert.java:115)
	at org.junit.Assert.assertEquals(Assert.java:144)
	at org.apache.commons.lang3.builder.ToStringBuilderTest.testBlank(ToStringBuilderTest.java:89)

testBlank(org.apache.commons.lang3.builder.ToStringBuilderTest)  Time elapsed: 0.001 sec  <<< ERROR!
java.util.ConcurrentModificationException: null
	at java.util.WeakHashMap$HashIterator.nextEntry(WeakHashMap.java:882)
	at java.util.WeakHashMap$EntryIterator.next(WeakHashMap.java:921)
	at java.util.WeakHashMap$EntryIterator.next(WeakHashMap.java:919)
	at java.util.AbstractMap.toString(AbstractMap.java:518)
	at java.lang.String.valueOf(String.java:2847)
	at java.lang.StringBuilder.append(StringBuilder.java:128)
	at org.apache.commons.lang3.builder.ToStringBuilderTest.validateNullToStringStyleRegistry(ToStringBuilderTest.java:595)
	at org.apache.commons.lang3.builder.ToStringBuilderTest.after(ToStringBuilderTest.java:48)

testFloat(org.apache.commons.lang3.builder.ToStringBuilderTest)  Time elapsed: 0.001 sec  <<< FAILURE!
org.junit.ComparisonFailure: expected:<...Integer@3edcbc7b[3.2[]]> but was:<...Integer@3edcbc7b[3.2[,<null>]>
	at org.junit.Assert.assertEquals(Assert.java:115)
	at org.junit.Assert.assertEquals(Assert.java:144)
	at org.apache.commons.lang3.builder.ToStringBuilderTest.testFloat(ToStringBuilderTest.java:701)

testFloat(org.apache.commons.lang3.builder.ToStringBuilderTest)  Time elapsed: 0.001 sec  <<< ERROR!
java.util.ConcurrentModificationException: null
	at java.util.WeakHashMap$HashIterator.nextEntry(WeakHashMap.java:882)
	at java.util.WeakHashMap$EntryIterator.next(WeakHashMap.java:921)
	at java.util.WeakHashMap$EntryIterator.next(WeakHashMap.java:919)
	at java.util.AbstractMap.toString(AbstractMap.java:518)
	at java.lang.String.valueOf(String.java:2847)
	at java.lang.StringBuilder.append(StringBuilder.java:128)
	at org.apache.commons.lang3.builder.ToStringBuilderTest.validateNullToStringStyleRegistry(ToStringBuilderTest.java:595)
	at org.apache.commons.lang3.builder.ToStringBuilderTest.after(ToStringBuilderTest.java:48)

testShort(org.apache.commons.lang3.builder.ToStringBuilderTest)  Time elapsed: 0.001 sec  <<< FAILURE!
org.junit.ComparisonFailure: expected:<...g.Integer@3edcbc7b[3[]]> but was:<...g.Integer@3edcbc7b[3[,<null>]>
	at org.junit.Assert.assertEquals(Assert.java:115)
	at org.junit.Assert.assertEquals(Assert.java:144)
	at org.apache.commons.lang3.builder.ToStringBuilderTest.testShort(ToStringBuilderTest.java:672)

testShort(org.apache.commons.lang3.builder.ToStringBuilderTest)  Time elapsed: 0.001 sec  <<< ERROR!
java.util.ConcurrentModificationException: null
	at java.util.WeakHashMap$HashIterator.nextEntry(WeakHashMap.java:882)
	at java.util.WeakHashMap$EntryIterator.next(WeakHashMap.java:921)
	at java.util.WeakHashMap$EntryIterator.next(WeakHashMap.java:919)
	at java.util.AbstractMap.toString(AbstractMap.java:518)
	at java.lang.String.valueOf(String.java:2847)
	at java.lang.StringBuilder.append(StringBuilder.java:128)
	at org.apache.commons.lang3.builder.ToStringBuilderTest.validateNullToStringStyleRegistry(ToStringBuilderTest.java:595)
	at org.apache.commons.lang3.builder.ToStringBuilderTest.after(ToStringBuilderTest.java:48)

testReflectionArrayArrayCycle(org.apache.commons.lang3.builder.ToStringBuilderTest)  Time elapsed: 0 sec  <<< FAILURE!
org.junit.ComparisonFailure: expected:<...ng.Object;@4bc7bc0}}[]]> but was:<...ng.Object;@4bc7bc0}}[<null>]>
	at org.junit.Assert.assertEquals(Assert.java:115)
	at org.junit.Assert.assertEquals(Assert.java:144)
	at org.apache.commons.lang3.builder.ToStringBuilderTest.testReflectionArrayArrayCycle(ToStringBuilderTest.java:432)

testReflectionArrayArrayCycle(org.apache.commons.lang3.builder.ToStringBuilderTest)  Time elapsed: 0.001 sec  <<< ERROR!
java.util.ConcurrentModificationException: null
	at java.util.WeakHashMap$HashIterator.nextEntry(WeakHashMap.java:882)
	at java.util.WeakHashMap$EntryIterator.next(WeakHashMap.java:921)
	at java.util.WeakHashMap$EntryIterator.next(WeakHashMap.java:919)
	at java.util.AbstractMap.toString(AbstractMap.java:518)
	at java.lang.String.valueOf(String.java:2847)
	at java.lang.StringBuilder.append(StringBuilder.java:128)
	at org.apache.commons.lang3.builder.ToStringBuilderTest.validateNullToStringStyleRegistry(ToStringBuilderTest.java:595)
	at org.apache.commons.lang3.builder.ToStringBuilderTest.after(ToStringBuilderTest.java:48)

testByte(org.apache.commons.lang3.builder.ToStringBuilderTest)  Time elapsed: 0 sec  <<< FAILURE!
org.junit.ComparisonFailure: expected:<...g.Integer@3edcbc7b[3[]]> but was:<...g.Integer@3edcbc7b[3[,<null>]>
	at org.junit.Assert.assertEquals(Assert.java:115)
	at org.junit.Assert.assertEquals(Assert.java:144)
	at org.apache.commons.lang3.builder.ToStringBuilderTest.testByte(ToStringBuilderTest.java:686)

testByte(org.apache.commons.lang3.builder.ToStringBuilderTest)  Time elapsed: 0.001 sec  <<< ERROR!
java.util.ConcurrentModificationException: null
	at java.util.WeakHashMap$HashIterator.nextEntry(WeakHashMap.java:882)
	at java.util.WeakHashMap$EntryIterator.next(WeakHashMap.java:921)
	at java.util.WeakHashMap$EntryIterator.next(WeakHashMap.java:919)
	at java.util.AbstractMap.toString(AbstractMap.java:518)
	at java.lang.String.valueOf(String.java:2847)
	at java.lang.StringBuilder.append(StringBuilder.java:128)
	at org.apache.commons.lang3.builder.ToStringBuilderTest.validateNullToStringStyleRegistry(ToStringBuilderTest.java:595)
	at org.apache.commons.lang3.builder.ToStringBuilderTest.after(ToStringBuilderTest.java:48)

testChar(org.apache.commons.lang3.builder.ToStringBuilderTest)  Time elapsed: 0 sec  <<< FAILURE!
org.junit.ComparisonFailure: expected:<...g.Integer@3edcbc7b[A[]]> but was:<...g.Integer@3edcbc7b[A[,<null>]>
	at org.junit.Assert.assertEquals(Assert.java:115)
	at org.junit.Assert.assertEquals(Assert.java:144)
	at org.apache.commons.lang3.builder.ToStringBuilderTest.testChar(ToStringBuilderTest.java:679)

testChar(org.apache.commons.lang3.builder.ToStringBuilderTest)  Time elapsed: 0 sec  <<< ERROR!
java.util.ConcurrentModificationException: null
	at java.util.WeakHashMap$HashIterator.nextEntry(WeakHashMap.java:882)
	at java.util.WeakHashMap$EntryIterator.next(WeakHashMap.java:921)
	at java.util.WeakHashMap$EntryIterator.next(WeakHashMap.java:919)
	at java.util.AbstractMap.toString(AbstractMap.java:518)
	at java.lang.String.valueOf(String.java:2847)
	at java.lang.StringBuilder.append(StringBuilder.java:128)
	at org.apache.commons.lang3.builder.ToStringBuilderTest.validateNullToStringStyleRegistry(ToStringBuilderTest.java:595)
	at org.apache.commons.lang3.builder.ToStringBuilderTest.after(ToStringBuilderTest.java:48)

testLong(org.apache.commons.lang3.builder.ToStringBuilderTest)  Time elapsed: 0.001 sec  <<< FAILURE!
org.junit.ComparisonFailure: expected:<...g.Integer@3edcbc7b[3[]]> but was:<...g.Integer@3edcbc7b[3[,<null>]>
	at org.junit.Assert.assertEquals(Assert.java:115)
	at org.junit.Assert.assertEquals(Assert.java:144)
	at org.apache.commons.lang3.builder.ToStringBuilderTest.testLong(ToStringBuilderTest.java:657)

testLong(org.apache.commons.lang3.builder.ToStringBuilderTest)  Time elapsed: 0.001 sec  <<< ERROR!
java.util.ConcurrentModificationException: null
	at java.util.WeakHashMap$HashIterator.nextEntry(WeakHashMap.java:882)
	at java.util.WeakHashMap$EntryIterator.next(WeakHashMap.java:921)
	at java.util.WeakHashMap$EntryIterator.next(WeakHashMap.java:919)
	at java.util.AbstractMap.toString(AbstractMap.java:518)
	at java.lang.String.valueOf(String.java:2847)
	at java.lang.StringBuilder.append(StringBuilder.java:128)
	at org.apache.commons.lang3.builder.ToStringBuilderTest.validateNullToStringStyleRegistry(ToStringBuilderTest.java:595)
	at org.apache.commons.lang3.builder.ToStringBuilderTest.after(ToStringBuilderTest.java:48)

testReflectionFloatArray(org.apache.commons.lang3.builder.ToStringBuilderTest)  Time elapsed: 0.001 sec  <<< FAILURE!
org.junit.ComparisonFailure: expected:<...2.9876,-3.00001,4.3}[]]> but was:<...2.9876,-3.00001,4.3}[<null>]>
	at org.junit.Assert.assertEquals(Assert.java:115)
	at org.junit.Assert.assertEquals(Assert.java:144)
	at org.apache.commons.lang3.builder.ToStringBuilderTest.testReflectionFloatArray(ToStringBuilderTest.java:223)

testReflectionFloatArray(org.apache.commons.lang3.builder.ToStringBuilderTest)  Time elapsed: 0.001 sec  <<< ERROR!
java.util.ConcurrentModificationException: null
	at java.util.WeakHashMap$HashIterator.nextEntry(WeakHashMap.java:882)
	at java.util.WeakHashMap$EntryIterator.next(WeakHashMap.java:921)
	at java.util.WeakHashMap$EntryIterator.next(WeakHashMap.java:919)
	at java.util.AbstractMap.toString(AbstractMap.java:518)
	at java.lang.String.valueOf(String.java:2847)
	at java.lang.StringBuilder.append(StringBuilder.java:128)
	at org.apache.commons.lang3.builder.ToStringBuilderTest.validateNullToStringStyleRegistry(ToStringBuilderTest.java:595)
	at org.apache.commons.lang3.builder.ToStringBuilderTest.after(ToStringBuilderTest.java:48)

testLongArrayArray(org.apache.commons.lang3.builder.ToStringBuilderTest)  Time elapsed: 0.001 sec  <<< FAILURE!
org.junit.ComparisonFailure: expected:<...b[{{1,2},<null>,{5}}[]]> but was:<...b[{{1,2},<null>,{5}}[,<null>]>
	at org.junit.Assert.assertEquals(Assert.java:115)
	at org.junit.Assert.assertEquals(Assert.java:144)
	at org.apache.commons.lang3.builder.ToStringBuilderTest.testLongArrayArray(ToStringBuilderTest.java:807)

testLongArrayArray(org.apache.commons.lang3.builder.ToStringBuilderTest)  Time elapsed: 0.001 sec  <<< ERROR!
java.util.ConcurrentModificationException: null
	at java.util.WeakHashMap$HashIterator.nextEntry(WeakHashMap.java:882)
	at java.util.WeakHashMap$EntryIterator.next(WeakHashMap.java:921)
	at java.util.WeakHashMap$EntryIterator.next(WeakHashMap.java:919)
	at java.util.AbstractMap.toString(AbstractMap.java:518)
	at java.lang.String.valueOf(String.java:2847)
	at java.lang.StringBuilder.append(StringBuilder.java:128)
	at org.apache.commons.lang3.builder.ToStringBuilderTest.validateNullToStringStyleRegistry(ToStringBuilderTest.java:595)
	at org.apache.commons.lang3.builder.ToStringBuilderTest.after(ToStringBuilderTest.java:48)

test_setUpToClass_invalid(org.apache.commons.lang3.builder.ToStringBuilderTest)  Time elapsed: 0 sec  <<< ERROR!
java.util.ConcurrentModificationException: null
	at java.util.WeakHashMap$HashIterator.nextEntry(WeakHashMap.java:882)
	at java.util.WeakHashMap$EntryIterator.next(WeakHashMap.java:921)
	at java.util.WeakHashMap$EntryIterator.next(WeakHashMap.java:919)
	at java.util.AbstractMap.toString(AbstractMap.java:518)
	at java.lang.String.valueOf(String.java:2847)
	at java.lang.StringBuilder.append(StringBuilder.java:128)
	at org.apache.commons.lang3.builder.ToStringBuilderTest.validateNullToStringStyleRegistry(ToStringBuilderTest.java:595)
	at org.apache.commons.lang3.builder.ToStringBuilderTest.after(ToStringBuilderTest.java:48)

testBoolean(org.apache.commons.lang3.builder.ToStringBuilderTest)  Time elapsed: 0.001 sec  <<< FAILURE!
org.junit.ComparisonFailure: expected:<...nteger@3edcbc7b[true[]]> but was:<...nteger@3edcbc7b[true[,<null>]>
	at org.junit.Assert.assertEquals(Assert.java:115)
	at org.junit.Assert.assertEquals(Assert.java:144)
	at org.apache.commons.lang3.builder.ToStringBuilderTest.testBoolean(ToStringBuilderTest.java:708)

testBoolean(org.apache.commons.lang3.builder.ToStringBuilderTest)  Time elapsed: 0.001 sec  <<< ERROR!
java.util.ConcurrentModificationException: null
	at java.util.WeakHashMap$HashIterator.nextEntry(WeakHashMap.java:882)
	at java.util.WeakHashMap$EntryIterator.next(WeakHashMap.java:921)
	at java.util.WeakHashMap$EntryIterator.next(WeakHashMap.java:919)
	at java.util.AbstractMap.toString(AbstractMap.java:518)
	at java.lang.String.valueOf(String.java:2847)
	at java.lang.StringBuilder.append(StringBuilder.java:128)
	at org.apache.commons.lang3.builder.ToStringBuilderTest.validateNullToStringStyleRegistry(ToStringBuilderTest.java:595)
	at org.apache.commons.lang3.builder.ToStringBuilderTest.after(ToStringBuilderTest.java:48)

testReflectionDoubleArrayArray(org.apache.commons.lang3.builder.ToStringBuilderTest)  Time elapsed: 0.001 sec  <<< FAILURE!
org.junit.ComparisonFailure: expected:<...29686},<null>,{NaN}}[]]> but was:<...29686},<null>,{NaN}}[<null>]>
	at org.junit.Assert.assertEquals(Assert.java:115)
	at org.junit.Assert.assertEquals(Assert.java:144)
	at org.apache.commons.lang3.builder.ToStringBuilderTest.testReflectionDoubleArrayArray(ToStringBuilderTest.java:298)

testReflectionDoubleArrayArray(org.apache.commons.lang3.builder.ToStringBuilderTest)  Time elapsed: 0.001 sec  <<< ERROR!
java.util.ConcurrentModificationException: null
	at java.util.WeakHashMap$HashIterator.nextEntry(WeakHashMap.java:882)
	at java.util.WeakHashMap$EntryIterator.next(WeakHashMap.java:921)
	at java.util.WeakHashMap$EntryIterator.next(WeakHashMap.java:919)
	at java.util.AbstractMap.toString(AbstractMap.java:518)
	at java.lang.String.valueOf(String.java:2847)
	at java.lang.StringBuilder.append(StringBuilder.java:128)
	at org.apache.commons.lang3.builder.ToStringBuilderTest.validateNullToStringStyleRegistry(ToStringBuilderTest.java:595)
	at org.apache.commons.lang3.builder.ToStringBuilderTest.after(ToStringBuilderTest.java:48)

testReflectionBooleanArray(org.apache.commons.lang3.builder.ToStringBuilderTest)  Time elapsed: 0 sec  <<< FAILURE!
org.junit.ComparisonFailure: expected:<...7[{true,false,false}[]]> but was:<...7[{true,false,false}[<null>]>
	at org.junit.Assert.assertEquals(Assert.java:115)
	at org.junit.Assert.assertEquals(Assert.java:144)
	at org.apache.commons.lang3.builder.ToStringBuilderTest.testReflectionBooleanArray(ToStringBuilderTest.java:232)

testReflectionBooleanArray(org.apache.commons.lang3.builder.ToStringBuilderTest)  Time elapsed: 0.001 sec  <<< ERROR!
java.util.ConcurrentModificationException: null
	at java.util.WeakHashMap$HashIterator.nextEntry(WeakHashMap.java:882)
	at java.util.WeakHashMap$EntryIterator.next(WeakHashMap.java:921)
	at java.util.WeakHashMap$EntryIterator.next(WeakHashMap.java:919)
	at java.util.AbstractMap.toString(AbstractMap.java:518)
	at java.lang.String.valueOf(String.java:2847)
	at java.lang.StringBuilder.append(StringBuilder.java:128)
	at org.apache.commons.lang3.builder.ToStringBuilderTest.validateNullToStringStyleRegistry(ToStringBuilderTest.java:595)
	at org.apache.commons.lang3.builder.ToStringBuilderTest.after(ToStringBuilderTest.java:48)

testReflectionInteger(org.apache.commons.lang3.builder.ToStringBuilderTest)  Time elapsed: 0 sec  <<< FAILURE!
org.junit.ComparisonFailure: expected:<...ger@3edcbc7b[value=5[]]> but was:<...ger@3edcbc7b[value=5[,<null>]>
	at org.junit.Assert.assertEquals(Assert.java:115)
	at org.junit.Assert.assertEquals(Assert.java:144)
	at org.apache.commons.lang3.builder.ToStringBuilderTest.testReflectionInteger(ToStringBuilderTest.java:97)

testReflectionInteger(org.apache.commons.lang3.builder.ToStringBuilderTest)  Time elapsed: 0 sec  <<< ERROR!
java.util.ConcurrentModificationException: null
	at java.util.WeakHashMap$HashIterator.nextEntry(WeakHashMap.java:882)
	at java.util.WeakHashMap$EntryIterator.next(WeakHashMap.java:921)
	at java.util.WeakHashMap$EntryIterator.next(WeakHashMap.java:919)
	at java.util.AbstractMap.toString(AbstractMap.java:518)
	at java.lang.String.valueOf(String.java:2847)
	at java.lang.StringBuilder.append(StringBuilder.java:128)
	at org.apache.commons.lang3.builder.ToStringBuilderTest.validateNullToStringStyleRegistry(ToStringBuilderTest.java:595)
	at org.apache.commons.lang3.builder.ToStringBuilderTest.after(ToStringBuilderTest.java:48)

testBooleanArray(org.apache.commons.lang3.builder.ToStringBuilderTest)  Time elapsed: 0 sec  <<< FAILURE!
org.junit.ComparisonFailure: expected:<...b[{true,false,false}[]]> but was:<...b[{true,false,false}[,<null>]>
	at org.junit.Assert.assertEquals(Assert.java:115)
	at org.junit.Assert.assertEquals(Assert.java:144)
	at org.apache.commons.lang3.builder.ToStringBuilderTest.testBooleanArray(ToStringBuilderTest.java:797)

testBooleanArray(org.apache.commons.lang3.builder.ToStringBuilderTest)  Time elapsed: 0 sec  <<< ERROR!
java.util.ConcurrentModificationException: null
	at java.util.WeakHashMap$HashIterator.nextEntry(WeakHashMap.java:882)
	at java.util.WeakHashMap$EntryIterator.next(WeakHashMap.java:921)
	at java.util.WeakHashMap$EntryIterator.next(WeakHashMap.java:919)
	at java.util.AbstractMap.toString(AbstractMap.java:518)
	at java.lang.String.valueOf(String.java:2847)
	at java.lang.StringBuilder.append(StringBuilder.java:128)
	at org.apache.commons.lang3.builder.ToStringBuilderTest.validateNullToStringStyleRegistry(ToStringBuilderTest.java:595)
	at org.apache.commons.lang3.builder.ToStringBuilderTest.after(ToStringBuilderTest.java:48)

testFloatArrayArray(org.apache.commons.lang3.builder.ToStringBuilderTest)  Time elapsed: 0.001 sec  <<< FAILURE!
org.junit.ComparisonFailure: expected:<...29686},<null>,{NaN}}[]]> but was:<...29686},<null>,{NaN}}[,<null>]>
	at org.junit.Assert.assertEquals(Assert.java:115)
	at org.junit.Assert.assertEquals(Assert.java:144)
	at org.apache.commons.lang3.builder.ToStringBuilderTest.testFloatArrayArray(ToStringBuilderTest.java:867)

testFloatArrayArray(org.apache.commons.lang3.builder.ToStringBuilderTest)  Time elapsed: 0.001 sec  <<< ERROR!
java.util.ConcurrentModificationException: null
	at java.util.WeakHashMap$HashIterator.nextEntry(WeakHashMap.java:882)
	at java.util.WeakHashMap$EntryIterator.next(WeakHashMap.java:921)
	at java.util.WeakHashMap$EntryIterator.next(WeakHashMap.java:919)
	at java.util.AbstractMap.toString(AbstractMap.java:518)
	at java.lang.String.valueOf(String.java:2847)
	at java.lang.StringBuilder.append(StringBuilder.java:128)
	at org.apache.commons.lang3.builder.ToStringBuilderTest.validateNullToStringStyleRegistry(ToStringBuilderTest.java:595)
	at org.apache.commons.lang3.builder.ToStringBuilderTest.after(ToStringBuilderTest.java:48)

testReflectionyteArray(org.apache.commons.lang3.builder.ToStringBuilderTest)  Time elapsed: 0.001 sec  <<< FAILURE!
org.junit.ComparisonFailure: expected:<...@330bdf62[{1,2,-3,4}[]]> but was:<...@330bdf62[{1,2,-3,4}[<null>]>
	at org.junit.Assert.assertEquals(Assert.java:115)
	at org.junit.Assert.assertEquals(Assert.java:144)
	at org.apache.commons.lang3.builder.ToStringBuilderTest.testReflectionyteArray(ToStringBuilderTest.java:196)

testReflectionyteArray(org.apache.commons.lang3.builder.ToStringBuilderTest)  Time elapsed: 0.001 sec  <<< ERROR!
java.util.ConcurrentModificationException: null
	at java.util.WeakHashMap$HashIterator.nextEntry(WeakHashMap.java:882)
	at java.util.WeakHashMap$EntryIterator.next(WeakHashMap.java:921)
	at java.util.WeakHashMap$EntryIterator.next(WeakHashMap.java:919)
	at java.util.AbstractMap.toString(AbstractMap.java:518)
	at java.lang.String.valueOf(String.java:2847)
	at java.lang.StringBuilder.append(StringBuilder.java:128)
	at org.apache.commons.lang3.builder.ToStringBuilderTest.validateNullToStringStyleRegistry(ToStringBuilderTest.java:595)
	at org.apache.commons.lang3.builder.ToStringBuilderTest.after(ToStringBuilderTest.java:48)

testReflectionDoubleArray(org.apache.commons.lang3.builder.ToStringBuilderTest)  Time elapsed: 0.001 sec  <<< FAILURE!
org.junit.ComparisonFailure: expected:<...2.9876,-3.00001,4.3}[]]> but was:<...2.9876,-3.00001,4.3}[<null>]>
	at org.junit.Assert.assertEquals(Assert.java:115)
	at org.junit.Assert.assertEquals(Assert.java:144)
	at org.apache.commons.lang3.builder.ToStringBuilderTest.testReflectionDoubleArray(ToStringBuilderTest.java:214)

testReflectionDoubleArray(org.apache.commons.lang3.builder.ToStringBuilderTest)  Time elapsed: 0.001 sec  <<< ERROR!
java.util.ConcurrentModificationException: null
	at java.util.WeakHashMap$HashIterator.nextEntry(WeakHashMap.java:882)
	at java.util.WeakHashMap$EntryIterator.next(WeakHashMap.java:921)
	at java.util.WeakHashMap$EntryIterator.next(WeakHashMap.java:919)
	at java.util.AbstractMap.toString(AbstractMap.java:518)
	at java.lang.String.valueOf(String.java:2847)
	at java.lang.StringBuilder.append(StringBuilder.java:128)
	at org.apache.commons.lang3.builder.ToStringBuilderTest.validateNullToStringStyleRegistry(ToStringBuilderTest.java:595)
	at org.apache.commons.lang3.builder.ToStringBuilderTest.after(ToStringBuilderTest.java:48)

testReflectionIntArrayArray(org.apache.commons.lang3.builder.ToStringBuilderTest)  Time elapsed: 0 sec  <<< FAILURE!
org.junit.ComparisonFailure: expected:<...9[{{1,2},<null>,{5}}[]]> but was:<...9[{{1,2},<null>,{5}}[<null>]>
	at org.junit.Assert.assertEquals(Assert.java:115)
	at org.junit.Assert.assertEquals(Assert.java:144)
	at org.apache.commons.lang3.builder.ToStringBuilderTest.testReflectionIntArrayArray(ToStringBuilderTest.java:262)

testReflectionIntArrayArray(org.apache.commons.lang3.builder.ToStringBuilderTest)  Time elapsed: 0.001 sec  <<< ERROR!
java.util.ConcurrentModificationException: null
	at java.util.WeakHashMap$HashIterator.nextEntry(WeakHashMap.java:882)
	at java.util.WeakHashMap$EntryIterator.next(WeakHashMap.java:921)
	at java.util.WeakHashMap$EntryIterator.next(WeakHashMap.java:919)
	at java.util.AbstractMap.toString(AbstractMap.java:518)
	at java.lang.String.valueOf(String.java:2847)
	at java.lang.StringBuilder.append(StringBuilder.java:128)
	at org.apache.commons.lang3.builder.ToStringBuilderTest.validateNullToStringStyleRegistry(ToStringBuilderTest.java:595)
	at org.apache.commons.lang3.builder.ToStringBuilderTest.after(ToStringBuilderTest.java:48)

testSimpleReflectionStatics(org.apache.commons.lang3.builder.ToStringBuilderTest)  Time elapsed: 0.001 sec  <<< FAILURE!
org.junit.ComparisonFailure: expected:<...ring,staticInt=12345[]]> but was:<...ring,staticInt=12345[,<null>]>
	at org.junit.Assert.assertEquals(Assert.java:115)
	at org.junit.Assert.assertEquals(Assert.java:144)
	at org.apache.commons.lang3.builder.ToStringBuilderTest.testSimpleReflectionStatics(ToStringBuilderTest.java:907)

testSimpleReflectionStatics(org.apache.commons.lang3.builder.ToStringBuilderTest)  Time elapsed: 0.002 sec  <<< ERROR!
java.util.ConcurrentModificationException: null
	at java.util.WeakHashMap$HashIterator.nextEntry(WeakHashMap.java:882)
	at java.util.WeakHashMap$EntryIterator.next(WeakHashMap.java:921)
	at java.util.WeakHashMap$EntryIterator.next(WeakHashMap.java:919)
	at java.util.AbstractMap.toString(AbstractMap.java:518)
	at java.lang.String.valueOf(String.java:2847)
	at java.lang.StringBuilder.append(StringBuilder.java:128)
	at org.apache.commons.lang3.builder.ToStringBuilderTest.validateNullToStringStyleRegistry(ToStringBuilderTest.java:595)
	at org.apache.commons.lang3.builder.ToStringBuilderTest.after(ToStringBuilderTest.java:48)

testReflectionStatics(org.apache.commons.lang3.builder.ToStringBuilderTest)  Time elapsed: 0.001 sec  <<< FAILURE!
org.junit.ComparisonFailure: expected:<...ng,instanceInt=67890[]]> but was:<...ng,instanceInt=67890[,<null>]>
	at org.junit.Assert.assertEquals(Assert.java:115)
	at org.junit.Assert.assertEquals(Assert.java:144)
	at org.apache.commons.lang3.builder.ToStringBuilderTest.testReflectionStatics(ToStringBuilderTest.java:927)

testReflectionStatics(org.apache.commons.lang3.builder.ToStringBuilderTest)  Time elapsed: 0.002 sec  <<< ERROR!
java.util.ConcurrentModificationException: null
	at java.util.WeakHashMap$HashIterator.nextEntry(WeakHashMap.java:882)
	at java.util.WeakHashMap$EntryIterator.next(WeakHashMap.java:921)
	at java.util.WeakHashMap$EntryIterator.next(WeakHashMap.java:919)
	at java.util.AbstractMap.toString(AbstractMap.java:518)
	at java.lang.String.valueOf(String.java:2847)
	at java.lang.StringBuilder.append(StringBuilder.java:128)
	at org.apache.commons.lang3.builder.ToStringBuilderTest.validateNullToStringStyleRegistry(ToStringBuilderTest.java:595)
	at org.apache.commons.lang3.builder.ToStringBuilderTest.after(ToStringBuilderTest.java:48)

testReflectionLongArray(org.apache.commons.lang3.builder.ToStringBuilderTest)  Time elapsed: 0.001 sec  <<< FAILURE!
org.junit.ComparisonFailure: expected:<...@440cb577[{1,2,-3,4}[]]> but was:<...@440cb577[{1,2,-3,4}[<null>]>
	at org.junit.Assert.assertEquals(Assert.java:115)
	at org.junit.Assert.assertEquals(Assert.java:144)
	at org.apache.commons.lang3.builder.ToStringBuilderTest.testReflectionLongArray(ToStringBuilderTest.java:169)

testReflectionLongArray(org.apache.commons.lang3.builder.ToStringBuilderTest)  Time elapsed: 0.001 sec  <<< ERROR!
java.util.ConcurrentModificationException: null
	at java.util.WeakHashMap$HashIterator.nextEntry(WeakHashMap.java:882)
	at java.util.WeakHashMap$EntryIterator.next(WeakHashMap.java:921)
	at java.util.WeakHashMap$EntryIterator.next(WeakHashMap.java:919)
	at java.util.AbstractMap.toString(AbstractMap.java:518)
	at java.lang.String.valueOf(String.java:2847)
	at java.lang.StringBuilder.append(StringBuilder.java:128)
	at org.apache.commons.lang3.builder.ToStringBuilderTest.validateNullToStringStyleRegistry(ToStringBuilderTest.java:595)
	at org.apache.commons.lang3.builder.ToStringBuilderTest.after(ToStringBuilderTest.java:48)

testReflectionhortArrayArray(org.apache.commons.lang3.builder.ToStringBuilderTest)  Time elapsed: 0.001 sec  <<< FAILURE!
org.junit.ComparisonFailure: expected:<...8[{{1,2},<null>,{5}}[]]> but was:<...8[{{1,2},<null>,{5}}[<null>]>
	at org.junit.Assert.assertEquals(Assert.java:115)
	at org.junit.Assert.assertEquals(Assert.java:144)
	at org.apache.commons.lang3.builder.ToStringBuilderTest.testReflectionhortArrayArray(ToStringBuilderTest.java:271)

testReflectionhortArrayArray(org.apache.commons.lang3.builder.ToStringBuilderTest)  Time elapsed: 0.001 sec  <<< ERROR!
java.util.ConcurrentModificationException: null
	at java.util.WeakHashMap$HashIterator.nextEntry(WeakHashMap.java:882)
	at java.util.WeakHashMap$EntryIterator.next(WeakHashMap.java:921)
	at java.util.WeakHashMap$EntryIterator.next(WeakHashMap.java:919)
	at java.util.AbstractMap.toString(AbstractMap.java:518)
	at java.lang.String.valueOf(String.java:2847)
	at java.lang.StringBuilder.append(StringBuilder.java:128)
	at org.apache.commons.lang3.builder.ToStringBuilderTest.validateNullToStringStyleRegistry(ToStringBuilderTest.java:595)
	at org.apache.commons.lang3.builder.ToStringBuilderTest.after(ToStringBuilderTest.java:48)

testConstructorEx1(org.apache.commons.lang3.builder.ToStringBuilderTest)  Time elapsed: 0.001 sec  <<< FAILURE!
org.junit.ComparisonFailure: expected:<[<null>]> but was:<[]]>
	at org.junit.Assert.assertEquals(Assert.java:115)
	at org.junit.Assert.assertEquals(Assert.java:144)
	at org.apache.commons.lang3.builder.ToStringBuilderTest.testConstructorEx1(ToStringBuilderTest.java:55)

testConstructorEx1(org.apache.commons.lang3.builder.ToStringBuilderTest)  Time elapsed: 0.001 sec  <<< ERROR!
java.util.ConcurrentModificationException: null
	at java.util.WeakHashMap$HashIterator.nextEntry(WeakHashMap.java:882)
	at java.util.WeakHashMap$EntryIterator.next(WeakHashMap.java:921)
	at java.util.WeakHashMap$EntryIterator.next(WeakHashMap.java:919)
	at java.util.AbstractMap.toString(AbstractMap.java:518)
	at java.lang.String.valueOf(String.java:2847)
	at java.lang.StringBuilder.append(StringBuilder.java:128)
	at org.apache.commons.lang3.builder.ToStringBuilderTest.validateNullToStringStyleRegistry(ToStringBuilderTest.java:595)
	at org.apache.commons.lang3.builder.ToStringBuilderTest.after(ToStringBuilderTest.java:48)

testConstructorEx2(org.apache.commons.lang3.builder.ToStringBuilderTest)  Time elapsed: 0.004 sec  <<< FAILURE!
org.junit.ComparisonFailure: expected:<[<null>]> but was:<[]]>
	at org.junit.Assert.assertEquals(Assert.java:115)
	at org.junit.Assert.assertEquals(Assert.java:144)
	at org.apache.commons.lang3.builder.ToStringBuilderTest.testConstructorEx2(ToStringBuilderTest.java:60)

testConstructorEx2(org.apache.commons.lang3.builder.ToStringBuilderTest)  Time elapsed: 0.004 sec  <<< ERROR!
java.util.ConcurrentModificationException: null
	at java.util.WeakHashMap$HashIterator.nextEntry(WeakHashMap.java:882)
	at java.util.WeakHashMap$EntryIterator.next(WeakHashMap.java:921)
	at java.util.WeakHashMap$EntryIterator.next(WeakHashMap.java:919)
	at java.util.AbstractMap.toString(AbstractMap.java:518)
	at java.lang.String.valueOf(String.java:2847)
	at java.lang.StringBuilder.append(StringBuilder.java:128)
	at org.apache.commons.lang3.builder.ToStringBuilderTest.validateNullToStringStyleRegistry(ToStringBuilderTest.java:595)
	at org.apache.commons.lang3.builder.ToStringBuilderTest.after(ToStringBuilderTest.java:48)

testConstructorEx3(org.apache.commons.lang3.builder.ToStringBuilderTest)  Time elapsed: 0 sec  <<< FAILURE!
org.junit.ComparisonFailure: expected:<[<null>]> but was:<[]]>
	at org.junit.Assert.assertEquals(Assert.java:115)
	at org.junit.Assert.assertEquals(Assert.java:144)
	at org.apache.commons.lang3.builder.ToStringBuilderTest.testConstructorEx3(ToStringBuilderTest.java:66)

testConstructorEx3(org.apache.commons.lang3.builder.ToStringBuilderTest)  Time elapsed: 0 sec  <<< ERROR!
java.util.ConcurrentModificationException: null
	at java.util.WeakHashMap$HashIterator.nextEntry(WeakHashMap.java:882)
	at java.util.WeakHashMap$EntryIterator.next(WeakHashMap.java:921)
	at java.util.WeakHashMap$EntryIterator.next(WeakHashMap.java:919)
	at java.util.AbstractMap.toString(AbstractMap.java:518)
	at java.lang.String.valueOf(String.java:2847)
	at java.lang.StringBuilder.append(StringBuilder.java:128)
	at org.apache.commons.lang3.builder.ToStringBuilderTest.validateNullToStringStyleRegistry(ToStringBuilderTest.java:595)
	at org.apache.commons.lang3.builder.ToStringBuilderTest.after(ToStringBuilderTest.java:48)

testReflectionObjectArray(org.apache.commons.lang3.builder.ToStringBuilderTest)  Time elapsed: 0 sec  <<< FAILURE!
org.junit.ComparisonFailure: expected:<...c30[{<null>,5,{3,6}}[]]> but was:<...c30[{<null>,5,{3,6}}[<null>]>
	at org.junit.Assert.assertEquals(Assert.java:115)
	at org.junit.Assert.assertEquals(Assert.java:144)
	at org.apache.commons.lang3.builder.ToStringBuilderTest.testReflectionObjectArray(ToStringBuilderTest.java:160)

testReflectionObjectArray(org.apache.commons.lang3.builder.ToStringBuilderTest)  Time elapsed: 0.004 sec  <<< ERROR!
java.util.ConcurrentModificationException: null
	at java.util.WeakHashMap$HashIterator.nextEntry(WeakHashMap.java:882)
	at java.util.WeakHashMap$EntryIterator.next(WeakHashMap.java:921)
	at java.util.WeakHashMap$EntryIterator.next(WeakHashMap.java:919)
	at java.util.AbstractMap.toString(AbstractMap.java:518)
	at java.lang.String.valueOf(String.java:2847)
	at java.lang.StringBuilder.append(StringBuilder.java:128)
	at org.apache.commons.lang3.builder.ToStringBuilderTest.validateNullToStringStyleRegistry(ToStringBuilderTest.java:595)
	at org.apache.commons.lang3.builder.ToStringBuilderTest.after(ToStringBuilderTest.java:48)

testReflectionObjectCycle(org.apache.commons.lang3.builder.ToStringBuilderTest)  Time elapsed: 0 sec  <<< FAILURE!
org.junit.ComparisonFailure: expected:<...nTestCycleA@50258792[]]]> but was:<...nTestCycleA@50258792[,<null>,<null>]>
	at org.junit.Assert.assertEquals(Assert.java:115)
	at org.junit.Assert.assertEquals(Assert.java:144)
	at org.apache.commons.lang3.builder.ToStringBuilderTest.testReflectionObjectCycle(ToStringBuilderTest.java:562)

testReflectionObjectCycle(org.apache.commons.lang3.builder.ToStringBuilderTest)  Time elapsed: 0 sec  <<< ERROR!
java.util.ConcurrentModificationException: null
	at java.util.WeakHashMap$HashIterator.nextEntry(WeakHashMap.java:882)
	at java.util.WeakHashMap$EntryIterator.next(WeakHashMap.java:921)
	at java.util.WeakHashMap$EntryIterator.next(WeakHashMap.java:919)
	at java.util.AbstractMap.toString(AbstractMap.java:518)
	at java.lang.String.valueOf(String.java:2847)
	at java.lang.StringBuilder.append(StringBuilder.java:128)
	at org.apache.commons.lang3.builder.ToStringBuilderTest.validateNullToStringStyleRegistry(ToStringBuilderTest.java:595)
	at org.apache.commons.lang3.builder.ToStringBuilderTest.after(ToStringBuilderTest.java:48)

testReflectionBooleanArrayArray(org.apache.commons.lang3.builder.ToStringBuilderTest)  Time elapsed: 0 sec  <<< FAILURE!
org.junit.ComparisonFailure: expected:<...lse},<null>,{false}}[]]> but was:<...lse},<null>,{false}}[<null>]>
	at org.junit.Assert.assertEquals(Assert.java:115)
	at org.junit.Assert.assertEquals(Assert.java:144)
	at org.apache.commons.lang3.builder.ToStringBuilderTest.testReflectionBooleanArrayArray(ToStringBuilderTest.java:307)

testReflectionBooleanArrayArray(org.apache.commons.lang3.builder.ToStringBuilderTest)  Time elapsed: 0 sec  <<< ERROR!
java.util.ConcurrentModificationException: null
	at java.util.WeakHashMap$HashIterator.nextEntry(WeakHashMap.java:882)
	at java.util.WeakHashMap$EntryIterator.next(WeakHashMap.java:921)
	at java.util.WeakHashMap$EntryIterator.next(WeakHashMap.java:919)
	at java.util.AbstractMap.toString(AbstractMap.java:518)
	at java.lang.String.valueOf(String.java:2847)
	at java.lang.StringBuilder.append(StringBuilder.java:128)
	at org.apache.commons.lang3.builder.ToStringBuilderTest.validateNullToStringStyleRegistry(ToStringBuilderTest.java:595)
	at org.apache.commons.lang3.builder.ToStringBuilderTest.after(ToStringBuilderTest.java:48)

testLongArray(org.apache.commons.lang3.builder.ToStringBuilderTest)  Time elapsed: 0 sec  <<< FAILURE!
org.junit.ComparisonFailure: expected:<...@3edcbc7b[{1,2,-3,4}[]]> but was:<...@3edcbc7b[{1,2,-3,4}[,<null>]>
	at org.junit.Assert.assertEquals(Assert.java:115)
	at org.junit.Assert.assertEquals(Assert.java:144)
	at org.apache.commons.lang3.builder.ToStringBuilderTest.testLongArray(ToStringBuilderTest.java:727)

testLongArray(org.apache.commons.lang3.builder.ToStringBuilderTest)  Time elapsed: 0.001 sec  <<< ERROR!
java.util.ConcurrentModificationException: null
	at java.util.WeakHashMap$HashIterator.nextEntry(WeakHashMap.java:882)
	at java.util.WeakHashMap$EntryIterator.next(WeakHashMap.java:921)
	at java.util.WeakHashMap$EntryIterator.next(WeakHashMap.java:919)
	at java.util.AbstractMap.toString(AbstractMap.java:518)
	at java.lang.String.valueOf(String.java:2847)
	at java.lang.StringBuilder.append(StringBuilder.java:128)
	at org.apache.commons.lang3.builder.ToStringBuilderTest.validateNullToStringStyleRegistry(ToStringBuilderTest.java:595)
	at org.apache.commons.lang3.builder.ToStringBuilderTest.after(ToStringBuilderTest.java:48)

testSimpleReflectionObjectCycle(org.apache.commons.lang3.builder.ToStringBuilderTest)  Time elapsed: 0.002 sec  <<< FAILURE!
org.junit.ComparisonFailure: expected:<...nTestFixture@67c9c73[]]> but was:<...nTestFixture@67c9c73[,<null>]>
	at org.junit.Assert.assertEquals(Assert.java:115)
	at org.junit.Assert.assertEquals(Assert.java:144)
	at org.apache.commons.lang3.builder.ToStringBuilderTest.testSimpleReflectionObjectCycle(ToStringBuilderTest.java:530)

testSimpleReflectionObjectCycle(org.apache.commons.lang3.builder.ToStringBuilderTest)  Time elapsed: 0.003 sec  <<< ERROR!
java.util.ConcurrentModificationException: null
	at java.util.WeakHashMap$HashIterator.nextEntry(WeakHashMap.java:882)
	at java.util.WeakHashMap$EntryIterator.next(WeakHashMap.java:921)
	at java.util.WeakHashMap$EntryIterator.next(WeakHashMap.java:919)
	at java.util.AbstractMap.toString(AbstractMap.java:518)
	at java.lang.String.valueOf(String.java:2847)
	at java.lang.StringBuilder.append(StringBuilder.java:128)
	at org.apache.commons.lang3.builder.ToStringBuilderTest.validateNullToStringStyleRegistry(ToStringBuilderTest.java:595)
	at org.apache.commons.lang3.builder.ToStringBuilderTest.after(ToStringBuilderTest.java:48)

testShortArray(org.apache.commons.lang3.builder.ToStringBuilderTest)  Time elapsed: 0 sec  <<< FAILURE!
org.junit.ComparisonFailure: expected:<...@3edcbc7b[{1,2,-3,4}[]]> but was:<...@3edcbc7b[{1,2,-3,4}[,<null>]>
	at org.junit.Assert.assertEquals(Assert.java:115)
	at org.junit.Assert.assertEquals(Assert.java:144)
	at org.apache.commons.lang3.builder.ToStringBuilderTest.testShortArray(ToStringBuilderTest.java:747)

testShortArray(org.apache.commons.lang3.builder.ToStringBuilderTest)  Time elapsed: 0.001 sec  <<< ERROR!
java.util.ConcurrentModificationException: null
	at java.util.WeakHashMap$HashIterator.nextEntry(WeakHashMap.java:882)
	at java.util.WeakHashMap$EntryIterator.next(WeakHashMap.java:921)
	at java.util.WeakHashMap$EntryIterator.next(WeakHashMap.java:919)
	at java.util.AbstractMap.toString(AbstractMap.java:518)
	at java.lang.String.valueOf(String.java:2847)
	at java.lang.StringBuilder.append(StringBuilder.java:128)
	at org.apache.commons.lang3.builder.ToStringBuilderTest.validateNullToStringStyleRegistry(ToStringBuilderTest.java:595)
	at org.apache.commons.lang3.builder.ToStringBuilderTest.after(ToStringBuilderTest.java:48)

testIntArrayArray(org.apache.commons.lang3.builder.ToStringBuilderTest)  Time elapsed: 0 sec  <<< FAILURE!
org.junit.ComparisonFailure: expected:<...b[{{1,2},<null>,{5}}[]]> but was:<...b[{{1,2},<null>,{5}}[,<null>]>
	at org.junit.Assert.assertEquals(Assert.java:115)
	at org.junit.Assert.assertEquals(Assert.java:144)
	at org.apache.commons.lang3.builder.ToStringBuilderTest.testIntArrayArray(ToStringBuilderTest.java:817)

testIntArrayArray(org.apache.commons.lang3.builder.ToStringBuilderTest)  Time elapsed: 0.001 sec  <<< ERROR!
java.util.ConcurrentModificationException: null
	at java.util.WeakHashMap$HashIterator.nextEntry(WeakHashMap.java:882)
	at java.util.WeakHashMap$EntryIterator.next(WeakHashMap.java:921)
	at java.util.WeakHashMap$EntryIterator.next(WeakHashMap.java:919)
	at java.util.AbstractMap.toString(AbstractMap.java:518)
	at java.lang.String.valueOf(String.java:2847)
	at java.lang.StringBuilder.append(StringBuilder.java:128)
	at org.apache.commons.lang3.builder.ToStringBuilderTest.validateNullToStringStyleRegistry(ToStringBuilderTest.java:595)
	at org.apache.commons.lang3.builder.ToStringBuilderTest.after(ToStringBuilderTest.java:48)

testInheritedReflectionStatics(org.apache.commons.lang3.builder.ToStringBuilderTest)  Time elapsed: 0.001 sec  <<< FAILURE!
org.junit.ComparisonFailure: expected:<...ng2,staticInt2=67890[]]> but was:<...ng2,staticInt2=67890[,<null>]>
	at org.junit.Assert.assertEquals(Assert.java:115)
	at org.junit.Assert.assertEquals(Assert.java:144)
	at org.apache.commons.lang3.builder.ToStringBuilderTest.testInheritedReflectionStatics(ToStringBuilderTest.java:947)

testInheritedReflectionStatics(org.apache.commons.lang3.builder.ToStringBuilderTest)  Time elapsed: 0.001 sec  <<< ERROR!
java.util.ConcurrentModificationException: null
	at java.util.WeakHashMap$HashIterator.nextEntry(WeakHashMap.java:882)
	at java.util.WeakHashMap$EntryIterator.next(WeakHashMap.java:921)
	at java.util.WeakHashMap$EntryIterator.next(WeakHashMap.java:919)
	at java.util.AbstractMap.toString(AbstractMap.java:518)
	at java.lang.String.valueOf(String.java:2847)
	at java.lang.StringBuilder.append(StringBuilder.java:128)
	at org.apache.commons.lang3.builder.ToStringBuilderTest.validateNullToStringStyleRegistry(ToStringBuilderTest.java:595)
	at org.apache.commons.lang3.builder.ToStringBuilderTest.after(ToStringBuilderTest.java:48)

testReflectionByteArrayArray(org.apache.commons.lang3.builder.ToStringBuilderTest)  Time elapsed: 0 sec  <<< FAILURE!
org.junit.ComparisonFailure: expected:<...8[{{1,2},<null>,{5}}[]]> but was:<...8[{{1,2},<null>,{5}}[<null>]>
	at org.junit.Assert.assertEquals(Assert.java:115)
	at org.junit.Assert.assertEquals(Assert.java:144)
	at org.apache.commons.lang3.builder.ToStringBuilderTest.testReflectionByteArrayArray(ToStringBuilderTest.java:280)

testReflectionByteArrayArray(org.apache.commons.lang3.builder.ToStringBuilderTest)  Time elapsed: 0 sec  <<< ERROR!
java.util.ConcurrentModificationException: null
	at java.util.WeakHashMap$HashIterator.nextEntry(WeakHashMap.java:882)
	at java.util.WeakHashMap$EntryIterator.next(WeakHashMap.java:921)
	at java.util.WeakHashMap$EntryIterator.next(WeakHashMap.java:919)
	at java.util.AbstractMap.toString(AbstractMap.java:518)
	at java.lang.String.valueOf(String.java:2847)
	at java.lang.StringBuilder.append(StringBuilder.java:128)
	at org.apache.commons.lang3.builder.ToStringBuilderTest.validateNullToStringStyleRegistry(ToStringBuilderTest.java:595)
	at org.apache.commons.lang3.builder.ToStringBuilderTest.after(ToStringBuilderTest.java:48)

testReflectionArrayCycleLevel2(org.apache.commons.lang3.builder.ToStringBuilderTest)  Time elapsed: 0 sec  <<< FAILURE!
org.junit.ComparisonFailure: expected:<...g.Object;@4e400552}}[]]> but was:<...g.Object;@4e400552}}[<null>]>
	at org.junit.Assert.assertEquals(Assert.java:115)
	at org.junit.Assert.assertEquals(Assert.java:144)
	at org.apache.commons.lang3.builder.ToStringBuilderTest.testReflectionArrayCycleLevel2(ToStringBuilderTest.java:416)

testReflectionArrayCycleLevel2(org.apache.commons.lang3.builder.ToStringBuilderTest)  Time elapsed: 0 sec  <<< ERROR!
java.util.ConcurrentModificationException: null
	at java.util.WeakHashMap$HashIterator.nextEntry(WeakHashMap.java:882)
	at java.util.WeakHashMap$EntryIterator.next(WeakHashMap.java:921)
	at java.util.WeakHashMap$EntryIterator.next(WeakHashMap.java:919)
	at java.util.AbstractMap.toString(AbstractMap.java:518)
	at java.lang.String.valueOf(String.java:2847)
	at java.lang.StringBuilder.append(StringBuilder.java:128)
	at org.apache.commons.lang3.builder.ToStringBuilderTest.validateNullToStringStyleRegistry(ToStringBuilderTest.java:595)
	at org.apache.commons.lang3.builder.ToStringBuilderTest.after(ToStringBuilderTest.java:48)

testAppendToString(org.apache.commons.lang3.builder.ToStringBuilderTest)  Time elapsed: 0 sec  <<< FAILURE!
org.junit.ComparisonFailure: expected:<...ng.Integer@3edcbc7b[[]]> but was:<...ng.Integer@3edcbc7b[[<null>]>
	at org.junit.Assert.assertEquals(Assert.java:115)
	at org.junit.Assert.assertEquals(Assert.java:144)
	at org.apache.commons.lang3.builder.ToStringBuilderTest.testAppendToString(ToStringBuilderTest.java:611)

testAppendToString(org.apache.commons.lang3.builder.ToStringBuilderTest)  Time elapsed: 0 sec  <<< ERROR!
java.util.ConcurrentModificationException: null
	at java.util.WeakHashMap$HashIterator.nextEntry(WeakHashMap.java:882)
	at java.util.WeakHashMap$EntryIterator.next(WeakHashMap.java:921)
	at java.util.WeakHashMap$EntryIterator.next(WeakHashMap.java:919)
	at java.util.AbstractMap.toString(AbstractMap.java:518)
	at java.lang.String.valueOf(String.java:2847)
	at java.lang.StringBuilder.append(StringBuilder.java:128)
	at org.apache.commons.lang3.builder.ToStringBuilderTest.validateNullToStringStyleRegistry(ToStringBuilderTest.java:595)
	at org.apache.commons.lang3.builder.ToStringBuilderTest.after(ToStringBuilderTest.java:48)

testReflectionArrayAndObjectCycle(org.apache.commons.lang3.builder.ToStringBuilderTest)  Time elapsed: 0.005 sec  <<< FAILURE!
org.junit.ComparisonFailure: expected:<...ang.Object;@48508ded[]}]]> but was:<...ang.Object;@48508ded[,<null>}<null>]>
	at org.junit.Assert.assertEquals(Assert.java:115)
	at org.junit.Assert.assertEquals(Assert.java:144)
	at org.apache.commons.lang3.builder.ToStringBuilderTest.testReflectionArrayAndObjectCycle(ToStringBuilderTest.java:576)

testReflectionArrayAndObjectCycle(org.apache.commons.lang3.builder.ToStringBuilderTest)  Time elapsed: 0.005 sec  <<< ERROR!
java.util.ConcurrentModificationException: null
	at java.util.WeakHashMap$HashIterator.nextEntry(WeakHashMap.java:882)
	at java.util.WeakHashMap$EntryIterator.next(WeakHashMap.java:921)
	at java.util.WeakHashMap$EntryIterator.next(WeakHashMap.java:919)
	at java.util.AbstractMap.toString(AbstractMap.java:518)
	at java.lang.String.valueOf(String.java:2847)
	at java.lang.StringBuilder.append(StringBuilder.java:128)
	at org.apache.commons.lang3.builder.ToStringBuilderTest.validateNullToStringStyleRegistry(ToStringBuilderTest.java:595)
	at org.apache.commons.lang3.builder.ToStringBuilderTest.after(ToStringBuilderTest.java:48)

testSetDefaultEx(org.apache.commons.lang3.builder.ToStringBuilderTest)  Time elapsed: 0 sec  <<< ERROR!
java.util.ConcurrentModificationException: null
	at java.util.WeakHashMap$HashIterator.nextEntry(WeakHashMap.java:882)
	at java.util.WeakHashMap$EntryIterator.next(WeakHashMap.java:921)
	at java.util.WeakHashMap$EntryIterator.next(WeakHashMap.java:919)
	at java.util.AbstractMap.toString(AbstractMap.java:518)
	at java.lang.String.valueOf(String.java:2847)
	at java.lang.StringBuilder.append(StringBuilder.java:128)
	at org.apache.commons.lang3.builder.ToStringBuilderTest.validateNullToStringStyleRegistry(ToStringBuilderTest.java:595)
	at org.apache.commons.lang3.builder.ToStringBuilderTest.after(ToStringBuilderTest.java:48)

testReflectionCharArrayArray(org.apache.commons.lang3.builder.ToStringBuilderTest)  Time elapsed: 0 sec  <<< FAILURE!
org.junit.ComparisonFailure: expected:<...4[{{A,B},<null>,{p}}[]]> but was:<...4[{{A,B},<null>,{p}}[<null>]>
	at org.junit.Assert.assertEquals(Assert.java:115)
	at org.junit.Assert.assertEquals(Assert.java:144)
	at org.apache.commons.lang3.builder.ToStringBuilderTest.testReflectionCharArrayArray(ToStringBuilderTest.java:289)

testReflectionCharArrayArray(org.apache.commons.lang3.builder.ToStringBuilderTest)  Time elapsed: 0 sec  <<< ERROR!
java.util.ConcurrentModificationException: null
	at java.util.WeakHashMap$HashIterator.nextEntry(WeakHashMap.java:882)
	at java.util.WeakHashMap$EntryIterator.next(WeakHashMap.java:921)
	at java.util.WeakHashMap$EntryIterator.next(WeakHashMap.java:919)
	at java.util.AbstractMap.toString(AbstractMap.java:518)
	at java.lang.String.valueOf(String.java:2847)
	at java.lang.StringBuilder.append(StringBuilder.java:128)
	at org.apache.commons.lang3.builder.ToStringBuilderTest.validateNullToStringStyleRegistry(ToStringBuilderTest.java:595)
	at org.apache.commons.lang3.builder.ToStringBuilderTest.after(ToStringBuilderTest.java:48)

testIntArray(org.apache.commons.lang3.builder.ToStringBuilderTest)  Time elapsed: 0 sec  <<< FAILURE!
org.junit.ComparisonFailure: expected:<...@3edcbc7b[{1,2,-3,4}[]]> but was:<...@3edcbc7b[{1,2,-3,4}[,<null>]>
	at org.junit.Assert.assertEquals(Assert.java:115)
	at org.junit.Assert.assertEquals(Assert.java:144)
	at org.apache.commons.lang3.builder.ToStringBuilderTest.testIntArray(ToStringBuilderTest.java:737)

testIntArray(org.apache.commons.lang3.builder.ToStringBuilderTest)  Time elapsed: 0 sec  <<< ERROR!
java.util.ConcurrentModificationException: null
	at java.util.WeakHashMap$HashIterator.nextEntry(WeakHashMap.java:882)
	at java.util.WeakHashMap$EntryIterator.next(WeakHashMap.java:921)
	at java.util.WeakHashMap$EntryIterator.next(WeakHashMap.java:919)
	at java.util.AbstractMap.toString(AbstractMap.java:518)
	at java.lang.String.valueOf(String.java:2847)
	at java.lang.StringBuilder.append(StringBuilder.java:128)
	at org.apache.commons.lang3.builder.ToStringBuilderTest.validateNullToStringStyleRegistry(ToStringBuilderTest.java:595)
	at org.apache.commons.lang3.builder.ToStringBuilderTest.after(ToStringBuilderTest.java:48)

testDouble(org.apache.commons.lang3.builder.ToStringBuilderTest)  Time elapsed: 0 sec  <<< FAILURE!
org.junit.ComparisonFailure: expected:<...Integer@3edcbc7b[3.2[]]> but was:<...Integer@3edcbc7b[3.2[,<null>]>
	at org.junit.Assert.assertEquals(Assert.java:115)
	at org.junit.Assert.assertEquals(Assert.java:144)
	at org.apache.commons.lang3.builder.ToStringBuilderTest.testDouble(ToStringBuilderTest.java:694)

testDouble(org.apache.commons.lang3.builder.ToStringBuilderTest)  Time elapsed: 0.001 sec  <<< ERROR!
java.util.ConcurrentModificationException: null
	at java.util.WeakHashMap$HashIterator.nextEntry(WeakHashMap.java:882)
	at java.util.WeakHashMap$EntryIterator.next(WeakHashMap.java:921)
	at java.util.WeakHashMap$EntryIterator.next(WeakHashMap.java:919)
	at java.util.AbstractMap.toString(AbstractMap.java:518)
	at java.lang.String.valueOf(String.java:2847)
	at java.lang.StringBuilder.append(StringBuilder.java:128)
	at org.apache.commons.lang3.builder.ToStringBuilderTest.validateNullToStringStyleRegistry(ToStringBuilderTest.java:595)
	at org.apache.commons.lang3.builder.ToStringBuilderTest.after(ToStringBuilderTest.java:48)

testByteArrayArray(org.apache.commons.lang3.builder.ToStringBuilderTest)  Time elapsed: 0.001 sec  <<< FAILURE!
org.junit.ComparisonFailure: expected:<...b[{{1,2},<null>,{5}}[]]> but was:<...b[{{1,2},<null>,{5}}[,<null>]>
	at org.junit.Assert.assertEquals(Assert.java:115)
	at org.junit.Assert.assertEquals(Assert.java:144)
	at org.apache.commons.lang3.builder.ToStringBuilderTest.testByteArrayArray(ToStringBuilderTest.java:837)

testByteArrayArray(org.apache.commons.lang3.builder.ToStringBuilderTest)  Time elapsed: 0.001 sec  <<< ERROR!
java.util.ConcurrentModificationException: null
	at java.util.WeakHashMap$HashIterator.nextEntry(WeakHashMap.java:882)
	at java.util.WeakHashMap$EntryIterator.next(WeakHashMap.java:921)
	at java.util.WeakHashMap$EntryIterator.next(WeakHashMap.java:919)
	at java.util.AbstractMap.toString(AbstractMap.java:518)
	at java.lang.String.valueOf(String.java:2847)
	at java.lang.StringBuilder.append(StringBuilder.java:128)
	at org.apache.commons.lang3.builder.ToStringBuilderTest.validateNullToStringStyleRegistry(ToStringBuilderTest.java:595)
	at org.apache.commons.lang3.builder.ToStringBuilderTest.after(ToStringBuilderTest.java:48)

testReflectionShortArray(org.apache.commons.lang3.builder.ToStringBuilderTest)  Time elapsed: 0.001 sec  <<< FAILURE!
org.junit.ComparisonFailure: expected:<...S@9b92078[{1,2,-3,4}[]]> but was:<...S@9b92078[{1,2,-3,4}[<null>]>
	at org.junit.Assert.assertEquals(Assert.java:115)
	at org.junit.Assert.assertEquals(Assert.java:144)
	at org.apache.commons.lang3.builder.ToStringBuilderTest.testReflectionShortArray(ToStringBuilderTest.java:187)

testReflectionShortArray(org.apache.commons.lang3.builder.ToStringBuilderTest)  Time elapsed: 0.001 sec  <<< ERROR!
java.util.ConcurrentModificationException: null
	at java.util.WeakHashMap$HashIterator.nextEntry(WeakHashMap.java:882)
	at java.util.WeakHashMap$EntryIterator.next(WeakHashMap.java:921)
	at java.util.WeakHashMap$EntryIterator.next(WeakHashMap.java:919)
	at java.util.AbstractMap.toString(AbstractMap.java:518)
	at java.lang.String.valueOf(String.java:2847)
	at java.lang.StringBuilder.append(StringBuilder.java:128)
	at org.apache.commons.lang3.builder.ToStringBuilderTest.validateNullToStringStyleRegistry(ToStringBuilderTest.java:595)
	at org.apache.commons.lang3.builder.ToStringBuilderTest.after(ToStringBuilderTest.java:48)

testCharArrayArray(org.apache.commons.lang3.builder.ToStringBuilderTest)  Time elapsed: 0 sec  <<< FAILURE!
org.junit.ComparisonFailure: expected:<...b[{{A,B},<null>,{p}}[]]> but was:<...b[{{A,B},<null>,{p}}[,<null>]>
	at org.junit.Assert.assertEquals(Assert.java:115)
	at org.junit.Assert.assertEquals(Assert.java:144)
	at org.apache.commons.lang3.builder.ToStringBuilderTest.testCharArrayArray(ToStringBuilderTest.java:847)

testCharArrayArray(org.apache.commons.lang3.builder.ToStringBuilderTest)  Time elapsed: 0 sec  <<< ERROR!
java.util.ConcurrentModificationException: null
	at java.util.WeakHashMap$HashIterator.nextEntry(WeakHashMap.java:882)
	at java.util.WeakHashMap$EntryIterator.next(WeakHashMap.java:921)
	at java.util.WeakHashMap$EntryIterator.next(WeakHashMap.java:919)
	at java.util.AbstractMap.toString(AbstractMap.java:518)
	at java.lang.String.valueOf(String.java:2847)
	at java.lang.StringBuilder.append(StringBuilder.java:128)
	at org.apache.commons.lang3.builder.ToStringBuilderTest.validateNullToStringStyleRegistry(ToStringBuilderTest.java:595)
	at org.apache.commons.lang3.builder.ToStringBuilderTest.after(ToStringBuilderTest.java:48)

testSelfInstanceVarReflectionObjectCycle(org.apache.commons.lang3.builder.ToStringBuilderTest)  Time elapsed: 0.001 sec  <<< FAILURE!
org.junit.ComparisonFailure: expected:<...TestFixture@5cddf1df[]]> but was:<...TestFixture@5cddf1df[,<null>]>
	at org.junit.Assert.assertEquals(Assert.java:115)
	at org.junit.Assert.assertEquals(Assert.java:144)
	at org.apache.commons.lang3.builder.ToStringBuilderTest.testSelfInstanceVarReflectionObjectCycle(ToStringBuilderTest.java:539)

testSelfInstanceVarReflectionObjectCycle(org.apache.commons.lang3.builder.ToStringBuilderTest)  Time elapsed: 0.002 sec  <<< ERROR!
java.util.ConcurrentModificationException: null
	at java.util.WeakHashMap$HashIterator.nextEntry(WeakHashMap.java:882)
	at java.util.WeakHashMap$EntryIterator.next(WeakHashMap.java:921)
	at java.util.WeakHashMap$EntryIterator.next(WeakHashMap.java:919)
	at java.util.AbstractMap.toString(AbstractMap.java:518)
	at java.lang.String.valueOf(String.java:2847)
	at java.lang.StringBuilder.append(StringBuilder.java:128)
	at org.apache.commons.lang3.builder.ToStringBuilderTest.validateNullToStringStyleRegistry(ToStringBuilderTest.java:595)
	at org.apache.commons.lang3.builder.ToStringBuilderTest.after(ToStringBuilderTest.java:48)

testObject(org.apache.commons.lang3.builder.ToStringBuilderTest)  Time elapsed: 0.001 sec  <<< FAILURE!
org.junit.ComparisonFailure: expected:<...eger@3edcbc7b[<null>[]]> but was:<...eger@3edcbc7b[<null>[,<null>]>
	at org.junit.Assert.assertEquals(Assert.java:115)
	at org.junit.Assert.assertEquals(Assert.java:144)
	at org.apache.commons.lang3.builder.ToStringBuilderTest.testObject(ToStringBuilderTest.java:623)

testObject(org.apache.commons.lang3.builder.ToStringBuilderTest)  Time elapsed: 0.001 sec  <<< ERROR!
java.util.ConcurrentModificationException: null
	at java.util.WeakHashMap$HashIterator.nextEntry(WeakHashMap.java:882)
	at java.util.WeakHashMap$EntryIterator.next(WeakHashMap.java:921)
	at java.util.WeakHashMap$EntryIterator.next(WeakHashMap.java:919)
	at java.util.AbstractMap.toString(AbstractMap.java:518)
	at java.lang.String.valueOf(String.java:2847)
	at java.lang.StringBuilder.append(StringBuilder.java:128)
	at org.apache.commons.lang3.builder.ToStringBuilderTest.validateNullToStringStyleRegistry(ToStringBuilderTest.java:595)
	at org.apache.commons.lang3.builder.ToStringBuilderTest.after(ToStringBuilderTest.java:48)

testAppendSuper(org.apache.commons.lang3.builder.ToStringBuilderTest)  Time elapsed: 0.001 sec  <<< FAILURE!
org.junit.ComparisonFailure: expected:<...ng.Integer@3edcbc7b[[]]> but was:<...ng.Integer@3edcbc7b[[<null>]>
	at org.junit.Assert.assertEquals(Assert.java:115)
	at org.junit.Assert.assertEquals(Assert.java:144)
	at org.apache.commons.lang3.builder.ToStringBuilderTest.testAppendSuper(ToStringBuilderTest.java:601)

testAppendSuper(org.apache.commons.lang3.builder.ToStringBuilderTest)  Time elapsed: 0.001 sec  <<< ERROR!
java.util.ConcurrentModificationException: null
	at java.util.WeakHashMap$HashIterator.nextEntry(WeakHashMap.java:882)
	at java.util.WeakHashMap$EntryIterator.next(WeakHashMap.java:921)
	at java.util.WeakHashMap$EntryIterator.next(WeakHashMap.java:919)
	at java.util.AbstractMap.toString(AbstractMap.java:518)
	at java.lang.String.valueOf(String.java:2847)
	at java.lang.StringBuilder.append(StringBuilder.java:128)
	at org.apache.commons.lang3.builder.ToStringBuilderTest.validateNullToStringStyleRegistry(ToStringBuilderTest.java:595)
	at org.apache.commons.lang3.builder.ToStringBuilderTest.after(ToStringBuilderTest.java:48)

testReflectionIntArray(org.apache.commons.lang3.builder.ToStringBuilderTest)  Time elapsed: 0 sec  <<< FAILURE!
org.junit.ComparisonFailure: expected:<...@625e64fe[{1,2,-3,4}[]]> but was:<...@625e64fe[{1,2,-3,4}[<null>]>
	at org.junit.Assert.assertEquals(Assert.java:115)
	at org.junit.Assert.assertEquals(Assert.java:144)
	at org.apache.commons.lang3.builder.ToStringBuilderTest.testReflectionIntArray(ToStringBuilderTest.java:178)

testReflectionIntArray(org.apache.commons.lang3.builder.ToStringBuilderTest)  Time elapsed: 0.001 sec  <<< ERROR!
java.util.ConcurrentModificationException: null
	at java.util.WeakHashMap$HashIterator.nextEntry(WeakHashMap.java:882)
	at java.util.WeakHashMap$EntryIterator.next(WeakHashMap.java:921)
	at java.util.WeakHashMap$EntryIterator.next(WeakHashMap.java:919)
	at java.util.AbstractMap.toString(AbstractMap.java:518)
	at java.lang.String.valueOf(String.java:2847)
	at java.lang.StringBuilder.append(StringBuilder.java:128)
	at org.apache.commons.lang3.builder.ToStringBuilderTest.validateNullToStringStyleRegistry(ToStringBuilderTest.java:595)
	at org.apache.commons.lang3.builder.ToStringBuilderTest.after(ToStringBuilderTest.java:48)

testReflectionCharArray(org.apache.commons.lang3.builder.ToStringBuilderTest)  Time elapsed: 0.001 sec  <<< FAILURE!
org.junit.ComparisonFailure: expected:<...C@23389226[{A,2,_,D}[]]> but was:<...C@23389226[{A,2,_,D}[<null>]>
	at org.junit.Assert.assertEquals(Assert.java:115)
	at org.junit.Assert.assertEquals(Assert.java:144)
	at org.apache.commons.lang3.builder.ToStringBuilderTest.testReflectionCharArray(ToStringBuilderTest.java:205)

testReflectionCharArray(org.apache.commons.lang3.builder.ToStringBuilderTest)  Time elapsed: 0.001 sec  <<< ERROR!
java.util.ConcurrentModificationException: null
	at java.util.WeakHashMap$HashIterator.nextEntry(WeakHashMap.java:882)
	at java.util.WeakHashMap$EntryIterator.next(WeakHashMap.java:921)
	at java.util.WeakHashMap$EntryIterator.next(WeakHashMap.java:919)
	at java.util.AbstractMap.toString(AbstractMap.java:518)
	at java.lang.String.valueOf(String.java:2847)
	at java.lang.StringBuilder.append(StringBuilder.java:128)
	at org.apache.commons.lang3.builder.ToStringBuilderTest.validateNullToStringStyleRegistry(ToStringBuilderTest.java:595)
	at org.apache.commons.lang3.builder.ToStringBuilderTest.after(ToStringBuilderTest.java:48)

testGetSetDefault(org.apache.commons.lang3.builder.ToStringBuilderTest)  Time elapsed: 0.001 sec  <<< ERROR!
java.util.ConcurrentModificationException: null
	at java.util.WeakHashMap$HashIterator.nextEntry(WeakHashMap.java:882)
	at java.util.WeakHashMap$EntryIterator.next(WeakHashMap.java:921)
	at java.util.WeakHashMap$EntryIterator.next(WeakHashMap.java:919)
	at java.util.AbstractMap.toString(AbstractMap.java:518)
	at java.lang.String.valueOf(String.java:2847)
	at java.lang.StringBuilder.append(StringBuilder.java:128)
	at org.apache.commons.lang3.builder.ToStringBuilderTest.validateNullToStringStyleRegistry(ToStringBuilderTest.java:595)
	at org.apache.commons.lang3.builder.ToStringBuilderTest.after(ToStringBuilderTest.java:48)

testInnerClassReflection(org.apache.commons.lang3.builder.ToStringBuilderTest)  Time elapsed: 0.002 sec  <<< FAILURE!
org.junit.ComparisonFailure: expected:<...uter$Inner@30ec6243[[]]]> but was:<...uter$Inner@30ec6243[[<null>,<null>]>
	at org.junit.Assert.assertEquals(Assert.java:115)
	at org.junit.Assert.assertEquals(Assert.java:144)
	at org.apache.commons.lang3.builder.ToStringBuilderTest.testInnerClassReflection(ToStringBuilderTest.java:376)

testInnerClassReflection(org.apache.commons.lang3.builder.ToStringBuilderTest)  Time elapsed: 0.003 sec  <<< ERROR!
java.util.ConcurrentModificationException: null
	at java.util.WeakHashMap$HashIterator.nextEntry(WeakHashMap.java:882)
	at java.util.WeakHashMap$EntryIterator.next(WeakHashMap.java:921)
	at java.util.WeakHashMap$EntryIterator.next(WeakHashMap.java:919)
	at java.util.AbstractMap.toString(AbstractMap.java:518)
	at java.lang.String.valueOf(String.java:2847)
	at java.lang.StringBuilder.append(StringBuilder.java:128)
	at org.apache.commons.lang3.builder.ToStringBuilderTest.validateNullToStringStyleRegistry(ToStringBuilderTest.java:595)
	at org.apache.commons.lang3.builder.ToStringBuilderTest.after(ToStringBuilderTest.java:48)

testReflectionCharacter(org.apache.commons.lang3.builder.ToStringBuilderTest)  Time elapsed: 0.001 sec  <<< FAILURE!
org.junit.ComparisonFailure: expected:<...ter@4d40cc82[value=A[]]> but was:<...ter@4d40cc82[value=A[,<null>]>
	at org.junit.Assert.assertEquals(Assert.java:115)
	at org.junit.Assert.assertEquals(Assert.java:144)
	at org.apache.commons.lang3.builder.ToStringBuilderTest.testReflectionCharacter(ToStringBuilderTest.java:106)

testReflectionCharacter(org.apache.commons.lang3.builder.ToStringBuilderTest)  Time elapsed: 0.001 sec  <<< ERROR!
java.util.ConcurrentModificationException: null
	at java.util.WeakHashMap$HashIterator.nextEntry(WeakHashMap.java:882)
	at java.util.WeakHashMap$EntryIterator.next(WeakHashMap.java:921)
	at java.util.WeakHashMap$EntryIterator.next(WeakHashMap.java:919)
	at java.util.AbstractMap.toString(AbstractMap.java:518)
	at java.lang.String.valueOf(String.java:2847)
	at java.lang.StringBuilder.append(StringBuilder.java:128)
	at org.apache.commons.lang3.builder.ToStringBuilderTest.validateNullToStringStyleRegistry(ToStringBuilderTest.java:595)
	at org.apache.commons.lang3.builder.ToStringBuilderTest.after(ToStringBuilderTest.java:48)

testDoubleArray(org.apache.commons.lang3.builder.ToStringBuilderTest)  Time elapsed: 0.001 sec  <<< FAILURE!
org.junit.ComparisonFailure: expected:<...2.9876,-3.00001,4.3}[]]> but was:<...2.9876,-3.00001,4.3}[,<null>]>
	at org.junit.Assert.assertEquals(Assert.java:115)
	at org.junit.Assert.assertEquals(Assert.java:144)
	at org.apache.commons.lang3.builder.ToStringBuilderTest.testDoubleArray(ToStringBuilderTest.java:777)

testDoubleArray(org.apache.commons.lang3.builder.ToStringBuilderTest)  Time elapsed: 0.001 sec  <<< ERROR!
java.util.ConcurrentModificationException: null
	at java.util.WeakHashMap$HashIterator.nextEntry(WeakHashMap.java:882)
	at java.util.WeakHashMap$EntryIterator.next(WeakHashMap.java:921)
	at java.util.WeakHashMap$EntryIterator.next(WeakHashMap.java:919)
	at java.util.AbstractMap.toString(AbstractMap.java:518)
	at java.lang.String.valueOf(String.java:2847)
	at java.lang.StringBuilder.append(StringBuilder.java:128)
	at org.apache.commons.lang3.builder.ToStringBuilderTest.validateNullToStringStyleRegistry(ToStringBuilderTest.java:595)
	at org.apache.commons.lang3.builder.ToStringBuilderTest.after(ToStringBuilderTest.java:48)

testReflectionFloatArrayArray(org.apache.commons.lang3.builder.ToStringBuilderTest)  Time elapsed: 0.001 sec  <<< FAILURE!
org.junit.ComparisonFailure: expected:<...29686},<null>,{NaN}}[]]> but was:<...29686},<null>,{NaN}}[<null>]>
	at org.junit.Assert.assertEquals(Assert.java:115)
	at org.junit.Assert.assertEquals(Assert.java:144)
	at org.apache.commons.lang3.builder.ToStringBuilderTest.testReflectionFloatArrayArray(ToStringBuilderTest.java:243)

testReflectionFloatArrayArray(org.apache.commons.lang3.builder.ToStringBuilderTest)  Time elapsed: 0.001 sec  <<< ERROR!
java.util.ConcurrentModificationException: null
	at java.util.WeakHashMap$HashIterator.nextEntry(WeakHashMap.java:882)
	at java.util.WeakHashMap$EntryIterator.next(WeakHashMap.java:921)
	at java.util.WeakHashMap$EntryIterator.next(WeakHashMap.java:919)
	at java.util.AbstractMap.toString(AbstractMap.java:518)
	at java.lang.String.valueOf(String.java:2847)
	at java.lang.StringBuilder.append(StringBuilder.java:128)
	at org.apache.commons.lang3.builder.ToStringBuilderTest.validateNullToStringStyleRegistry(ToStringBuilderTest.java:595)
	at org.apache.commons.lang3.builder.ToStringBuilderTest.after(ToStringBuilderTest.java:48)

Running org.apache.commons.lang3.builder.EqualsBuilderTest
Tests run: 48, Failures: 0, Errors: 0, Skipped: 0, Time elapsed: 0.003 sec - in org.apache.commons.lang3.builder.EqualsBuilderTest
Running org.apache.commons.lang3.builder.HashCodeBuilderAndEqualsBuilderTest
Tests run: 4, Failures: 0, Errors: 0, Skipped: 0, Time elapsed: 0.001 sec - in org.apache.commons.lang3.builder.HashCodeBuilderAndEqualsBuilderTest
Running org.apache.commons.lang3.builder.ReflectionToStringBuilderConcurrencyTest
Tests run: 3, Failures: 0, Errors: 0, Skipped: 3, Time elapsed: 0 sec - in org.apache.commons.lang3.builder.ReflectionToStringBuilderConcurrencyTest
Running org.apache.commons.lang3.builder.JsonToStringStyleTest
Tests run: 9, Failures: 6, Errors: 0, Skipped: 0, Time elapsed: 0.004 sec <<< FAILURE! - in org.apache.commons.lang3.builder.JsonToStringStyleTest
testBlank(org.apache.commons.lang3.builder.JsonToStringStyleTest)  Time elapsed: 0 sec  <<< FAILURE!
org.junit.ComparisonFailure: expected:<{[}]> but was:<{[null]>
	at org.junit.Assert.assertEquals(Assert.java:115)
	at org.junit.Assert.assertEquals(Assert.java:144)
	at org.apache.commons.lang3.builder.JsonToStringStyleTest.testBlank(JsonToStringStyleTest.java:59)

testLong(org.apache.commons.lang3.builder.JsonToStringStyleTest)  Time elapsed: 0 sec  <<< FAILURE!
org.junit.ComparisonFailure: expected:<{"a":3[}]> but was:<{"a":3[,null]>
	at org.junit.Assert.assertEquals(Assert.java:115)
	at org.junit.Assert.assertEquals(Assert.java:144)
	at org.apache.commons.lang3.builder.JsonToStringStyleTest.testLong(JsonToStringStyleTest.java:208)

testNull(org.apache.commons.lang3.builder.JsonToStringStyleTest)  Time elapsed: 0 sec  <<< FAILURE!
org.junit.ComparisonFailure: expected:<[null]> but was:<[}]>
	at org.junit.Assert.assertEquals(Assert.java:115)
	at org.junit.Assert.assertEquals(Assert.java:144)
	at org.apache.commons.lang3.builder.JsonToStringStyleTest.testNull(JsonToStringStyleTest.java:54)

testObject(org.apache.commons.lang3.builder.JsonToStringStyleTest)  Time elapsed: 0.003 sec  <<< FAILURE!
org.junit.ComparisonFailure: expected:<{"a":null[}]> but was:<{"a":null[,null]>
	at org.junit.Assert.assertEquals(Assert.java:115)
	at org.junit.Assert.assertEquals(Assert.java:144)
	at org.apache.commons.lang3.builder.JsonToStringStyleTest.testObject(JsonToStringStyleTest.java:112)

testPerson(org.apache.commons.lang3.builder.JsonToStringStyleTest)  Time elapsed: 0 sec  <<< FAILURE!
org.junit.ComparisonFailure: expected:<...ge":25,"smoker":true[}]> but was:<...ge":25,"smoker":true[,null]>
	at org.junit.Assert.assertEquals(Assert.java:115)
	at org.junit.Assert.assertEquals(Assert.java:144)
	at org.apache.commons.lang3.builder.JsonToStringStyleTest.testPerson(JsonToStringStyleTest.java:192)

testAppendSuper(org.apache.commons.lang3.builder.JsonToStringStyleTest)  Time elapsed: 0.001 sec  <<< FAILURE!
org.junit.ComparisonFailure: expected:<{[}]> but was:<{[null]>
	at org.junit.Assert.assertEquals(Assert.java:115)
	at org.junit.Assert.assertEquals(Assert.java:144)
	at org.apache.commons.lang3.builder.JsonToStringStyleTest.testAppendSuper(JsonToStringStyleTest.java:64)

Running org.apache.commons.lang3.builder.NoClassNameToStringStyleTest
Tests run: 8, Failures: 8, Errors: 0, Skipped: 0, Time elapsed: 0.003 sec <<< FAILURE! - in org.apache.commons.lang3.builder.NoClassNameToStringStyleTest
testObjectArray(org.apache.commons.lang3.builder.NoClassNameToStringStyleTest)  Time elapsed: 0 sec  <<< FAILURE!
org.junit.ComparisonFailure: expected:<[{<null>,5,{3,6}}[]]> but was:<[{<null>,5,{3,6}}[,<null>]>
	at org.junit.Assert.assertEquals(Assert.java:115)
	at org.junit.Assert.assertEquals(Assert.java:144)
	at org.apache.commons.lang3.builder.NoClassNameToStringStyleTest.testObjectArray(NoClassNameToStringStyleTest.java:102)

testBlank(org.apache.commons.lang3.builder.NoClassNameToStringStyleTest)  Time elapsed: 0 sec  <<< FAILURE!
org.junit.ComparisonFailure: expected:<[[]]> but was:<[[<null>]>
	at org.junit.Assert.assertEquals(Assert.java:115)
	at org.junit.Assert.assertEquals(Assert.java:144)
	at org.apache.commons.lang3.builder.NoClassNameToStringStyleTest.testBlank(NoClassNameToStringStyleTest.java:52)

testLong(org.apache.commons.lang3.builder.NoClassNameToStringStyleTest)  Time elapsed: 0 sec  <<< FAILURE!
org.junit.ComparisonFailure: expected:<[3[]]> but was:<[3[,<null>]>
	at org.junit.Assert.assertEquals(Assert.java:115)
	at org.junit.Assert.assertEquals(Assert.java:144)
	at org.apache.commons.lang3.builder.NoClassNameToStringStyleTest.testLong(NoClassNameToStringStyleTest.java:94)

testLongArrayArray(org.apache.commons.lang3.builder.NoClassNameToStringStyleTest)  Time elapsed: 0 sec  <<< FAILURE!
org.junit.ComparisonFailure: expected:<[{{1,2},<null>,{5}}[]]> but was:<[{{1,2},<null>,{5}}[,<null>]>
	at org.junit.Assert.assertEquals(Assert.java:115)
	at org.junit.Assert.assertEquals(Assert.java:144)
	at org.apache.commons.lang3.builder.NoClassNameToStringStyleTest.testLongArrayArray(NoClassNameToStringStyleTest.java:122)

testLongArray(org.apache.commons.lang3.builder.NoClassNameToStringStyleTest)  Time elapsed: 0 sec  <<< FAILURE!
org.junit.ComparisonFailure: expected:<[{1,2,-3,4}[]]> but was:<[{1,2,-3,4}[,<null>]>
	at org.junit.Assert.assertEquals(Assert.java:115)
	at org.junit.Assert.assertEquals(Assert.java:144)
	at org.apache.commons.lang3.builder.NoClassNameToStringStyleTest.testLongArray(NoClassNameToStringStyleTest.java:112)

testObject(org.apache.commons.lang3.builder.NoClassNameToStringStyleTest)  Time elapsed: 0 sec  <<< FAILURE!
org.junit.ComparisonFailure: expected:<[<null>[]]> but was:<[<null>[,<null>]>
	at org.junit.Assert.assertEquals(Assert.java:115)
	at org.junit.Assert.assertEquals(Assert.java:144)
	at org.apache.commons.lang3.builder.NoClassNameToStringStyleTest.testObject(NoClassNameToStringStyleTest.java:69)

testPerson(org.apache.commons.lang3.builder.NoClassNameToStringStyleTest)  Time elapsed: 0.001 sec  <<< FAILURE!
org.junit.ComparisonFailure: expected:<...c,age=45,smoker=true[]]> but was:<...c,age=45,smoker=true[,<null>]>
	at org.junit.Assert.assertEquals(Assert.java:115)
	at org.junit.Assert.assertEquals(Assert.java:144)
	at org.apache.commons.lang3.builder.NoClassNameToStringStyleTest.testPerson(NoClassNameToStringStyleTest.java:89)

testAppendSuper(org.apache.commons.lang3.builder.NoClassNameToStringStyleTest)  Time elapsed: 0 sec  <<< FAILURE!
org.junit.ComparisonFailure: expected:<[[]]> but was:<[[<null>]>
	at org.junit.Assert.assertEquals(Assert.java:115)
	at org.junit.Assert.assertEquals(Assert.java:144)
	at org.apache.commons.lang3.builder.NoClassNameToStringStyleTest.testAppendSuper(NoClassNameToStringStyleTest.java:57)

Running org.apache.commons.lang3.builder.DiffBuilderTest
Tests run: 30, Failures: 0, Errors: 0, Skipped: 0, Time elapsed: 0.028 sec - in org.apache.commons.lang3.builder.DiffBuilderTest
Running org.apache.commons.lang3.builder.HashCodeBuilderTest
Tests run: 44, Failures: 0, Errors: 0, Skipped: 0, Time elapsed: 0.015 sec - in org.apache.commons.lang3.builder.HashCodeBuilderTest
Running org.apache.commons.lang3.concurrent.AtomicInitializerTest
Tests run: 3, Failures: 0, Errors: 0, Skipped: 0, Time elapsed: 0.004 sec - in org.apache.commons.lang3.concurrent.AtomicInitializerTest
Running org.apache.commons.lang3.concurrent.CallableBackgroundInitializerTest
Tests run: 4, Failures: 0, Errors: 0, Skipped: 0, Time elapsed: 0.002 sec - in org.apache.commons.lang3.concurrent.CallableBackgroundInitializerTest
Running org.apache.commons.lang3.concurrent.BackgroundInitializerTest
Tests run: 15, Failures: 0, Errors: 0, Skipped: 0, Time elapsed: 0.012 sec - in org.apache.commons.lang3.concurrent.BackgroundInitializerTest
Running org.apache.commons.lang3.concurrent.LazyInitializerTest
Tests run: 3, Failures: 0, Errors: 0, Skipped: 0, Time elapsed: 0.007 sec - in org.apache.commons.lang3.concurrent.LazyInitializerTest
Running org.apache.commons.lang3.concurrent.BasicThreadFactoryTest
Tests run: 15, Failures: 0, Errors: 0, Skipped: 0, Time elapsed: 0.028 sec - in org.apache.commons.lang3.concurrent.BasicThreadFactoryTest
Running org.apache.commons.lang3.concurrent.ConstantInitializerTest
Tests run: 7, Failures: 0, Errors: 0, Skipped: 0, Time elapsed: 0 sec - in org.apache.commons.lang3.concurrent.ConstantInitializerTest
Running org.apache.commons.lang3.concurrent.MultiBackgroundInitializerTest
Tests run: 17, Failures: 0, Errors: 0, Skipped: 0, Time elapsed: 0.041 sec - in org.apache.commons.lang3.concurrent.MultiBackgroundInitializerTest
Running org.apache.commons.lang3.concurrent.AtomicSafeInitializerTest
Tests run: 4, Failures: 0, Errors: 0, Skipped: 0, Time elapsed: 0.008 sec - in org.apache.commons.lang3.concurrent.AtomicSafeInitializerTest
Running org.apache.commons.lang3.concurrent.ConcurrentUtilsTest
Tests run: 40, Failures: 0, Errors: 0, Skipped: 0, Time elapsed: 0.014 sec - in org.apache.commons.lang3.concurrent.ConcurrentUtilsTest
Running org.apache.commons.lang3.concurrent.TimedSemaphoreTest
Tests run: 15, Failures: 0, Errors: 0, Skipped: 0, Time elapsed: 1.187 sec - in org.apache.commons.lang3.concurrent.TimedSemaphoreTest
Running org.apache.commons.lang3.StringUtilsSubstringTest
Tests run: 14, Failures: 0, Errors: 0, Skipped: 0, Time elapsed: 0.006 sec - in org.apache.commons.lang3.StringUtilsSubstringTest
Running org.apache.commons.lang3.SystemUtilsTest
Tests run: 12, Failures: 0, Errors: 0, Skipped: 0, Time elapsed: 0.005 sec - in org.apache.commons.lang3.SystemUtilsTest
Running org.apache.commons.lang3.CharRangeTest
Tests run: 16, Failures: 0, Errors: 0, Skipped: 0, Time elapsed: 0.04 sec - in org.apache.commons.lang3.CharRangeTest
Running org.apache.commons.lang3.CharSetTest
Tests run: 14, Failures: 0, Errors: 0, Skipped: 0, Time elapsed: 0.009 sec - in org.apache.commons.lang3.CharSetTest
Running org.apache.commons.lang3.StringUtilsStartsEndsWithTest
Tests run: 6, Failures: 0, Errors: 0, Skipped: 0, Time elapsed: 0.001 sec - in org.apache.commons.lang3.StringUtilsStartsEndsWithTest
Running org.apache.commons.lang3.RandomStringUtilsTest
Tests run: 11, Failures: 0, Errors: 0, Skipped: 0, Time elapsed: 0.001 sec - in org.apache.commons.lang3.RandomStringUtilsTest
Running org.apache.commons.lang3.SerializationUtilsTest
Tests run: 26, Failures: 0, Errors: 0, Skipped: 0, Time elapsed: 0.055 sec - in org.apache.commons.lang3.SerializationUtilsTest
Running org.apache.commons.lang3.time.StopWatchTest
Tests run: 8, Failures: 0, Errors: 0, Skipped: 0, Time elapsed: 4.759 sec - in org.apache.commons.lang3.time.StopWatchTest
Running org.apache.commons.lang3.time.DateUtilsRoundingTest
Tests run: 22, Failures: 0, Errors: 0, Skipped: 0, Time elapsed: 0.143 sec - in org.apache.commons.lang3.time.DateUtilsRoundingTest
Running org.apache.commons.lang3.time.FastDateParserTest
Tests run: 33, Failures: 0, Errors: 0, Skipped: 0, Time elapsed: 2.22 sec - in org.apache.commons.lang3.time.FastDateParserTest
Running org.apache.commons.lang3.time.FastDateFormat_ParserTest
Tests run: 33, Failures: 0, Errors: 0, Skipped: 0, Time elapsed: 0.842 sec - in org.apache.commons.lang3.time.FastDateFormat_ParserTest
Running org.apache.commons.lang3.time.DurationFormatUtilsTest
Tests run: 25, Failures: 0, Errors: 0, Skipped: 0, Time elapsed: 0.967 sec - in org.apache.commons.lang3.time.DurationFormatUtilsTest
Running org.apache.commons.lang3.time.DateFormatUtilsTest
Tests run: 10, Failures: 0, Errors: 0, Skipped: 0, Time elapsed: 0.003 sec - in org.apache.commons.lang3.time.DateFormatUtilsTest
Running org.apache.commons.lang3.time.DateUtilsFragmentTest
Tests run: 57, Failures: 0, Errors: 0, Skipped: 0, Time elapsed: 0.01 sec - in org.apache.commons.lang3.time.DateUtilsFragmentTest
Running org.apache.commons.lang3.time.FastDatePrinterTimeZonesTest
Tests run: 617, Failures: 0, Errors: 0, Skipped: 0, Time elapsed: 0.229 sec - in org.apache.commons.lang3.time.FastDatePrinterTimeZonesTest
Running org.apache.commons.lang3.time.FastDateFormatTest
>>FastDateFormatTest: FastDateParser:22632  SimpleDateFormat:3616
Tests run: 14, Failures: 0, Errors: 0, Skipped: 0, Time elapsed: 2.94 sec - in org.apache.commons.lang3.time.FastDateFormatTest
Running org.apache.commons.lang3.time.FastDateFormat_PrinterTest
Tests run: 17, Failures: 0, Errors: 0, Skipped: 0, Time elapsed: 0.011 sec - in org.apache.commons.lang3.time.FastDateFormat_PrinterTest
Running org.apache.commons.lang3.time.FastDatePrinterTest
Tests run: 17, Failures: 0, Errors: 0, Skipped: 0, Time elapsed: 0.004 sec - in org.apache.commons.lang3.time.FastDatePrinterTest
Running org.apache.commons.lang3.time.FastDateParserSDFTest
Tests run: 276, Failures: 0, Errors: 0, Skipped: 92, Time elapsed: 0.055 sec - in org.apache.commons.lang3.time.FastDateParserSDFTest
Running org.apache.commons.lang3.time.DateUtilsTest
DateUtilsTest: Default Locale=en_US
Tests run: 38, Failures: 0, Errors: 0, Skipped: 0, Time elapsed: 0.026 sec - in org.apache.commons.lang3.time.DateUtilsTest
Running org.apache.commons.lang3.reflect.InheritanceUtilsTest
Tests run: 9, Failures: 0, Errors: 0, Skipped: 0, Time elapsed: 0.002 sec - in org.apache.commons.lang3.reflect.InheritanceUtilsTest
Running org.apache.commons.lang3.reflect.MethodUtilsTest
Tests run: 23, Failures: 0, Errors: 0, Skipped: 0, Time elapsed: 0.032 sec - in org.apache.commons.lang3.reflect.MethodUtilsTest
Running org.apache.commons.lang3.reflect.ConstructorUtilsTest
Tests run: 7, Failures: 0, Errors: 0, Skipped: 0, Time elapsed: 0.005 sec - in org.apache.commons.lang3.reflect.ConstructorUtilsTest
Running org.apache.commons.lang3.reflect.FieldUtilsTest
Tests run: 64, Failures: 0, Errors: 0, Skipped: 0, Time elapsed: 0.029 sec - in org.apache.commons.lang3.reflect.FieldUtilsTest
Running org.apache.commons.lang3.reflect.TypeLiteralTest
Tests run: 4, Failures: 0, Errors: 0, Skipped: 0, Time elapsed: 0.004 sec - in org.apache.commons.lang3.reflect.TypeLiteralTest
Running org.apache.commons.lang3.reflect.TypeUtilsTest
Tests run: 19, Failures: 0, Errors: 0, Skipped: 0, Time elapsed: 0.039 sec - in org.apache.commons.lang3.reflect.TypeUtilsTest
Running org.apache.commons.lang3.mutable.MutableByteTest
Tests run: 17, Failures: 0, Errors: 0, Skipped: 0, Time elapsed: 0.004 sec - in org.apache.commons.lang3.mutable.MutableByteTest
Running org.apache.commons.lang3.mutable.MutableShortTest
Tests run: 14, Failures: 0, Errors: 0, Skipped: 0, Time elapsed: 0 sec - in org.apache.commons.lang3.mutable.MutableShortTest
Running org.apache.commons.lang3.mutable.MutableIntTest
Tests run: 17, Failures: 0, Errors: 0, Skipped: 0, Time elapsed: 0.002 sec - in org.apache.commons.lang3.mutable.MutableIntTest
Running org.apache.commons.lang3.mutable.MutableDoubleTest
Tests run: 18, Failures: 0, Errors: 0, Skipped: 0, Time elapsed: 0.003 sec - in org.apache.commons.lang3.mutable.MutableDoubleTest
Running org.apache.commons.lang3.mutable.MutableFloatTest
Tests run: 18, Failures: 0, Errors: 0, Skipped: 0, Time elapsed: 0.003 sec - in org.apache.commons.lang3.mutable.MutableFloatTest
Running org.apache.commons.lang3.mutable.MutableLongTest
Tests run: 17, Failures: 0, Errors: 0, Skipped: 0, Time elapsed: 0.002 sec - in org.apache.commons.lang3.mutable.MutableLongTest
Running org.apache.commons.lang3.mutable.MutableBooleanTest
Tests run: 9, Failures: 0, Errors: 0, Skipped: 0, Time elapsed: 0.005 sec - in org.apache.commons.lang3.mutable.MutableBooleanTest
Running org.apache.commons.lang3.mutable.MutableObjectTest
Tests run: 5, Failures: 0, Errors: 0, Skipped: 0, Time elapsed: 0 sec - in org.apache.commons.lang3.mutable.MutableObjectTest
Running org.apache.commons.lang3.text.translate.UnicodeEscaperTest
Tests run: 3, Failures: 0, Errors: 0, Skipped: 0, Time elapsed: 0 sec - in org.apache.commons.lang3.text.translate.UnicodeEscaperTest
Running org.apache.commons.lang3.text.translate.EntityArraysTest
Tests run: 3, Failures: 0, Errors: 0, Skipped: 0, Time elapsed: 0.001 sec - in org.apache.commons.lang3.text.translate.EntityArraysTest
Running org.apache.commons.lang3.text.translate.UnicodeUnpairedSurrogateRemoverTest
Tests run: 2, Failures: 0, Errors: 0, Skipped: 0, Time elapsed: 0 sec - in org.apache.commons.lang3.text.translate.UnicodeUnpairedSurrogateRemoverTest
Running org.apache.commons.lang3.text.translate.NumericEntityUnescaperTest
Tests run: 3, Failures: 0, Errors: 0, Skipped: 0, Time elapsed: 0 sec - in org.apache.commons.lang3.text.translate.NumericEntityUnescaperTest
Running org.apache.commons.lang3.text.translate.NumericEntityEscaperTest
Tests run: 4, Failures: 0, Errors: 0, Skipped: 0, Time elapsed: 0 sec - in org.apache.commons.lang3.text.translate.NumericEntityEscaperTest
Running org.apache.commons.lang3.text.translate.LookupTranslatorTest
Tests run: 2, Failures: 0, Errors: 0, Skipped: 0, Time elapsed: 0.001 sec - in org.apache.commons.lang3.text.translate.LookupTranslatorTest
Running org.apache.commons.lang3.text.translate.UnicodeUnescaperTest
Tests run: 3, Failures: 0, Errors: 0, Skipped: 0, Time elapsed: 0.001 sec - in org.apache.commons.lang3.text.translate.UnicodeUnescaperTest
Running org.apache.commons.lang3.text.translate.OctalUnescaperTest
Tests run: 1, Failures: 0, Errors: 0, Skipped: 0, Time elapsed: 0 sec - in org.apache.commons.lang3.text.translate.OctalUnescaperTest
Running org.apache.commons.lang3.text.StrMatcherTest
Tests run: 14, Failures: 0, Errors: 0, Skipped: 0, Time elapsed: 0.001 sec - in org.apache.commons.lang3.text.StrMatcherTest
Running org.apache.commons.lang3.text.StrTokenizerTest
Tests run: 55, Failures: 0, Errors: 0, Skipped: 0, Time elapsed: 0.013 sec - in org.apache.commons.lang3.text.StrTokenizerTest
Running org.apache.commons.lang3.text.FormattableUtilsTest
Tests run: 5, Failures: 0, Errors: 0, Skipped: 0, Time elapsed: 0 sec - in org.apache.commons.lang3.text.FormattableUtilsTest
Running org.apache.commons.lang3.text.CompositeFormatTest
Tests run: 2, Failures: 0, Errors: 0, Skipped: 0, Time elapsed: 0 sec - in org.apache.commons.lang3.text.CompositeFormatTest
Running org.apache.commons.lang3.text.WordUtilsTest
Tests run: 12, Failures: 0, Errors: 0, Skipped: 0, Time elapsed: 0.004 sec - in org.apache.commons.lang3.text.WordUtilsTest
Running org.apache.commons.lang3.text.StrLookupTest
Tests run: 5, Failures: 0, Errors: 0, Skipped: 0, Time elapsed: 0.002 sec - in org.apache.commons.lang3.text.StrLookupTest
Running org.apache.commons.lang3.text.StrBuilderAppendInsertTest
Tests run: 51, Failures: 0, Errors: 0, Skipped: 0, Time elapsed: 0.01 sec - in org.apache.commons.lang3.text.StrBuilderAppendInsertTest
Running org.apache.commons.lang3.text.ExtendedMessageFormatTest
Tests run: 10, Failures: 0, Errors: 0, Skipped: 0, Time elapsed: 0.752 sec - in org.apache.commons.lang3.text.ExtendedMessageFormatTest
Running org.apache.commons.lang3.text.StrSubstitutorTest
Tests run: 40, Failures: 0, Errors: 0, Skipped: 0, Time elapsed: 0.042 sec - in org.apache.commons.lang3.text.StrSubstitutorTest
Running org.apache.commons.lang3.text.StrBuilderTest
Tests run: 90, Failures: 0, Errors: 0, Skipped: 0, Time elapsed: 0.043 sec - in org.apache.commons.lang3.text.StrBuilderTest
Running org.apache.commons.lang3.StringEscapeUtilsTest
Tests run: 28, Failures: 0, Errors: 0, Skipped: 0, Time elapsed: 0.352 sec - in org.apache.commons.lang3.StringEscapeUtilsTest
Running org.apache.commons.lang3.AnnotationUtilsTest
Tests run: 10, Failures: 1, Errors: 0, Skipped: 0, Time elapsed: 0.02 sec <<< FAILURE! - in org.apache.commons.lang3.AnnotationUtilsTest
testToString(org.apache.commons.lang3.AnnotationUtilsTest)  Time elapsed: 0.001 sec  <<< FAILURE!
java.lang.AssertionError: null
	at org.junit.Assert.fail(Assert.java:86)
	at org.junit.Assert.assertTrue(Assert.java:41)
	at org.junit.Assert.assertTrue(Assert.java:52)
	at org.apache.commons.lang3.AnnotationUtilsTest.testToString(AnnotationUtilsTest.java:502)

Running org.apache.commons.lang3.ConversionTest
Tests run: 42, Failures: 0, Errors: 0, Skipped: 0, Time elapsed: 0.013 sec - in org.apache.commons.lang3.ConversionTest
Running org.apache.commons.lang3.StringUtilsTrimEmptyTest
Tests run: 15, Failures: 0, Errors: 0, Skipped: 0, Time elapsed: 0.006 sec - in org.apache.commons.lang3.StringUtilsTrimEmptyTest
Running org.apache.commons.lang3.EnumUtilsTest
Tests run: 34, Failures: 0, Errors: 0, Skipped: 0, Time elapsed: 0.011 sec - in org.apache.commons.lang3.EnumUtilsTest
Running org.apache.commons.lang3.exception.ExceptionUtilsTest
Tests run: 28, Failures: 0, Errors: 0, Skipped: 0, Time elapsed: 0.024 sec - in org.apache.commons.lang3.exception.ExceptionUtilsTest
Running org.apache.commons.lang3.exception.DefaultExceptionContextTest
Tests run: 8, Failures: 0, Errors: 0, Skipped: 0, Time elapsed: 0.003 sec - in org.apache.commons.lang3.exception.DefaultExceptionContextTest
Running org.apache.commons.lang3.exception.ContextedExceptionTest
Tests run: 14, Failures: 0, Errors: 0, Skipped: 0, Time elapsed: 0.009 sec - in org.apache.commons.lang3.exception.ContextedExceptionTest
Running org.apache.commons.lang3.exception.ContextedRuntimeExceptionTest
Tests run: 14, Failures: 0, Errors: 0, Skipped: 0, Time elapsed: 0.009 sec - in org.apache.commons.lang3.exception.ContextedRuntimeExceptionTest
Running org.apache.commons.lang3.BitFieldTest
Tests run: 15, Failures: 0, Errors: 0, Skipped: 0, Time elapsed: 0.003 sec - in org.apache.commons.lang3.BitFieldTest
Running org.apache.commons.lang3.ArrayUtilsRemoveMultipleTest
Tests run: 55, Failures: 0, Errors: 0, Skipped: 0, Time elapsed: 0.009 sec - in org.apache.commons.lang3.ArrayUtilsRemoveMultipleTest
Running org.apache.commons.lang3.HashSetvBitSetTest
Ratio=9% array=100 count=1 extract=22210489 bitset=2016288
Ratio=10% array=100 count=10 extract=18493207 bitset=1856219
Ratio=9% array=100 count=50 extract=6062205 bitset=591264
Ratio=4% array=100 count=100 extract=9714511 bitset=419379
Ratio=81% array=1000 count=10 extract=6128269 bitset=4982745
Ratio=30% array=1000 count=100 extract=14504372 bitset=4393228
Ratio=7% array=1000 count=500 extract=41600473 bitset=2927480
Ratio=1% array=1000 count=1000 extract=69137862 bitset=744375
Ratio=4% count=0 hash=4559147 bits=193557
Ratio=9% count=5 hash=2175992 bits=199708
Ratio=27% count=10 hash=916611 bits=253464
Ratio=23% count=200 hash=17723092 bits=4164691
Ratio=21% count=50 hash=6297315 bits=1327895
Ratio=18% count=100 hash=14426770 bits=2666176
Ratio=19% count=1000 hash=79151890 bits=15539118
Ratio=22% count=2000 hash=142519755 bits=31685245
Tests run: 2, Failures: 0, Errors: 0, Skipped: 0, Time elapsed: 0.629 sec - in org.apache.commons.lang3.HashSetvBitSetTest
Running org.apache.commons.lang3.StringUtilsTest
Tests run: 124, Failures: 0, Errors: 0, Skipped: 0, Time elapsed: 0.134 sec - in org.apache.commons.lang3.StringUtilsTest
Running org.apache.commons.lang3.ArrayUtilsRemoveTest
Tests run: 19, Failures: 0, Errors: 0, Skipped: 0, Time elapsed: 0.001 sec - in org.apache.commons.lang3.ArrayUtilsRemoveTest
Running org.apache.commons.lang3.ObjectUtilsTest
Tests run: 36, Failures: 0, Errors: 0, Skipped: 0, Time elapsed: 0.007 sec - in org.apache.commons.lang3.ObjectUtilsTest
Running org.apache.commons.lang3.ClassPathUtilsTest
Tests run: 13, Failures: 0, Errors: 0, Skipped: 0, Time elapsed: 0.001 sec - in org.apache.commons.lang3.ClassPathUtilsTest
Running org.apache.commons.lang3.math.NumberUtilsTest
Tests run: 91, Failures: 0, Errors: 0, Skipped: 0, Time elapsed: 0.025 sec - in org.apache.commons.lang3.math.NumberUtilsTest
Running org.apache.commons.lang3.math.IEEE754rUtilsTest
Tests run: 3, Failures: 0, Errors: 0, Skipped: 0, Time elapsed: 0 sec - in org.apache.commons.lang3.math.IEEE754rUtilsTest
Running org.apache.commons.lang3.math.FractionTest
Tests run: 25, Failures: 0, Errors: 0, Skipped: 0, Time elapsed: 0.088 sec - in org.apache.commons.lang3.math.FractionTest
Running org.apache.commons.lang3.BooleanUtilsTest
Tests run: 72, Failures: 0, Errors: 0, Skipped: 0, Time elapsed: 0.011 sec - in org.apache.commons.lang3.BooleanUtilsTest
Running org.apache.commons.lang3.CharSequenceUtilsTest
Tests run: 2, Failures: 0, Errors: 0, Skipped: 0, Time elapsed: 0 sec - in org.apache.commons.lang3.CharSequenceUtilsTest
Running org.apache.commons.lang3.CharSetUtilsTest
Tests run: 11, Failures: 0, Errors: 0, Skipped: 0, Time elapsed: 0.007 sec - in org.apache.commons.lang3.CharSetUtilsTest
Running org.apache.commons.lang3.ArrayUtilsAddTest
Tests run: 13, Failures: 0, Errors: 0, Skipped: 0, Time elapsed: 0.001 sec - in org.apache.commons.lang3.ArrayUtilsAddTest
Running org.apache.commons.lang3.CharEncodingTest
Tests run: 6, Failures: 0, Errors: 0, Skipped: 0, Time elapsed: 0.024 sec - in org.apache.commons.lang3.CharEncodingTest
Running org.apache.commons.lang3.ClassUtilsTest
Tests run: 57, Failures: 0, Errors: 0, Skipped: 0, Time elapsed: 0.024 sec - in org.apache.commons.lang3.ClassUtilsTest
Running org.apache.commons.lang3.RangeTest
Tests run: 24, Failures: 0, Errors: 0, Skipped: 0, Time elapsed: 0.016 sec - in org.apache.commons.lang3.RangeTest
Running org.apache.commons.lang3.event.EventUtilsTest
Tests run: 8, Failures: 0, Errors: 0, Skipped: 0, Time elapsed: 0.02 sec - in org.apache.commons.lang3.event.EventUtilsTest
Running org.apache.commons.lang3.event.EventListenerSupportTest
Tests run: 9, Failures: 0, Errors: 0, Skipped: 0, Time elapsed: 0.019 sec - in org.apache.commons.lang3.event.EventListenerSupportTest
Running org.apache.commons.lang3.ArrayUtilsTest
Tests run: 205, Failures: 1, Errors: 0, Skipped: 0, Time elapsed: 0.05 sec <<< FAILURE! - in org.apache.commons.lang3.ArrayUtilsTest
testToString(org.apache.commons.lang3.ArrayUtilsTest)  Time elapsed: 0.001 sec  <<< FAILURE!
org.junit.ComparisonFailure: expected:<{}[]> but was:<{}[,<null>]>
	at org.junit.Assert.assertEquals(Assert.java:115)
	at org.junit.Assert.assertEquals(Assert.java:144)
	at org.apache.commons.lang3.ArrayUtilsTest.testToString(ArrayUtilsTest.java:53)

Running org.apache.commons.lang3.CharUtilsTest
Tests run: 24, Failures: 0, Errors: 0, Skipped: 0, Time elapsed: 0.001 sec - in org.apache.commons.lang3.CharUtilsTest
Running org.apache.commons.lang3.NotImplementedExceptionTest
Tests run: 1, Failures: 0, Errors: 0, Skipped: 0, Time elapsed: 0 sec - in org.apache.commons.lang3.NotImplementedExceptionTest
Running org.apache.commons.lang3.StringUtilsEqualsIndexOfTest
Tests run: 50, Failures: 0, Errors: 0, Skipped: 0, Time elapsed: 0.022 sec - in org.apache.commons.lang3.StringUtilsEqualsIndexOfTest
Running org.apache.commons.lang3.RandomUtilsTest
Tests run: 23, Failures: 0, Errors: 0, Skipped: 0, Time elapsed: 0.01 sec - in org.apache.commons.lang3.RandomUtilsTest

Results :

Failed tests: 
  AnnotationUtilsTest.testToString:502 null
  ArrayUtilsTest.testToString:53 expected:<{}[]> but was:<{}[,<null>]>
  DefaultToStringStyleTest.testAppendSuper:58 expected:<...ng.Integer@3edcbc7b[[]]> but was:<...ng.Integer@3edcbc7b[[<null>]>
  DefaultToStringStyleTest.testBlank:53 expected:<...ng.Integer@3edcbc7b[[]]> but was:<...ng.Integer@3edcbc7b[[<null>]>
  DefaultToStringStyleTest.testLong:96 expected:<...g.Integer@3edcbc7b[3[]]> but was:<...g.Integer@3edcbc7b[3[,<null>]>
  DefaultToStringStyleTest.testLongArray:114 expected:<...@3edcbc7b[{1,2,-3,4}[]]> but was:<...@3edcbc7b[{1,2,-3,4}[,<null>]>
  DefaultToStringStyleTest.testLongArrayArray:124 expected:<...b[{{1,2},<null>,{5}}[]]> but was:<...b[{{1,2},<null>,{5}}[,<null>]>
  DefaultToStringStyleTest.testObject:70 expected:<...eger@3edcbc7b[<null>[]]> but was:<...eger@3edcbc7b[<null>[,<null>]>
  DefaultToStringStyleTest.testObjectArray:104 expected:<...c7b[{<null>,5,{3,6}}[]]> but was:<...c7b[{<null>,5,{3,6}}[,<null>]>
  DefaultToStringStyleTest.testPerson:91 expected:<...,age=33,smoker=false[]]> but was:<...,age=33,smoker=false[,<null>]>
  DiffResultTest.testToStringOutput:95 expected:<...mptyClass[test=false[] differs from DiffResultTest.EmptyClass[test=true]]> but was:<...mptyClass[test=false[,<null> differs from DiffResultTest.EmptyClass[test=true,<null>]>
  JsonToStringStyleTest.testAppendSuper:64 expected:<{[}]> but was:<{[null]>
  JsonToStringStyleTest.testBlank:59 expected:<{[}]> but was:<{[null]>
  JsonToStringStyleTest.testLong:208 expected:<{"a":3[}]> but was:<{"a":3[,null]>
  JsonToStringStyleTest.testNull:54 expected:<[null]> but was:<[}]>
  JsonToStringStyleTest.testObject:112 expected:<{"a":null[}]> but was:<{"a":null[,null]>
  JsonToStringStyleTest.testPerson:192 expected:<...ge":25,"smoker":true[}]> but was:<...ge":25,"smoker":true[,null]>
  MultiLineToStringStyleTest.testAppendSuper:59 expected:<...g.Integer@3edcbc7b[
[]]> but was:<...g.Integer@3edcbc7b[
[  <null>]>
  MultiLineToStringStyleTest.testBlank:54 expected:<...g.Integer@3edcbc7b[
[]]> but was:<...g.Integer@3edcbc7b[
[  <null>]>
  MultiLineToStringStyleTest.testLong:97 expected:<...teger@3edcbc7b[
  3
[]]> but was:<...teger@3edcbc7b[
  3
[  <null>]>
  MultiLineToStringStyleTest.testLongArray:115 expected:<...cbc7b[
  {1,2,-3,4}
[]]> but was:<...cbc7b[
  {1,2,-3,4}
[  <null>]>
  MultiLineToStringStyleTest.testLongArrayArray:125 expected:<... {{1,2},<null>,{5}}
[]]> but was:<... {{1,2},<null>,{5}}
[  <null>]>
  MultiLineToStringStyleTest.testObject:71 expected:<...@3edcbc7b[
  <null>
[]]> but was:<...@3edcbc7b[
  <null>
[  <null>]>
  MultiLineToStringStyleTest.testObjectArray:105 expected:<...
  {<null>,5,{3,6}}
[]]> but was:<...
  {<null>,5,{3,6}}
[  <null>]>
  MultiLineToStringStyleTest.testPerson:92 expected:<...ge=25
  smoker=true
[]]> but was:<...ge=25
  smoker=true
[  <null>]>
  MultilineRecursiveToStringStyleTest.boolArray:113 expected:<...  stringArray=<null>[
]]> but was:<...  stringArray=<null>[,
  <null>]>
  MultilineRecursiveToStringStyleTest.charArray:131 expected:<...  stringArray=<null>[
]]> but was:<...  stringArray=<null>[,
  <null>]>
  MultilineRecursiveToStringStyleTest.doubleArray:167 expected:<...  stringArray=<null>[
]]> but was:<...  stringArray=<null>[,
  <null>]>
  MultilineRecursiveToStringStyleTest.intArray:149 expected:<...  stringArray=<null>[
]]> but was:<...  stringArray=<null>[,
  <null>]>
  MultilineRecursiveToStringStyleTest.longArray:185 expected:<...  stringArray=<null>[
]]> but was:<...  stringArray=<null>[,
  <null>]>
  MultilineRecursiveToStringStyleTest.nestedAndArray:80 expected:<...     date=2014.10.14[
    ],
    org.apache.commons.lang3.builder.MultilineRecursiveToStringStyleTest$Transaction@6d8c8c3e[
      amount=50.0,
      date=2014.10.15
    ]
  }
]]> but was:<...     date=2014.10.14[,
      <null>,
    org.apache.commons.lang3.builder.MultilineRecursiveToStringStyleTest$Transaction@6d8c8c3e[
      amount=50.0,
      date=2014.10.15,
      <null>
  },
  <null>]>
  MultilineRecursiveToStringStyleTest.nestedElements:57 expected:<...1[
    name=ASF Bank[
  ],
  accounts=<null>
]]> but was:<...1[
    name=ASF Bank[,
    <null>,
  accounts=<null>,
  <null>]>
  MultilineRecursiveToStringStyleTest.noArray:94 expected:<...  stringArray=<null>[
]]> but was:<...  stringArray=<null>[,
  <null>]>
  MultilineRecursiveToStringStyleTest.simpleObject:42 expected:<...0,
  date=2014.10.15[
]]> but was:<...0,
  date=2014.10.15[,
  <null>]>
  MultilineRecursiveToStringStyleTest.stringArray:203 expected:<...y={
    a,
    A
  }[
]]> but was:<...y={
    a,
    A
  }[,
  <null>]>
  NoClassNameToStringStyleTest.testAppendSuper:57 expected:<[[]]> but was:<[[<null>]>
  NoClassNameToStringStyleTest.testBlank:52 expected:<[[]]> but was:<[[<null>]>
  NoClassNameToStringStyleTest.testLong:94 expected:<[3[]]> but was:<[3[,<null>]>
  NoClassNameToStringStyleTest.testLongArray:112 expected:<[{1,2,-3,4}[]]> but was:<[{1,2,-3,4}[,<null>]>
  NoClassNameToStringStyleTest.testLongArrayArray:122 expected:<[{{1,2},<null>,{5}}[]]> but was:<[{{1,2},<null>,{5}}[,<null>]>
  NoClassNameToStringStyleTest.testObject:69 expected:<[<null>[]]> but was:<[<null>[,<null>]>
  NoClassNameToStringStyleTest.testObjectArray:102 expected:<[{<null>,5,{3,6}}[]]> but was:<[{<null>,5,{3,6}}[,<null>]>
  NoClassNameToStringStyleTest.testPerson:89 expected:<...c,age=45,smoker=true[]]> but was:<...c,age=45,smoker=true[,<null>]>
  NoFieldNamesToStringStyleTest.testAppendSuper:58 expected:<...ng.Integer@3edcbc7b[[]]> but was:<...ng.Integer@3edcbc7b[[<null>]>
  NoFieldNamesToStringStyleTest.testBlank:53 expected:<...ng.Integer@3edcbc7b[[]]> but was:<...ng.Integer@3edcbc7b[[<null>]>
  NoFieldNamesToStringStyleTest.testLong:96 expected:<...g.Integer@3edcbc7b[3[]]> but was:<...g.Integer@3edcbc7b[3[,<null>]>
  NoFieldNamesToStringStyleTest.testLongArray:114 expected:<...@3edcbc7b[{1,2,-3,4}[]]> but was:<...@3edcbc7b[{1,2,-3,4}[,<null>]>
  NoFieldNamesToStringStyleTest.testLongArrayArray:124 expected:<...b[{{1,2},<null>,{5}}[]]> but was:<...b[{{1,2},<null>,{5}}[,<null>]>
  NoFieldNamesToStringStyleTest.testObject:70 expected:<...eger@3edcbc7b[<null>[]]> but was:<...eger@3edcbc7b[<null>[,<null>]>
  NoFieldNamesToStringStyleTest.testObjectArray:104 expected:<...c7b[{<null>,5,{3,6}}[]]> but was:<...c7b[{<null>,5,{3,6}}[,<null>]>
  NoFieldNamesToStringStyleTest.testPerson:91 expected:<...90[Ron Paul,72,false[]]> but was:<...90[Ron Paul,72,false[,<null>]>
  RecursiveToStringStyleTest.testAppendSuper:57 expected:<...ng.Integer@3edcbc7b[[]]> but was:<...ng.Integer@3edcbc7b[[<null>]>
  RecursiveToStringStyleTest.testBlank:52 expected:<...ng.Integer@3edcbc7b[[]]> but was:<...ng.Integer@3edcbc7b[[<null>]>
  RecursiveToStringStyleTest.testLong:99 expected:<...g.Integer@3edcbc7b[3[]]> but was:<...g.Integer@3edcbc7b[3[,<null>]>
  RecursiveToStringStyleTest.testLongArray:117 expected:<...@3edcbc7b[{1,2,-3,4}[]]> but was:<...@3edcbc7b[{1,2,-3,4}[,<null>]>
  RecursiveToStringStyleTest.testLongArrayArray:127 expected:<...b[{{1,2},<null>,{5}}[]]> but was:<...b[{{1,2},<null>,{5}}[,<null>]>
  RecursiveToStringStyleTest.testObject:69 expected:<...eger@3edcbc7b[<null>[]]> but was:<...eger@3edcbc7b[<null>[,<null>]>
  RecursiveToStringStyleTest.testObjectArray:107 expected:<...c7b[{<null>,5,{3,6}}[]]> but was:<...c7b[{<null>,5,{3,6}}[,<null>]>
  RecursiveToStringStyleTest.testPerson:93 expected:<...907c4e[title=Manager[]]]> but was:<...907c4e[title=Manager[,<null>,<null>]>
  ShortPrefixToStringStyleTest.testAppendSuper:58 expected:<Integer[[]]> but was:<Integer[[<null>]>
  ShortPrefixToStringStyleTest.testBlank:53 expected:<Integer[[]]> but was:<Integer[[<null>]>
  ShortPrefixToStringStyleTest.testLong:96 expected:<Integer[3[]]> but was:<Integer[3[,<null>]>
  ShortPrefixToStringStyleTest.testLongArray:114 expected:<Integer[{1,2,-3,4}[]]> but was:<Integer[{1,2,-3,4}[,<null>]>
  ShortPrefixToStringStyleTest.testLongArrayArray:124 expected:<...r[{{1,2},<null>,{5}}[]]> but was:<...r[{{1,2},<null>,{5}}[,<null>]>
  ShortPrefixToStringStyleTest.testObject:70 expected:<Integer[<null>[]]> but was:<Integer[<null>[,<null>]>
  ShortPrefixToStringStyleTest.testObjectArray:104 expected:<...ger[{<null>,5,{3,6}}[]]> but was:<...ger[{<null>,5,{3,6}}[,<null>]>
  ShortPrefixToStringStyleTest.testPerson:91 expected:<...c,age=45,smoker=true[]]> but was:<...c,age=45,smoker=true[,<null>]>
  SimpleToStringStyleTest.testAppendSuper:57 expected:<[]> but was:<[<null>]>
  SimpleToStringStyleTest.testBlank:52 expected:<[]> but was:<[<null>]>
  SimpleToStringStyleTest.testLong:94 expected:<3[]> but was:<3[,<null>]>
  SimpleToStringStyleTest.testLongArray:112 expected:<{1,2,-3,4}[]> but was:<{1,2,-3,4}[,<null>]>
  SimpleToStringStyleTest.testLongArrayArray:122 expected:<{{1,2},<null>,{5}}[]> but was:<{{1,2},<null>,{5}}[,<null>]>
  SimpleToStringStyleTest.testObject:69 expected:<<null>[]> but was:<<null>[,<null>]>
  SimpleToStringStyleTest.testObjectArray:102 expected:<{<null>,5,{3,6}}[]> but was:<{<null>,5,{3,6}}[,<null>]>
  SimpleToStringStyleTest.testPerson:89 expected:<...e Q. Public,47,false[]> but was:<...e Q. Public,47,false[,<null>]>
  StandardToStringStyleTest.testAppendSuper:73 expected:<Integer[[]]> but was:<Integer[[%NULL%]>
  StandardToStringStyleTest.testBlank:68 expected:<Integer[[]]> but was:<Integer[[%NULL%]>
  StandardToStringStyleTest.testLong:111 expected:<Integer[3[]]> but was:<Integer[3[,%NULL%]>
  StandardToStringStyleTest.testLongArray:129 expected:<...nteger[[1, 2, -3, 4][]]> but was:<...nteger[[1, 2, -3, 4][,%NULL%]>
  StandardToStringStyleTest.testLongArrayArray:139 expected:<...[1, 2], %NULL%, [5]][]]> but was:<...[1, 2], %NULL%, [5]][,%NULL%]>
  StandardToStringStyleTest.testObject:85 expected:<Integer[%NULL%[]]> but was:<Integer[%NULL%[,%NULL%]>
  StandardToStringStyleTest.testObjectArray:119 expected:<...[[%NULL%, 5, [3, 6]][]]> but was:<...[[%NULL%, 5, [3, 6]][,%NULL%]>
  StandardToStringStyleTest.testPerson:106 expected:<...,age=19,smoker=false[]]> but was:<...,age=19,smoker=false[,%NULL%]>
org.apache.commons.lang3.builder.ToStringBuilderTest.testCharArray(org.apache.commons.lang3.builder.ToStringBuilderTest)
  Run 1: ToStringBuilderTest.testCharArray:767 expected:<...r@3edcbc7b[{A,2,_,D}[]]> but was:<...r@3edcbc7b[{A,2,_,D}[,<null>]>
  Run 2: ToStringBuilderTest.after:48->validateNullToStringStyleRegistry:595 Expected null, actual: {org.apache.commons.lang3.builder.DiffResultTest$SimpleClass@55ab936b=null, org.apache.commons.lang3.builder.DiffResultTest$SimpleClass@6e9c45d0=null, 5=null} expected null, but was:<{org.apache.commons.lang3.builder.DiffResultTest$SimpleClass@55ab936b=null, org.apache.commons.lang3.builder.DiffResultTest$SimpleClass@6e9c45d0=null, 5=null}>

org.apache.commons.lang3.builder.ToStringBuilderTest.testDoubleArrayArray(org.apache.commons.lang3.builder.ToStringBuilderTest)
  Run 1: ToStringBuilderTest.testDoubleArrayArray:857 expected:<...29686},<null>,{NaN}}[]]> but was:<...29686},<null>,{NaN}}[,<null>]>
  Run 2: ToStringBuilderTest.after:48->validateNullToStringStyleRegistry:595 Expected null, actual: {org.apache.commons.lang3.builder.DiffResultTest$SimpleClass@55ab936b=null, org.apache.commons.lang3.builder.DiffResultTest$SimpleClass@6e9c45d0=null, 5=null} expected null, but was:<{org.apache.commons.lang3.builder.DiffResultTest$SimpleClass@55ab936b=null, org.apache.commons.lang3.builder.DiffResultTest$SimpleClass@6e9c45d0=null, 5=null}>

org.apache.commons.lang3.builder.ToStringBuilderTest.testObjectArray(org.apache.commons.lang3.builder.ToStringBuilderTest)
  Run 1: ToStringBuilderTest.testObjectArray:717 expected:<...c7b[{<null>,5,{3,6}}[]]> but was:<...c7b[{<null>,5,{3,6}}[,<null>]>
  Run 2: ToStringBuilderTest.after:48->validateNullToStringStyleRegistry:595 Expected null, actual: {org.apache.commons.lang3.builder.DiffResultTest$SimpleClass@55ab936b=null, org.apache.commons.lang3.builder.DiffResultTest$SimpleClass@6e9c45d0=null} expected null, but was:<{org.apache.commons.lang3.builder.DiffResultTest$SimpleClass@55ab936b=null, org.apache.commons.lang3.builder.DiffResultTest$SimpleClass@6e9c45d0=null}>

org.apache.commons.lang3.builder.ToStringBuilderTest.testObjectBuild(org.apache.commons.lang3.builder.ToStringBuilderTest)
  Run 1: ToStringBuilderTest.testObjectBuild:641 expected:<...eger@3edcbc7b[<null>[]]> but was:<...eger@3edcbc7b[<null>[,<null>]>
  Run 2: ToStringBuilderTest.after:48->validateNullToStringStyleRegistry:595 Expected null, actual: {org.apache.commons.lang3.builder.DiffResultTest$SimpleClass@55ab936b=null, org.apache.commons.lang3.builder.DiffResultTest$SimpleClass@6e9c45d0=null, 5=null} expected null, but was:<{org.apache.commons.lang3.builder.DiffResultTest$SimpleClass@55ab936b=null, org.apache.commons.lang3.builder.DiffResultTest$SimpleClass@6e9c45d0=null, 5=null}>

org.apache.commons.lang3.builder.ToStringBuilderTest.testReflectionBoolean(org.apache.commons.lang3.builder.ToStringBuilderTest)
  Run 1: ToStringBuilderTest.testReflectionBoolean:116 expected:<...@6b6a4b18[value=true[]]> but was:<...@6b6a4b18[value=true[,<null>]>
  Run 2: ToStringBuilderTest.after:48->validateNullToStringStyleRegistry:595 Expected null, actual: {org.apache.commons.lang3.builder.DiffResultTest$SimpleClass@55ab936b=null, org.apache.commons.lang3.builder.DiffResultTest$SimpleClass@6e9c45d0=null, 5=null} expected null, but was:<{org.apache.commons.lang3.builder.DiffResultTest$SimpleClass@55ab936b=null, org.apache.commons.lang3.builder.DiffResultTest$SimpleClass@6e9c45d0=null, 5=null}>

  ToStringBuilderTest.after:48->validateNullToStringStyleRegistry:595 Expected null, actual: {org.apache.commons.lang3.builder.DiffResultTest$SimpleClass@55ab936b=null, org.apache.commons.lang3.builder.DiffResultTest$SimpleClass@6e9c45d0=null, 5=null} expected null, but was:<{org.apache.commons.lang3.builder.DiffResultTest$SimpleClass@55ab936b=null, org.apache.commons.lang3.builder.DiffResultTest$SimpleClass@6e9c45d0=null, 5=null}>
  ToStringBuilderTest.after:48->validateNullToStringStyleRegistry:595 Expected null, actual: {org.apache.commons.lang3.builder.DiffResultTest$SimpleClass@55ab936b=null, org.apache.commons.lang3.builder.DiffResultTest$SimpleClass@6e9c45d0=null} expected null, but was:<{org.apache.commons.lang3.builder.DiffResultTest$SimpleClass@55ab936b=null, org.apache.commons.lang3.builder.DiffResultTest$SimpleClass@6e9c45d0=null}>

Tests in error: 
org.apache.commons.lang3.builder.ToStringBuilderTest.testAppendSuper(org.apache.commons.lang3.builder.ToStringBuilderTest)
  Run 1: ToStringBuilderTest.testAppendSuper:601 expected:<...ng.Integer@3edcbc7b[[]]> but was:<...ng.Integer@3edcbc7b[[<null>]>
  Run 2: ToStringBuilderTest.after:48->validateNullToStringStyleRegistry:595 » ConcurrentModification

org.apache.commons.lang3.builder.ToStringBuilderTest.testAppendToString(org.apache.commons.lang3.builder.ToStringBuilderTest)
  Run 1: ToStringBuilderTest.testAppendToString:611 expected:<...ng.Integer@3edcbc7b[[]]> but was:<...ng.Integer@3edcbc7b[[<null>]>
  Run 2: ToStringBuilderTest.after:48->validateNullToStringStyleRegistry:595 » ConcurrentModification

  ToStringBuilderTest.after:48->validateNullToStringStyleRegistry:595 » ConcurrentModification
org.apache.commons.lang3.builder.ToStringBuilderTest.testBlank(org.apache.commons.lang3.builder.ToStringBuilderTest)
  Run 1: ToStringBuilderTest.testBlank:89 expected:<...ng.Integer@3edcbc7b[[]]> but was:<...ng.Integer@3edcbc7b[[<null>]>
  Run 2: ToStringBuilderTest.after:48->validateNullToStringStyleRegistry:595 » ConcurrentModification

org.apache.commons.lang3.builder.ToStringBuilderTest.testBoolean(org.apache.commons.lang3.builder.ToStringBuilderTest)
  Run 1: ToStringBuilderTest.testBoolean:708 expected:<...nteger@3edcbc7b[true[]]> but was:<...nteger@3edcbc7b[true[,<null>]>
  Run 2: ToStringBuilderTest.after:48->validateNullToStringStyleRegistry:595 » ConcurrentModification

org.apache.commons.lang3.builder.ToStringBuilderTest.testBooleanArray(org.apache.commons.lang3.builder.ToStringBuilderTest)
  Run 1: ToStringBuilderTest.testBooleanArray:797 expected:<...b[{true,false,false}[]]> but was:<...b[{true,false,false}[,<null>]>
  Run 2: ToStringBuilderTest.after:48->validateNullToStringStyleRegistry:595 » ConcurrentModification

org.apache.commons.lang3.builder.ToStringBuilderTest.testBooleanArrayArray(org.apache.commons.lang3.builder.ToStringBuilderTest)
  Run 1: ToStringBuilderTest.testBooleanArrayArray:877 expected:<...lse},<null>,{false}}[]]> but was:<...lse},<null>,{false}}[,<null>]>
  Run 2: ToStringBuilderTest.after:48->validateNullToStringStyleRegistry:595 » ConcurrentModification

org.apache.commons.lang3.builder.ToStringBuilderTest.testByte(org.apache.commons.lang3.builder.ToStringBuilderTest)
  Run 1: ToStringBuilderTest.testByte:686 expected:<...g.Integer@3edcbc7b[3[]]> but was:<...g.Integer@3edcbc7b[3[,<null>]>
  Run 2: ToStringBuilderTest.after:48->validateNullToStringStyleRegistry:595 » ConcurrentModification

org.apache.commons.lang3.builder.ToStringBuilderTest.testByteArray(org.apache.commons.lang3.builder.ToStringBuilderTest)
  Run 1: ToStringBuilderTest.testByteArray:757 expected:<...@3edcbc7b[{1,2,-3,4}[]]> but was:<...@3edcbc7b[{1,2,-3,4}[,<null>]>
  Run 2: ToStringBuilderTest.after:48->validateNullToStringStyleRegistry:595 » ConcurrentModification

org.apache.commons.lang3.builder.ToStringBuilderTest.testByteArrayArray(org.apache.commons.lang3.builder.ToStringBuilderTest)
  Run 1: ToStringBuilderTest.testByteArrayArray:837 expected:<...b[{{1,2},<null>,{5}}[]]> but was:<...b[{{1,2},<null>,{5}}[,<null>]>
  Run 2: ToStringBuilderTest.after:48->validateNullToStringStyleRegistry:595 » ConcurrentModification

org.apache.commons.lang3.builder.ToStringBuilderTest.testChar(org.apache.commons.lang3.builder.ToStringBuilderTest)
  Run 1: ToStringBuilderTest.testChar:679 expected:<...g.Integer@3edcbc7b[A[]]> but was:<...g.Integer@3edcbc7b[A[,<null>]>
  Run 2: ToStringBuilderTest.after:48->validateNullToStringStyleRegistry:595 » ConcurrentModification

org.apache.commons.lang3.builder.ToStringBuilderTest.testCharArrayArray(org.apache.commons.lang3.builder.ToStringBuilderTest)
  Run 1: ToStringBuilderTest.testCharArrayArray:847 expected:<...b[{{A,B},<null>,{p}}[]]> but was:<...b[{{A,B},<null>,{p}}[,<null>]>
  Run 2: ToStringBuilderTest.after:48->validateNullToStringStyleRegistry:595 » ConcurrentModification

org.apache.commons.lang3.builder.ToStringBuilderTest.testConstructorEx1(org.apache.commons.lang3.builder.ToStringBuilderTest)
  Run 1: ToStringBuilderTest.testConstructorEx1:55 expected:<[<null>]> but was:<[]]>
  Run 2: ToStringBuilderTest.after:48->validateNullToStringStyleRegistry:595 » ConcurrentModification

org.apache.commons.lang3.builder.ToStringBuilderTest.testConstructorEx2(org.apache.commons.lang3.builder.ToStringBuilderTest)
  Run 1: ToStringBuilderTest.testConstructorEx2:60 expected:<[<null>]> but was:<[]]>
  Run 2: ToStringBuilderTest.after:48->validateNullToStringStyleRegistry:595 » ConcurrentModification

org.apache.commons.lang3.builder.ToStringBuilderTest.testConstructorEx3(org.apache.commons.lang3.builder.ToStringBuilderTest)
  Run 1: ToStringBuilderTest.testConstructorEx3:66 expected:<[<null>]> but was:<[]]>
  Run 2: ToStringBuilderTest.after:48->validateNullToStringStyleRegistry:595 » ConcurrentModification

org.apache.commons.lang3.builder.ToStringBuilderTest.testDouble(org.apache.commons.lang3.builder.ToStringBuilderTest)
  Run 1: ToStringBuilderTest.testDouble:694 expected:<...Integer@3edcbc7b[3.2[]]> but was:<...Integer@3edcbc7b[3.2[,<null>]>
  Run 2: ToStringBuilderTest.after:48->validateNullToStringStyleRegistry:595 » ConcurrentModification

org.apache.commons.lang3.builder.ToStringBuilderTest.testDoubleArray(org.apache.commons.lang3.builder.ToStringBuilderTest)
  Run 1: ToStringBuilderTest.testDoubleArray:777 expected:<...2.9876,-3.00001,4.3}[]]> but was:<...2.9876,-3.00001,4.3}[,<null>]>
  Run 2: ToStringBuilderTest.after:48->validateNullToStringStyleRegistry:595 » ConcurrentModification

org.apache.commons.lang3.builder.ToStringBuilderTest.testFloat(org.apache.commons.lang3.builder.ToStringBuilderTest)
  Run 1: ToStringBuilderTest.testFloat:701 expected:<...Integer@3edcbc7b[3.2[]]> but was:<...Integer@3edcbc7b[3.2[,<null>]>
  Run 2: ToStringBuilderTest.after:48->validateNullToStringStyleRegistry:595 » ConcurrentModification

org.apache.commons.lang3.builder.ToStringBuilderTest.testFloatArray(org.apache.commons.lang3.builder.ToStringBuilderTest)
  Run 1: ToStringBuilderTest.testFloatArray:787 expected:<...2.9876,-3.00001,4.3}[]]> but was:<...2.9876,-3.00001,4.3}[,<null>]>
  Run 2: ToStringBuilderTest.after:48->validateNullToStringStyleRegistry:595 » ConcurrentModification

org.apache.commons.lang3.builder.ToStringBuilderTest.testFloatArrayArray(org.apache.commons.lang3.builder.ToStringBuilderTest)
  Run 1: ToStringBuilderTest.testFloatArrayArray:867 expected:<...29686},<null>,{NaN}}[]]> but was:<...29686},<null>,{NaN}}[,<null>]>
  Run 2: ToStringBuilderTest.after:48->validateNullToStringStyleRegistry:595 » ConcurrentModification

  ToStringBuilderTest.after:48->validateNullToStringStyleRegistry:595 » ConcurrentModification
org.apache.commons.lang3.builder.ToStringBuilderTest.testInheritedReflectionStatics(org.apache.commons.lang3.builder.ToStringBuilderTest)
  Run 1: ToStringBuilderTest.testInheritedReflectionStatics:947 expected:<...ng2,staticInt2=67890[]]> but was:<...ng2,staticInt2=67890[,<null>]>
  Run 2: ToStringBuilderTest.after:48->validateNullToStringStyleRegistry:595 » ConcurrentModification

org.apache.commons.lang3.builder.ToStringBuilderTest.testInnerClassReflection(org.apache.commons.lang3.builder.ToStringBuilderTest)
  Run 1: ToStringBuilderTest.testInnerClassReflection:376 expected:<...uter$Inner@30ec6243[[]]]> but was:<...uter$Inner@30ec6243[[<null>,<null>]>
  Run 2: ToStringBuilderTest.after:48->validateNullToStringStyleRegistry:595 » ConcurrentModification

org.apache.commons.lang3.builder.ToStringBuilderTest.testInt(org.apache.commons.lang3.builder.ToStringBuilderTest)
  Run 1: ToStringBuilderTest.testInt:665 expected:<...g.Integer@3edcbc7b[3[]]> but was:<...g.Integer@3edcbc7b[3[,<null>]>
  Run 2: ToStringBuilderTest.after:48->validateNullToStringStyleRegistry:595 » ConcurrentModification

org.apache.commons.lang3.builder.ToStringBuilderTest.testIntArray(org.apache.commons.lang3.builder.ToStringBuilderTest)
  Run 1: ToStringBuilderTest.testIntArray:737 expected:<...@3edcbc7b[{1,2,-3,4}[]]> but was:<...@3edcbc7b[{1,2,-3,4}[,<null>]>
  Run 2: ToStringBuilderTest.after:48->validateNullToStringStyleRegistry:595 » ConcurrentModification

org.apache.commons.lang3.builder.ToStringBuilderTest.testIntArrayArray(org.apache.commons.lang3.builder.ToStringBuilderTest)
  Run 1: ToStringBuilderTest.testIntArrayArray:817 expected:<...b[{{1,2},<null>,{5}}[]]> but was:<...b[{{1,2},<null>,{5}}[,<null>]>
  Run 2: ToStringBuilderTest.after:48->validateNullToStringStyleRegistry:595 » ConcurrentModification

org.apache.commons.lang3.builder.ToStringBuilderTest.testLong(org.apache.commons.lang3.builder.ToStringBuilderTest)
  Run 1: ToStringBuilderTest.testLong:657 expected:<...g.Integer@3edcbc7b[3[]]> but was:<...g.Integer@3edcbc7b[3[,<null>]>
  Run 2: ToStringBuilderTest.after:48->validateNullToStringStyleRegistry:595 » ConcurrentModification

org.apache.commons.lang3.builder.ToStringBuilderTest.testLongArray(org.apache.commons.lang3.builder.ToStringBuilderTest)
  Run 1: ToStringBuilderTest.testLongArray:727 expected:<...@3edcbc7b[{1,2,-3,4}[]]> but was:<...@3edcbc7b[{1,2,-3,4}[,<null>]>
  Run 2: ToStringBuilderTest.after:48->validateNullToStringStyleRegistry:595 » ConcurrentModification

org.apache.commons.lang3.builder.ToStringBuilderTest.testLongArrayArray(org.apache.commons.lang3.builder.ToStringBuilderTest)
  Run 1: ToStringBuilderTest.testLongArrayArray:807 expected:<...b[{{1,2},<null>,{5}}[]]> but was:<...b[{{1,2},<null>,{5}}[,<null>]>
  Run 2: ToStringBuilderTest.after:48->validateNullToStringStyleRegistry:595 » ConcurrentModification

org.apache.commons.lang3.builder.ToStringBuilderTest.testObject(org.apache.commons.lang3.builder.ToStringBuilderTest)
  Run 1: ToStringBuilderTest.testObject:623 expected:<...eger@3edcbc7b[<null>[]]> but was:<...eger@3edcbc7b[<null>[,<null>]>
  Run 2: ToStringBuilderTest.after:48->validateNullToStringStyleRegistry:595 » ConcurrentModification

org.apache.commons.lang3.builder.ToStringBuilderTest.testObjectCycle(org.apache.commons.lang3.builder.ToStringBuilderTest)
  Run 1: ToStringBuilderTest.testObjectCycle:892 expected:<...ObjectCycle@6ed0cc34[]]]> but was:<...ObjectCycle@6ed0cc34[,<null>,<null>]>
  Run 2: ToStringBuilderTest.after:48->validateNullToStringStyleRegistry:595 » ConcurrentModification

org.apache.commons.lang3.builder.ToStringBuilderTest.testReflectionArrayAndObjectCycle(org.apache.commons.lang3.builder.ToStringBuilderTest)
  Run 1: ToStringBuilderTest.testReflectionArrayAndObjectCycle:576 expected:<...ang.Object;@48508ded[]}]]> but was:<...ang.Object;@48508ded[,<null>}<null>]>
  Run 2: ToStringBuilderTest.after:48->validateNullToStringStyleRegistry:595 » ConcurrentModification

org.apache.commons.lang3.builder.ToStringBuilderTest.testReflectionArrayArrayCycle(org.apache.commons.lang3.builder.ToStringBuilderTest)
  Run 1: ToStringBuilderTest.testReflectionArrayArrayCycle:432 expected:<...ng.Object;@4bc7bc0}}[]]> but was:<...ng.Object;@4bc7bc0}}[<null>]>
  Run 2: ToStringBuilderTest.after:48->validateNullToStringStyleRegistry:595 » ConcurrentModification

org.apache.commons.lang3.builder.ToStringBuilderTest.testReflectionArrayCycle(org.apache.commons.lang3.builder.ToStringBuilderTest)
  Run 1: ToStringBuilderTest.testReflectionArrayCycle:402 expected:<...ng.Object;@756535fa}[]]> but was:<...ng.Object;@756535fa}[<null>]>
  Run 2: ToStringBuilderTest.after:48->validateNullToStringStyleRegistry:595 » ConcurrentModification

org.apache.commons.lang3.builder.ToStringBuilderTest.testReflectionArrayCycleLevel2(org.apache.commons.lang3.builder.ToStringBuilderTest)
  Run 1: ToStringBuilderTest.testReflectionArrayCycleLevel2:416 expected:<...g.Object;@4e400552}}[]]> but was:<...g.Object;@4e400552}}[<null>]>
  Run 2: ToStringBuilderTest.after:48->validateNullToStringStyleRegistry:595 » ConcurrentModification

org.apache.commons.lang3.builder.ToStringBuilderTest.testReflectionBooleanArray(org.apache.commons.lang3.builder.ToStringBuilderTest)
  Run 1: ToStringBuilderTest.testReflectionBooleanArray:232 expected:<...7[{true,false,false}[]]> but was:<...7[{true,false,false}[<null>]>
  Run 2: ToStringBuilderTest.after:48->validateNullToStringStyleRegistry:595 » ConcurrentModification

org.apache.commons.lang3.builder.ToStringBuilderTest.testReflectionBooleanArrayArray(org.apache.commons.lang3.builder.ToStringBuilderTest)
  Run 1: ToStringBuilderTest.testReflectionBooleanArrayArray:307 expected:<...lse},<null>,{false}}[]]> but was:<...lse},<null>,{false}}[<null>]>
  Run 2: ToStringBuilderTest.after:48->validateNullToStringStyleRegistry:595 » ConcurrentModification

org.apache.commons.lang3.builder.ToStringBuilderTest.testReflectionByteArrayArray(org.apache.commons.lang3.builder.ToStringBuilderTest)
  Run 1: ToStringBuilderTest.testReflectionByteArrayArray:280 expected:<...8[{{1,2},<null>,{5}}[]]> but was:<...8[{{1,2},<null>,{5}}[<null>]>
  Run 2: ToStringBuilderTest.after:48->validateNullToStringStyleRegistry:595 » ConcurrentModification

org.apache.commons.lang3.builder.ToStringBuilderTest.testReflectionCharArray(org.apache.commons.lang3.builder.ToStringBuilderTest)
  Run 1: ToStringBuilderTest.testReflectionCharArray:205 expected:<...C@23389226[{A,2,_,D}[]]> but was:<...C@23389226[{A,2,_,D}[<null>]>
  Run 2: ToStringBuilderTest.after:48->validateNullToStringStyleRegistry:595 » ConcurrentModification

org.apache.commons.lang3.builder.ToStringBuilderTest.testReflectionCharArrayArray(org.apache.commons.lang3.builder.ToStringBuilderTest)
  Run 1: ToStringBuilderTest.testReflectionCharArrayArray:289 expected:<...4[{{A,B},<null>,{p}}[]]> but was:<...4[{{A,B},<null>,{p}}[<null>]>
  Run 2: ToStringBuilderTest.after:48->validateNullToStringStyleRegistry:595 » ConcurrentModification

org.apache.commons.lang3.builder.ToStringBuilderTest.testReflectionCharacter(org.apache.commons.lang3.builder.ToStringBuilderTest)
  Run 1: ToStringBuilderTest.testReflectionCharacter:106 expected:<...ter@4d40cc82[value=A[]]> but was:<...ter@4d40cc82[value=A[,<null>]>
  Run 2: ToStringBuilderTest.after:48->validateNullToStringStyleRegistry:595 » ConcurrentModification

org.apache.commons.lang3.builder.ToStringBuilderTest.testReflectionDoubleArray(org.apache.commons.lang3.builder.ToStringBuilderTest)
  Run 1: ToStringBuilderTest.testReflectionDoubleArray:214 expected:<...2.9876,-3.00001,4.3}[]]> but was:<...2.9876,-3.00001,4.3}[<null>]>
  Run 2: ToStringBuilderTest.after:48->validateNullToStringStyleRegistry:595 » ConcurrentModification

org.apache.commons.lang3.builder.ToStringBuilderTest.testReflectionDoubleArrayArray(org.apache.commons.lang3.builder.ToStringBuilderTest)
  Run 1: ToStringBuilderTest.testReflectionDoubleArrayArray:298 expected:<...29686},<null>,{NaN}}[]]> but was:<...29686},<null>,{NaN}}[<null>]>
  Run 2: ToStringBuilderTest.after:48->validateNullToStringStyleRegistry:595 » ConcurrentModification

org.apache.commons.lang3.builder.ToStringBuilderTest.testReflectionFloatArray(org.apache.commons.lang3.builder.ToStringBuilderTest)
  Run 1: ToStringBuilderTest.testReflectionFloatArray:223 expected:<...2.9876,-3.00001,4.3}[]]> but was:<...2.9876,-3.00001,4.3}[<null>]>
  Run 2: ToStringBuilderTest.after:48->validateNullToStringStyleRegistry:595 » ConcurrentModification

org.apache.commons.lang3.builder.ToStringBuilderTest.testReflectionFloatArrayArray(org.apache.commons.lang3.builder.ToStringBuilderTest)
  Run 1: ToStringBuilderTest.testReflectionFloatArrayArray:243 expected:<...29686},<null>,{NaN}}[]]> but was:<...29686},<null>,{NaN}}[<null>]>
  Run 2: ToStringBuilderTest.after:48->validateNullToStringStyleRegistry:595 » ConcurrentModification

org.apache.commons.lang3.builder.ToStringBuilderTest.testReflectionHierarchy(org.apache.commons.lang3.builder.ToStringBuilderTest)
  Run 1: ToStringBuilderTest.testReflectionHierarchy:338 expected:<...ixtureA@536b4ad8[a=a[]]> but was:<...ixtureA@536b4ad8[a=a[,<null>]>
  Run 2: ToStringBuilderTest.after:48->validateNullToStringStyleRegistry:595 » ConcurrentModification

org.apache.commons.lang3.builder.ToStringBuilderTest.testReflectionHierarchyArrayList(org.apache.commons.lang3.builder.ToStringBuilderTest)
  Run 1: ToStringBuilderTest.testReflectionHierarchyArrayList:319 » AssumptionViolated ...
  Run 2: ToStringBuilderTest.after:48->validateNullToStringStyleRegistry:595 Expected null, actual: {org.apache.commons.lang3.builder.DiffResultTest$SimpleClass@55ab936b=null, org.apache.commons.lang3.builder.DiffResultTest$SimpleClass@6e9c45d0=null, 5=null} expected null, but was:<{org.apache.commons.lang3.builder.DiffResultTest$SimpleClass@55ab936b=null, org.apache.commons.lang3.builder.DiffResultTest$SimpleClass@6e9c45d0=null, 5=null}>

org.apache.commons.lang3.builder.ToStringBuilderTest.testReflectionIntArray(org.apache.commons.lang3.builder.ToStringBuilderTest)
  Run 1: ToStringBuilderTest.testReflectionIntArray:178 expected:<...@625e64fe[{1,2,-3,4}[]]> but was:<...@625e64fe[{1,2,-3,4}[<null>]>
  Run 2: ToStringBuilderTest.after:48->validateNullToStringStyleRegistry:595 » ConcurrentModification

org.apache.commons.lang3.builder.ToStringBuilderTest.testReflectionIntArrayArray(org.apache.commons.lang3.builder.ToStringBuilderTest)
  Run 1: ToStringBuilderTest.testReflectionIntArrayArray:262 expected:<...9[{{1,2},<null>,{5}}[]]> but was:<...9[{{1,2},<null>,{5}}[<null>]>
  Run 2: ToStringBuilderTest.after:48->validateNullToStringStyleRegistry:595 » ConcurrentModification

org.apache.commons.lang3.builder.ToStringBuilderTest.testReflectionInteger(org.apache.commons.lang3.builder.ToStringBuilderTest)
  Run 1: ToStringBuilderTest.testReflectionInteger:97 expected:<...ger@3edcbc7b[value=5[]]> but was:<...ger@3edcbc7b[value=5[,<null>]>
  Run 2: ToStringBuilderTest.after:48->validateNullToStringStyleRegistry:595 » ConcurrentModification

org.apache.commons.lang3.builder.ToStringBuilderTest.testReflectionLongArray(org.apache.commons.lang3.builder.ToStringBuilderTest)
  Run 1: ToStringBuilderTest.testReflectionLongArray:169 expected:<...@440cb577[{1,2,-3,4}[]]> but was:<...@440cb577[{1,2,-3,4}[<null>]>
  Run 2: ToStringBuilderTest.after:48->validateNullToStringStyleRegistry:595 » ConcurrentModification

org.apache.commons.lang3.builder.ToStringBuilderTest.testReflectionLongArrayArray(org.apache.commons.lang3.builder.ToStringBuilderTest)
  Run 1: ToStringBuilderTest.testReflectionLongArrayArray:253 expected:<...c[{{1,2},<null>,{5}}[]]> but was:<...c[{{1,2},<null>,{5}}[<null>]>
  Run 2: ToStringBuilderTest.after:48->validateNullToStringStyleRegistry:595 » ConcurrentModification

org.apache.commons.lang3.builder.ToStringBuilderTest.testReflectionObjectArray(org.apache.commons.lang3.builder.ToStringBuilderTest)
  Run 1: ToStringBuilderTest.testReflectionObjectArray:160 expected:<...c30[{<null>,5,{3,6}}[]]> but was:<...c30[{<null>,5,{3,6}}[<null>]>
  Run 2: ToStringBuilderTest.after:48->validateNullToStringStyleRegistry:595 » ConcurrentModification

org.apache.commons.lang3.builder.ToStringBuilderTest.testReflectionObjectCycle(org.apache.commons.lang3.builder.ToStringBuilderTest)
  Run 1: ToStringBuilderTest.testReflectionObjectCycle:562 expected:<...nTestCycleA@50258792[]]]> but was:<...nTestCycleA@50258792[,<null>,<null>]>
  Run 2: ToStringBuilderTest.after:48->validateNullToStringStyleRegistry:595 » ConcurrentModification

org.apache.commons.lang3.builder.ToStringBuilderTest.testReflectionShortArray(org.apache.commons.lang3.builder.ToStringBuilderTest)
  Run 1: ToStringBuilderTest.testReflectionShortArray:187 expected:<...S@9b92078[{1,2,-3,4}[]]> but was:<...S@9b92078[{1,2,-3,4}[<null>]>
  Run 2: ToStringBuilderTest.after:48->validateNullToStringStyleRegistry:595 » ConcurrentModification

org.apache.commons.lang3.builder.ToStringBuilderTest.testReflectionStatics(org.apache.commons.lang3.builder.ToStringBuilderTest)
  Run 1: ToStringBuilderTest.testReflectionStatics:927 expected:<...ng,instanceInt=67890[]]> but was:<...ng,instanceInt=67890[,<null>]>
  Run 2: ToStringBuilderTest.after:48->validateNullToStringStyleRegistry:595 » ConcurrentModification

org.apache.commons.lang3.builder.ToStringBuilderTest.testReflectionhortArrayArray(org.apache.commons.lang3.builder.ToStringBuilderTest)
  Run 1: ToStringBuilderTest.testReflectionhortArrayArray:271 expected:<...8[{{1,2},<null>,{5}}[]]> but was:<...8[{{1,2},<null>,{5}}[<null>]>
  Run 2: ToStringBuilderTest.after:48->validateNullToStringStyleRegistry:595 » ConcurrentModification

org.apache.commons.lang3.builder.ToStringBuilderTest.testReflectionyteArray(org.apache.commons.lang3.builder.ToStringBuilderTest)
  Run 1: ToStringBuilderTest.testReflectionyteArray:196 expected:<...@330bdf62[{1,2,-3,4}[]]> but was:<...@330bdf62[{1,2,-3,4}[<null>]>
  Run 2: ToStringBuilderTest.after:48->validateNullToStringStyleRegistry:595 » ConcurrentModification

org.apache.commons.lang3.builder.ToStringBuilderTest.testSelfInstanceTwoVarsReflectionObjectCycle(org.apache.commons.lang3.builder.ToStringBuilderTest)
  Run 1: ToStringBuilderTest.testSelfInstanceTwoVarsReflectionObjectCycle:549 expected:<...rType=The Other Type[]]> but was:<...rType=The Other Type[,<null>]>
  Run 2: ToStringBuilderTest.after:48->validateNullToStringStyleRegistry:595 » ConcurrentModification

org.apache.commons.lang3.builder.ToStringBuilderTest.testSelfInstanceVarReflectionObjectCycle(org.apache.commons.lang3.builder.ToStringBuilderTest)
  Run 1: ToStringBuilderTest.testSelfInstanceVarReflectionObjectCycle:539 expected:<...TestFixture@5cddf1df[]]> but was:<...TestFixture@5cddf1df[,<null>]>
  Run 2: ToStringBuilderTest.after:48->validateNullToStringStyleRegistry:595 » ConcurrentModification

  ToStringBuilderTest.after:48->validateNullToStringStyleRegistry:595 » ConcurrentModification
org.apache.commons.lang3.builder.ToStringBuilderTest.testShort(org.apache.commons.lang3.builder.ToStringBuilderTest)
  Run 1: ToStringBuilderTest.testShort:672 expected:<...g.Integer@3edcbc7b[3[]]> but was:<...g.Integer@3edcbc7b[3[,<null>]>
  Run 2: ToStringBuilderTest.after:48->validateNullToStringStyleRegistry:595 » ConcurrentModification

org.apache.commons.lang3.builder.ToStringBuilderTest.testShortArray(org.apache.commons.lang3.builder.ToStringBuilderTest)
  Run 1: ToStringBuilderTest.testShortArray:747 expected:<...@3edcbc7b[{1,2,-3,4}[]]> but was:<...@3edcbc7b[{1,2,-3,4}[,<null>]>
  Run 2: ToStringBuilderTest.after:48->validateNullToStringStyleRegistry:595 » ConcurrentModification

org.apache.commons.lang3.builder.ToStringBuilderTest.testShortArrayArray(org.apache.commons.lang3.builder.ToStringBuilderTest)
  Run 1: ToStringBuilderTest.testShortArrayArray:827 expected:<...b[{{1,2},<null>,{5}}[]]> but was:<...b[{{1,2},<null>,{5}}[,<null>]>
  Run 2: ToStringBuilderTest.after:48->validateNullToStringStyleRegistry:595 » ConcurrentModification

org.apache.commons.lang3.builder.ToStringBuilderTest.testSimpleReflectionObjectCycle(org.apache.commons.lang3.builder.ToStringBuilderTest)
  Run 1: ToStringBuilderTest.testSimpleReflectionObjectCycle:530 expected:<...nTestFixture@67c9c73[]]> but was:<...nTestFixture@67c9c73[,<null>]>
  Run 2: ToStringBuilderTest.after:48->validateNullToStringStyleRegistry:595 » ConcurrentModification

org.apache.commons.lang3.builder.ToStringBuilderTest.testSimpleReflectionStatics(org.apache.commons.lang3.builder.ToStringBuilderTest)
  Run 1: ToStringBuilderTest.testSimpleReflectionStatics:907 expected:<...ring,staticInt=12345[]]> but was:<...ring,staticInt=12345[,<null>]>
  Run 2: ToStringBuilderTest.after:48->validateNullToStringStyleRegistry:595 » ConcurrentModification

  ToStringBuilderTest.after:48->validateNullToStringStyleRegistry:595 » ConcurrentModification


Tests run: 3526, Failures: 90, Errors: 67, Skipped: 96

[INFO] ------------------------------------------------------------------------
[INFO] BUILD FAILURE
[INFO] ------------------------------------------------------------------------
[INFO] Total time: 33.719s
[INFO] Finished at: Tue Aug 04 08:13:51 BST 2015
[INFO] Final Memory: 23M/414M
[INFO] ------------------------------------------------------------------------
[ERROR] Failed to execute goal org.apache.maven.plugins:maven-surefire-plugin:2.18:test (default-test) on project commons-lang3: There are test failures.
[ERROR] 
[ERROR] Please refer to /home/perham/Study/LittleDarwin/Cases/commons-lang3-3.4-src/target/surefire-reports for the individual test results.
[ERROR] -> [Help 1]
[ERROR] 
[ERROR] To see the full stack trace of the errors, re-run Maven with the -e switch.
[ERROR] Re-run Maven using the -X switch to enable full debug logging.
[ERROR] 
[ERROR] For more information about the errors and possible solutions, please read the following articles:
[ERROR] [Help 1] http://cwiki.apache.org/confluence/display/MAVEN/MojoFailureException
