[INFO] Scanning for projects...
[INFO]                                                                         
[INFO] ------------------------------------------------------------------------
[INFO] Building Apache Commons Lang 3.4
[INFO] ------------------------------------------------------------------------
[INFO] 
[INFO] --- maven-enforcer-plugin:1.3.1:enforce (enforce-maven-3) @ commons-lang3 ---
[INFO] 
[INFO] --- build-helper-maven-plugin:1.8:parse-version (parse-version) @ commons-lang3 ---
[INFO] 
[INFO] --- maven-antrun-plugin:1.8:run (javadoc.resources) @ commons-lang3 ---
[INFO] Executing tasks

main:
[INFO] Executed tasks
[INFO] 
[INFO] --- maven-remote-resources-plugin:1.5:process (default) @ commons-lang3 ---
[INFO] 
[INFO] --- buildnumber-maven-plugin:1.3:create (default) @ commons-lang3 ---
[INFO] Executing: /bin/sh -c cd /home/perham/Study/LittleDarwin/Cases/commons-lang3-3.4-src && svn --non-interactive info
[INFO] Working directory: /home/perham/Study/LittleDarwin/Cases/commons-lang3-3.4-src
[INFO] Storing buildNumber: ?????? at timestamp: 1438663069514
[INFO] Executing: /bin/sh -c cd /home/perham/Study/LittleDarwin/Cases/commons-lang3-3.4-src && svn --non-interactive info
[INFO] Working directory: /home/perham/Study/LittleDarwin/Cases/commons-lang3-3.4-src
[INFO] Storing buildScmBranch: UNKNOWN_BRANCH
[INFO] 
[INFO] --- maven-resources-plugin:2.7:resources (default-resources) @ commons-lang3 ---
[INFO] Using 'ISO-8859-1' encoding to copy filtered resources.
[INFO] Copying 0 resource
[INFO] Copying 2 resources to META-INF
[INFO] 
[INFO] --- maven-compiler-plugin:3.2:compile (default-compile) @ commons-lang3 ---
[INFO] Changes detected - recompiling the module!
[INFO] Compiling 133 source files to /home/perham/Study/LittleDarwin/Cases/commons-lang3-3.4-src/target/classes
[INFO] /home/perham/Study/LittleDarwin/Cases/commons-lang3-3.4-src/src/main/java/org/apache/commons/lang3/SerializationUtils.java: /home/perham/Study/LittleDarwin/Cases/commons-lang3-3.4-src/src/main/java/org/apache/commons/lang3/SerializationUtils.java uses unchecked or unsafe operations.
[INFO] /home/perham/Study/LittleDarwin/Cases/commons-lang3-3.4-src/src/main/java/org/apache/commons/lang3/SerializationUtils.java: Recompile with -Xlint:unchecked for details.
[INFO] 
[INFO] --- maven-bundle-plugin:2.5.3:manifest (bundle-manifest) @ commons-lang3 ---
[INFO] 
[INFO] --- animal-sniffer-maven-plugin:1.13:check (checkAPIcompatibility) @ commons-lang3 ---
[INFO] Checking unresolved references to org.codehaus.mojo.signature:java16:1.0
[INFO] 
[INFO] --- maven-resources-plugin:2.7:testResources (default-testResources) @ commons-lang3 ---
[INFO] Using 'ISO-8859-1' encoding to copy filtered resources.
[INFO] Copying 2 resources
[INFO] Copying 2 resources to META-INF
[INFO] 
[INFO] --- maven-compiler-plugin:3.2:testCompile (default-testCompile) @ commons-lang3 ---
[INFO] Nothing to compile - all classes are up to date
[INFO] 
[INFO] --- maven-surefire-plugin:2.18:test (default-test) @ commons-lang3 ---
[INFO] Surefire report directory: /home/perham/Study/LittleDarwin/Cases/commons-lang3-3.4-src/target/surefire-reports

-------------------------------------------------------
 T E S T S
-------------------------------------------------------
Running org.apache.commons.lang3.ValidateTest
Tests run: 63, Failures: 0, Errors: 0, Skipped: 0, Time elapsed: 0.032 sec - in org.apache.commons.lang3.ValidateTest
Running org.apache.commons.lang3.LocaleUtilsTest
Tests run: 15, Failures: 0, Errors: 0, Skipped: 0, Time elapsed: 0.019 sec - in org.apache.commons.lang3.LocaleUtilsTest
Running org.apache.commons.lang3.tuple.MutableTripleTest
Tests run: 8, Failures: 0, Errors: 0, Skipped: 0, Time elapsed: 0.011 sec - in org.apache.commons.lang3.tuple.MutableTripleTest
Running org.apache.commons.lang3.tuple.TripleTest
Tests run: 10, Failures: 0, Errors: 0, Skipped: 0, Time elapsed: 0.001 sec - in org.apache.commons.lang3.tuple.TripleTest
Running org.apache.commons.lang3.tuple.ImmutablePairTest
Tests run: 6, Failures: 0, Errors: 0, Skipped: 0, Time elapsed: 0.001 sec - in org.apache.commons.lang3.tuple.ImmutablePairTest
Running org.apache.commons.lang3.tuple.MutablePairTest
Tests run: 8, Failures: 0, Errors: 0, Skipped: 0, Time elapsed: 0.001 sec - in org.apache.commons.lang3.tuple.MutablePairTest
Running org.apache.commons.lang3.tuple.ImmutableTripleTest
Tests run: 6, Failures: 0, Errors: 0, Skipped: 0, Time elapsed: 0 sec - in org.apache.commons.lang3.tuple.ImmutableTripleTest
Running org.apache.commons.lang3.tuple.PairTest
Tests run: 9, Failures: 0, Errors: 0, Skipped: 0, Time elapsed: 0.001 sec - in org.apache.commons.lang3.tuple.PairTest
Running org.apache.commons.lang3.StringUtilsIsTest
Tests run: 8, Failures: 0, Errors: 0, Skipped: 0, Time elapsed: 0.004 sec - in org.apache.commons.lang3.StringUtilsIsTest
Running org.apache.commons.lang3.JavaVersionTest
Tests run: 3, Failures: 0, Errors: 0, Skipped: 0, Time elapsed: 0 sec - in org.apache.commons.lang3.JavaVersionTest
Running org.apache.commons.lang3.builder.NoFieldNamesToStringStyleTest
Tests run: 8, Failures: 0, Errors: 0, Skipped: 0, Time elapsed: 0.009 sec - in org.apache.commons.lang3.builder.NoFieldNamesToStringStyleTest
Running org.apache.commons.lang3.builder.ShortPrefixToStringStyleTest
Tests run: 8, Failures: 0, Errors: 0, Skipped: 0, Time elapsed: 0.005 sec - in org.apache.commons.lang3.builder.ShortPrefixToStringStyleTest
Running org.apache.commons.lang3.builder.DiffResultTest
Tests run: 9, Failures: 1, Errors: 6, Skipped: 0, Time elapsed: 0.012 sec <<< FAILURE! - in org.apache.commons.lang3.builder.DiffResultTest
testToStringOutput(org.apache.commons.lang3.builder.DiffResultTest)  Time elapsed: 0.009 sec  <<< ERROR!
java.lang.IllegalArgumentException: List of differences cannot be null
	at org.apache.commons.lang3.builder.DiffResult.<init>(DiffResult.java:20)
	at org.apache.commons.lang3.builder.DiffBuilder.build(DiffBuilder.java:955)
	at org.apache.commons.lang3.builder.DiffResultTest.testToStringOutput(DiffResultTest.java:92)

testToStringSpecifyStyleOutput(org.apache.commons.lang3.builder.DiffResultTest)  Time elapsed: 0.001 sec  <<< ERROR!
java.lang.IllegalArgumentException: List of differences cannot be null
	at org.apache.commons.lang3.builder.DiffResult.<init>(DiffResult.java:20)
	at org.apache.commons.lang3.builder.DiffBuilder.build(DiffBuilder.java:955)
	at org.apache.commons.lang3.builder.DiffResultTest$SimpleClass.diff(DiffResultTest.java:51)
	at org.apache.commons.lang3.builder.DiffResultTest.testToStringSpecifyStyleOutput(DiffResultTest.java:102)

testNullList(org.apache.commons.lang3.builder.DiffResultTest)  Time elapsed: 0 sec  <<< FAILURE!
java.lang.AssertionError: Expected exception: java.lang.IllegalArgumentException
	at org.junit.internal.runners.statements.ExpectException.evaluate(ExpectException.java:32)
	at org.junit.runners.ParentRunner.runLeaf(ParentRunner.java:325)
	at org.junit.runners.BlockJUnit4ClassRunner.runChild(BlockJUnit4ClassRunner.java:78)
	at org.junit.runners.BlockJUnit4ClassRunner.runChild(BlockJUnit4ClassRunner.java:57)
	at org.junit.runners.ParentRunner$3.run(ParentRunner.java:290)
	at org.junit.runners.ParentRunner$1.schedule(ParentRunner.java:71)
	at org.junit.runners.ParentRunner.runChildren(ParentRunner.java:288)
	at org.junit.runners.ParentRunner.access$000(ParentRunner.java:58)
	at org.junit.runners.ParentRunner$2.evaluate(ParentRunner.java:268)
	at org.junit.runners.ParentRunner.run(ParentRunner.java:363)
	at org.apache.maven.surefire.junit4.JUnit4Provider.execute(JUnit4Provider.java:283)
	at org.apache.maven.surefire.junit4.JUnit4Provider.executeWithRerun(JUnit4Provider.java:173)
	at org.apache.maven.surefire.junit4.JUnit4Provider.executeTestSet(JUnit4Provider.java:153)
	at org.apache.maven.surefire.junit4.JUnit4Provider.invoke(JUnit4Provider.java:128)
	at org.apache.maven.surefire.booter.ForkedBooter.invokeProviderInSameClassLoader(ForkedBooter.java:203)
	at org.apache.maven.surefire.booter.ForkedBooter.runSuitesInProcess(ForkedBooter.java:155)
	at org.apache.maven.surefire.booter.ForkedBooter.main(ForkedBooter.java:103)

testNoDifferencesString(org.apache.commons.lang3.builder.DiffResultTest)  Time elapsed: 0 sec  <<< ERROR!
java.lang.IllegalArgumentException: List of differences cannot be null
	at org.apache.commons.lang3.builder.DiffResult.<init>(DiffResult.java:20)
	at org.apache.commons.lang3.builder.DiffBuilder.build(DiffBuilder.java:955)
	at org.apache.commons.lang3.builder.DiffResultTest.testNoDifferencesString(DiffResultTest.java:145)

testListIsNonModifiable(org.apache.commons.lang3.builder.DiffResultTest)  Time elapsed: 0.001 sec  <<< ERROR!
java.lang.Exception: Unexpected exception, expected<java.lang.UnsupportedOperationException> but was<java.lang.IllegalArgumentException>
	at org.apache.commons.lang3.builder.DiffResult.<init>(DiffResult.java:20)
	at org.apache.commons.lang3.builder.DiffBuilder.build(DiffBuilder.java:955)
	at org.apache.commons.lang3.builder.DiffResultTest$SimpleClass.diff(DiffResultTest.java:51)
	at org.apache.commons.lang3.builder.DiffResultTest.testListIsNonModifiable(DiffResultTest.java:65)

testNullStyle(org.apache.commons.lang3.builder.DiffResultTest)  Time elapsed: 0 sec  <<< ERROR!
java.lang.IllegalArgumentException: List of differences cannot be null
	at org.apache.commons.lang3.builder.DiffResult.<init>(DiffResult.java:20)
	at org.apache.commons.lang3.builder.DiffBuilder.build(DiffBuilder.java:955)
	at org.apache.commons.lang3.builder.DiffResultTest$SimpleClass.diff(DiffResultTest.java:51)
	at org.apache.commons.lang3.builder.DiffResultTest.testNullStyle(DiffResultTest.java:138)

testIterator(org.apache.commons.lang3.builder.DiffResultTest)  Time elapsed: 0 sec  <<< ERROR!
java.lang.IllegalArgumentException: List of differences cannot be null
	at org.apache.commons.lang3.builder.DiffResult.<init>(DiffResult.java:20)
	at org.apache.commons.lang3.builder.DiffBuilder.build(DiffBuilder.java:955)
	at org.apache.commons.lang3.builder.DiffResultTest$SimpleClass.diff(DiffResultTest.java:51)
	at org.apache.commons.lang3.builder.DiffResultTest.testIterator(DiffResultTest.java:78)

Running org.apache.commons.lang3.builder.CompareToBuilderTest
Tests run: 48, Failures: 0, Errors: 0, Skipped: 0, Time elapsed: 0.015 sec - in org.apache.commons.lang3.builder.CompareToBuilderTest
Running org.apache.commons.lang3.builder.MultilineRecursiveToStringStyleTest
Tests run: 10, Failures: 0, Errors: 0, Skipped: 0, Time elapsed: 0.004 sec - in org.apache.commons.lang3.builder.MultilineRecursiveToStringStyleTest
Running org.apache.commons.lang3.builder.RecursiveToStringStyleTest
Tests run: 8, Failures: 0, Errors: 0, Skipped: 0, Time elapsed: 0.005 sec - in org.apache.commons.lang3.builder.RecursiveToStringStyleTest
Running org.apache.commons.lang3.builder.DefaultToStringStyleTest
Tests run: 8, Failures: 0, Errors: 0, Skipped: 0, Time elapsed: 0.003 sec - in org.apache.commons.lang3.builder.DefaultToStringStyleTest
Running org.apache.commons.lang3.builder.ReflectionToStringBuilderExcludeTest
Tests run: 11, Failures: 0, Errors: 0, Skipped: 0, Time elapsed: 0.003 sec - in org.apache.commons.lang3.builder.ReflectionToStringBuilderExcludeTest
Running org.apache.commons.lang3.builder.StandardToStringStyleTest
Tests run: 8, Failures: 0, Errors: 0, Skipped: 0, Time elapsed: 0.002 sec - in org.apache.commons.lang3.builder.StandardToStringStyleTest
Running org.apache.commons.lang3.builder.ToStringStyleTest
Tests run: 12, Failures: 0, Errors: 0, Skipped: 0, Time elapsed: 0.002 sec - in org.apache.commons.lang3.builder.ToStringStyleTest
Running org.apache.commons.lang3.builder.DiffTest
Tests run: 4, Failures: 0, Errors: 0, Skipped: 0, Time elapsed: 0 sec - in org.apache.commons.lang3.builder.DiffTest
Running org.apache.commons.lang3.builder.SimpleToStringStyleTest
Tests run: 8, Failures: 0, Errors: 0, Skipped: 0, Time elapsed: 0.002 sec - in org.apache.commons.lang3.builder.SimpleToStringStyleTest
Running org.apache.commons.lang3.builder.MultiLineToStringStyleTest
Tests run: 8, Failures: 0, Errors: 0, Skipped: 0, Time elapsed: 0.003 sec - in org.apache.commons.lang3.builder.MultiLineToStringStyleTest
Running org.apache.commons.lang3.builder.ToStringStyleConcurrencyTest
Tests run: 3, Failures: 0, Errors: 0, Skipped: 0, Time elapsed: 4.576 sec - in org.apache.commons.lang3.builder.ToStringStyleConcurrencyTest
Running org.apache.commons.lang3.builder.ReflectionToStringBuilderMutateInspectConcurrencyTest
Tests run: 1, Failures: 0, Errors: 0, Skipped: 1, Time elapsed: 0 sec - in org.apache.commons.lang3.builder.ReflectionToStringBuilderMutateInspectConcurrencyTest
Running org.apache.commons.lang3.builder.ToStringBuilderTest
Tests run: 74, Failures: 0, Errors: 0, Skipped: 1, Time elapsed: 0.046 sec - in org.apache.commons.lang3.builder.ToStringBuilderTest
Running org.apache.commons.lang3.builder.EqualsBuilderTest
Tests run: 48, Failures: 0, Errors: 0, Skipped: 0, Time elapsed: 0.024 sec - in org.apache.commons.lang3.builder.EqualsBuilderTest
Running org.apache.commons.lang3.builder.HashCodeBuilderAndEqualsBuilderTest
Tests run: 4, Failures: 0, Errors: 0, Skipped: 0, Time elapsed: 0.013 sec - in org.apache.commons.lang3.builder.HashCodeBuilderAndEqualsBuilderTest
Running org.apache.commons.lang3.builder.ReflectionToStringBuilderConcurrencyTest
Tests run: 3, Failures: 0, Errors: 0, Skipped: 3, Time elapsed: 0.001 sec - in org.apache.commons.lang3.builder.ReflectionToStringBuilderConcurrencyTest
Running org.apache.commons.lang3.builder.JsonToStringStyleTest
Tests run: 9, Failures: 0, Errors: 0, Skipped: 0, Time elapsed: 0.004 sec - in org.apache.commons.lang3.builder.JsonToStringStyleTest
Running org.apache.commons.lang3.builder.NoClassNameToStringStyleTest
Tests run: 8, Failures: 0, Errors: 0, Skipped: 0, Time elapsed: 0.006 sec - in org.apache.commons.lang3.builder.NoClassNameToStringStyleTest
Running org.apache.commons.lang3.builder.DiffBuilderTest
Tests run: 30, Failures: 0, Errors: 28, Skipped: 0, Time elapsed: 0.034 sec <<< FAILURE! - in org.apache.commons.lang3.builder.DiffBuilderTest
testCharArray(org.apache.commons.lang3.builder.DiffBuilderTest)  Time elapsed: 0.003 sec  <<< ERROR!
java.lang.IllegalArgumentException: List of differences cannot be null
	at org.apache.commons.lang3.builder.DiffResult.<init>(DiffResult.java:20)
	at org.apache.commons.lang3.builder.DiffBuilder.build(DiffBuilder.java:955)
	at org.apache.commons.lang3.builder.DiffBuilderTest$TypeTestClass.diff(DiffBuilderTest.java:63)
	at org.apache.commons.lang3.builder.DiffBuilderTest.testCharArray(DiffBuilderTest.java:169)

testObjectArray(org.apache.commons.lang3.builder.DiffBuilderTest)  Time elapsed: 0.002 sec  <<< ERROR!
java.lang.IllegalArgumentException: List of differences cannot be null
	at org.apache.commons.lang3.builder.DiffResult.<init>(DiffResult.java:20)
	at org.apache.commons.lang3.builder.DiffBuilder.build(DiffBuilder.java:955)
	at org.apache.commons.lang3.builder.DiffBuilderTest$TypeTestClass.diff(DiffBuilderTest.java:63)
	at org.apache.commons.lang3.builder.DiffBuilderTest.testObjectArray(DiffBuilderTest.java:381)

testFloatArray(org.apache.commons.lang3.builder.DiffBuilderTest)  Time elapsed: 0.001 sec  <<< ERROR!
java.lang.IllegalArgumentException: List of differences cannot be null
	at org.apache.commons.lang3.builder.DiffResult.<init>(DiffResult.java:20)
	at org.apache.commons.lang3.builder.DiffBuilder.build(DiffBuilder.java:955)
	at org.apache.commons.lang3.builder.DiffBuilderTest$TypeTestClass.diff(DiffBuilderTest.java:63)
	at org.apache.commons.lang3.builder.DiffBuilderTest.testFloatArray(DiffBuilderTest.java:224)

testObjectsNotSameButEqual(org.apache.commons.lang3.builder.DiffBuilderTest)  Time elapsed: 0.001 sec  <<< ERROR!
java.lang.IllegalArgumentException: List of differences cannot be null
	at org.apache.commons.lang3.builder.DiffResult.<init>(DiffResult.java:20)
	at org.apache.commons.lang3.builder.DiffBuilder.build(DiffBuilder.java:955)
	at org.apache.commons.lang3.builder.DiffBuilderTest$TypeTestClass.diff(DiffBuilderTest.java:63)
	at org.apache.commons.lang3.builder.DiffBuilderTest.testObjectsNotSameButEqual(DiffBuilderTest.java:356)

testInt(org.apache.commons.lang3.builder.DiffBuilderTest)  Time elapsed: 0.001 sec  <<< ERROR!
java.lang.IllegalArgumentException: List of differences cannot be null
	at org.apache.commons.lang3.builder.DiffResult.<init>(DiffResult.java:20)
	at org.apache.commons.lang3.builder.DiffBuilder.build(DiffBuilder.java:955)
	at org.apache.commons.lang3.builder.DiffBuilderTest$TypeTestClass.diff(DiffBuilderTest.java:63)
	at org.apache.commons.lang3.builder.DiffBuilderTest.testInt(DiffBuilderTest.java:239)

testByteArray(org.apache.commons.lang3.builder.DiffBuilderTest)  Time elapsed: 0.001 sec  <<< ERROR!
java.lang.IllegalArgumentException: List of differences cannot be null
	at org.apache.commons.lang3.builder.DiffResult.<init>(DiffResult.java:20)
	at org.apache.commons.lang3.builder.DiffBuilder.build(DiffBuilder.java:955)
	at org.apache.commons.lang3.builder.DiffBuilderTest$TypeTestClass.diff(DiffBuilderTest.java:63)
	at org.apache.commons.lang3.builder.DiffBuilderTest.testByteArray(DiffBuilderTest.java:142)

testFloat(org.apache.commons.lang3.builder.DiffBuilderTest)  Time elapsed: 0.001 sec  <<< ERROR!
java.lang.IllegalArgumentException: List of differences cannot be null
	at org.apache.commons.lang3.builder.DiffResult.<init>(DiffResult.java:20)
	at org.apache.commons.lang3.builder.DiffBuilder.build(DiffBuilder.java:955)
	at org.apache.commons.lang3.builder.DiffBuilderTest$TypeTestClass.diff(DiffBuilderTest.java:63)
	at org.apache.commons.lang3.builder.DiffBuilderTest.testFloat(DiffBuilderTest.java:211)

testShort(org.apache.commons.lang3.builder.DiffBuilderTest)  Time elapsed: 0.001 sec  <<< ERROR!
java.lang.IllegalArgumentException: List of differences cannot be null
	at org.apache.commons.lang3.builder.DiffResult.<init>(DiffResult.java:20)
	at org.apache.commons.lang3.builder.DiffBuilder.build(DiffBuilder.java:955)
	at org.apache.commons.lang3.builder.DiffBuilderTest$TypeTestClass.diff(DiffBuilderTest.java:63)
	at org.apache.commons.lang3.builder.DiffBuilderTest.testShort(DiffBuilderTest.java:293)

testByte(org.apache.commons.lang3.builder.DiffBuilderTest)  Time elapsed: 0.001 sec  <<< ERROR!
java.lang.IllegalArgumentException: List of differences cannot be null
	at org.apache.commons.lang3.builder.DiffResult.<init>(DiffResult.java:20)
	at org.apache.commons.lang3.builder.DiffBuilder.build(DiffBuilder.java:955)
	at org.apache.commons.lang3.builder.DiffBuilderTest$TypeTestClass.diff(DiffBuilderTest.java:63)
	at org.apache.commons.lang3.builder.DiffBuilderTest.testByte(DiffBuilderTest.java:130)

testChar(org.apache.commons.lang3.builder.DiffBuilderTest)  Time elapsed: 0.001 sec  <<< ERROR!
java.lang.IllegalArgumentException: List of differences cannot be null
	at org.apache.commons.lang3.builder.DiffResult.<init>(DiffResult.java:20)
	at org.apache.commons.lang3.builder.DiffBuilder.build(DiffBuilder.java:955)
	at org.apache.commons.lang3.builder.DiffBuilderTest$TypeTestClass.diff(DiffBuilderTest.java:63)
	at org.apache.commons.lang3.builder.DiffBuilderTest.testChar(DiffBuilderTest.java:156)

testLong(org.apache.commons.lang3.builder.DiffBuilderTest)  Time elapsed: 0.002 sec  <<< ERROR!
java.lang.IllegalArgumentException: List of differences cannot be null
	at org.apache.commons.lang3.builder.DiffResult.<init>(DiffResult.java:20)
	at org.apache.commons.lang3.builder.DiffBuilder.build(DiffBuilder.java:955)
	at org.apache.commons.lang3.builder.DiffBuilderTest$TypeTestClass.diff(DiffBuilderTest.java:63)
	at org.apache.commons.lang3.builder.DiffBuilderTest.testLong(DiffBuilderTest.java:266)

testObjectsSameAndEqual(org.apache.commons.lang3.builder.DiffBuilderTest)  Time elapsed: 0 sec  <<< ERROR!
java.lang.IllegalArgumentException: List of differences cannot be null
	at org.apache.commons.lang3.builder.DiffResult.<init>(DiffResult.java:20)
	at org.apache.commons.lang3.builder.DiffBuilder.build(DiffBuilder.java:955)
	at org.apache.commons.lang3.builder.DiffBuilderTest$TypeTestClass.diff(DiffBuilderTest.java:63)
	at org.apache.commons.lang3.builder.DiffBuilderTest.testObjectsSameAndEqual(DiffBuilderTest.java:340)

testStylePassedToDiffResult(org.apache.commons.lang3.builder.DiffBuilderTest)  Time elapsed: 0.001 sec  <<< ERROR!
java.lang.IllegalArgumentException: List of differences cannot be null
	at org.apache.commons.lang3.builder.DiffResult.<init>(DiffResult.java:20)
	at org.apache.commons.lang3.builder.DiffBuilder.build(DiffBuilder.java:955)
	at org.apache.commons.lang3.builder.DiffBuilderTest$TypeTestClass.diff(DiffBuilderTest.java:63)
	at org.apache.commons.lang3.builder.DiffBuilderTest.testStylePassedToDiffResult(DiffBuilderTest.java:451)

testBoolean(org.apache.commons.lang3.builder.DiffBuilderTest)  Time elapsed: 0 sec  <<< ERROR!
java.lang.IllegalArgumentException: List of differences cannot be null
	at org.apache.commons.lang3.builder.DiffResult.<init>(DiffResult.java:20)
	at org.apache.commons.lang3.builder.DiffBuilder.build(DiffBuilder.java:955)
	at org.apache.commons.lang3.builder.DiffBuilderTest$TypeTestClass.diff(DiffBuilderTest.java:63)
	at org.apache.commons.lang3.builder.DiffBuilderTest.testBoolean(DiffBuilderTest.java:102)

testTriviallyEqualTestDisabled(org.apache.commons.lang3.builder.DiffBuilderTest)  Time elapsed: 0.001 sec  <<< ERROR!
java.lang.IllegalArgumentException: List of differences cannot be null
	at org.apache.commons.lang3.builder.DiffResult.<init>(DiffResult.java:20)
	at org.apache.commons.lang3.builder.DiffBuilder.build(DiffBuilder.java:955)
	at org.apache.commons.lang3.builder.DiffBuilderTest.testTriviallyEqualTestDisabled(DiffBuilderTest.java:466)

testBooleanArray(org.apache.commons.lang3.builder.DiffBuilderTest)  Time elapsed: 0.001 sec  <<< ERROR!
java.lang.IllegalArgumentException: List of differences cannot be null
	at org.apache.commons.lang3.builder.DiffResult.<init>(DiffResult.java:20)
	at org.apache.commons.lang3.builder.DiffBuilder.build(DiffBuilder.java:955)
	at org.apache.commons.lang3.builder.DiffBuilderTest$TypeTestClass.diff(DiffBuilderTest.java:63)
	at org.apache.commons.lang3.builder.DiffBuilderTest.testBooleanArray(DiffBuilderTest.java:115)

testSimilarObjectIgnoresAppends(org.apache.commons.lang3.builder.DiffBuilderTest)  Time elapsed: 0.001 sec  <<< ERROR!
java.lang.IllegalArgumentException: List of differences cannot be null
	at org.apache.commons.lang3.builder.DiffResult.<init>(DiffResult.java:20)
	at org.apache.commons.lang3.builder.DiffBuilder.build(DiffBuilder.java:955)
	at org.apache.commons.lang3.builder.DiffBuilderTest.testSimilarObjectIgnoresAppends(DiffBuilderTest.java:441)

testByteArrayEqualAsObject(org.apache.commons.lang3.builder.DiffBuilderTest)  Time elapsed: 0.001 sec  <<< ERROR!
java.lang.IllegalArgumentException: List of differences cannot be null
	at org.apache.commons.lang3.builder.DiffResult.<init>(DiffResult.java:20)
	at org.apache.commons.lang3.builder.DiffBuilder.build(DiffBuilder.java:955)
	at org.apache.commons.lang3.builder.DiffBuilderTest.testByteArrayEqualAsObject(DiffBuilderTest.java:401)

testLongArray(org.apache.commons.lang3.builder.DiffBuilderTest)  Time elapsed: 0.001 sec  <<< ERROR!
java.lang.IllegalArgumentException: List of differences cannot be null
	at org.apache.commons.lang3.builder.DiffResult.<init>(DiffResult.java:20)
	at org.apache.commons.lang3.builder.DiffBuilder.build(DiffBuilder.java:955)
	at org.apache.commons.lang3.builder.DiffBuilderTest$TypeTestClass.diff(DiffBuilderTest.java:63)
	at org.apache.commons.lang3.builder.DiffBuilderTest.testLongArray(DiffBuilderTest.java:279)

testShortArray(org.apache.commons.lang3.builder.DiffBuilderTest)  Time elapsed: 0.001 sec  <<< ERROR!
java.lang.IllegalArgumentException: List of differences cannot be null
	at org.apache.commons.lang3.builder.DiffResult.<init>(DiffResult.java:20)
	at org.apache.commons.lang3.builder.DiffBuilder.build(DiffBuilder.java:955)
	at org.apache.commons.lang3.builder.DiffBuilderTest$TypeTestClass.diff(DiffBuilderTest.java:63)
	at org.apache.commons.lang3.builder.DiffBuilderTest.testShortArray(DiffBuilderTest.java:306)

testObjectArrayEqual(org.apache.commons.lang3.builder.DiffBuilderTest)  Time elapsed: 0 sec  <<< ERROR!
java.lang.IllegalArgumentException: List of differences cannot be null
	at org.apache.commons.lang3.builder.DiffResult.<init>(DiffResult.java:20)
	at org.apache.commons.lang3.builder.DiffBuilder.build(DiffBuilder.java:955)
	at org.apache.commons.lang3.builder.DiffBuilderTest$TypeTestClass.diff(DiffBuilderTest.java:63)
	at org.apache.commons.lang3.builder.DiffBuilderTest.testObjectArrayEqual(DiffBuilderTest.java:394)

testObjectsNotSameNorEqual(org.apache.commons.lang3.builder.DiffBuilderTest)  Time elapsed: 0.001 sec  <<< ERROR!
java.lang.IllegalArgumentException: List of differences cannot be null
	at org.apache.commons.lang3.builder.DiffResult.<init>(DiffResult.java:20)
	at org.apache.commons.lang3.builder.DiffBuilder.build(DiffBuilder.java:955)
	at org.apache.commons.lang3.builder.DiffBuilderTest$TypeTestClass.diff(DiffBuilderTest.java:63)
	at org.apache.commons.lang3.builder.DiffBuilderTest.testObjectsNotSameNorEqual(DiffBuilderTest.java:372)

testSameObjectIgnoresAppends(org.apache.commons.lang3.builder.DiffBuilderTest)  Time elapsed: 0 sec  <<< ERROR!
java.lang.IllegalArgumentException: List of differences cannot be null
	at org.apache.commons.lang3.builder.DiffResult.<init>(DiffResult.java:20)
	at org.apache.commons.lang3.builder.DiffBuilder.build(DiffBuilder.java:955)
	at org.apache.commons.lang3.builder.DiffBuilderTest.testSameObjectIgnoresAppends(DiffBuilderTest.java:431)

testIntArray(org.apache.commons.lang3.builder.DiffBuilderTest)  Time elapsed: 0.001 sec  <<< ERROR!
java.lang.IllegalArgumentException: List of differences cannot be null
	at org.apache.commons.lang3.builder.DiffResult.<init>(DiffResult.java:20)
	at org.apache.commons.lang3.builder.DiffBuilder.build(DiffBuilder.java:955)
	at org.apache.commons.lang3.builder.DiffBuilderTest$TypeTestClass.diff(DiffBuilderTest.java:63)
	at org.apache.commons.lang3.builder.DiffBuilderTest.testIntArray(DiffBuilderTest.java:252)

testDouble(org.apache.commons.lang3.builder.DiffBuilderTest)  Time elapsed: 0.001 sec  <<< ERROR!
java.lang.IllegalArgumentException: List of differences cannot be null
	at org.apache.commons.lang3.builder.DiffResult.<init>(DiffResult.java:20)
	at org.apache.commons.lang3.builder.DiffBuilder.build(DiffBuilder.java:955)
	at org.apache.commons.lang3.builder.DiffBuilderTest$TypeTestClass.diff(DiffBuilderTest.java:63)
	at org.apache.commons.lang3.builder.DiffBuilderTest.testDouble(DiffBuilderTest.java:184)

testTriviallyEqualTestEnabled(org.apache.commons.lang3.builder.DiffBuilderTest)  Time elapsed: 0.001 sec  <<< ERROR!
java.lang.IllegalArgumentException: List of differences cannot be null
	at org.apache.commons.lang3.builder.DiffResult.<init>(DiffResult.java:20)
	at org.apache.commons.lang3.builder.DiffBuilder.build(DiffBuilder.java:955)
	at org.apache.commons.lang3.builder.DiffBuilderTest.testTriviallyEqualTestEnabled(DiffBuilderTest.java:484)

testObject(org.apache.commons.lang3.builder.DiffBuilderTest)  Time elapsed: 0 sec  <<< ERROR!
java.lang.IllegalArgumentException: List of differences cannot be null
	at org.apache.commons.lang3.builder.DiffResult.<init>(DiffResult.java:20)
	at org.apache.commons.lang3.builder.DiffBuilder.build(DiffBuilder.java:955)
	at org.apache.commons.lang3.builder.DiffBuilderTest$TypeTestClass.diff(DiffBuilderTest.java:63)
	at org.apache.commons.lang3.builder.DiffBuilderTest.testObject(DiffBuilderTest.java:320)

testDoubleArray(org.apache.commons.lang3.builder.DiffBuilderTest)  Time elapsed: 0.001 sec  <<< ERROR!
java.lang.IllegalArgumentException: List of differences cannot be null
	at org.apache.commons.lang3.builder.DiffResult.<init>(DiffResult.java:20)
	at org.apache.commons.lang3.builder.DiffBuilder.build(DiffBuilder.java:955)
	at org.apache.commons.lang3.builder.DiffBuilderTest$TypeTestClass.diff(DiffBuilderTest.java:63)
	at org.apache.commons.lang3.builder.DiffBuilderTest.testDoubleArray(DiffBuilderTest.java:197)

Running org.apache.commons.lang3.builder.HashCodeBuilderTest
Tests run: 44, Failures: 0, Errors: 0, Skipped: 0, Time elapsed: 0.014 sec - in org.apache.commons.lang3.builder.HashCodeBuilderTest
Running org.apache.commons.lang3.concurrent.AtomicInitializerTest
Tests run: 3, Failures: 0, Errors: 0, Skipped: 0, Time elapsed: 0.014 sec - in org.apache.commons.lang3.concurrent.AtomicInitializerTest
Running org.apache.commons.lang3.concurrent.CallableBackgroundInitializerTest
Tests run: 4, Failures: 0, Errors: 0, Skipped: 0, Time elapsed: 0 sec - in org.apache.commons.lang3.concurrent.CallableBackgroundInitializerTest
Running org.apache.commons.lang3.concurrent.BackgroundInitializerTest
Tests run: 15, Failures: 0, Errors: 0, Skipped: 0, Time elapsed: 0.017 sec - in org.apache.commons.lang3.concurrent.BackgroundInitializerTest
Running org.apache.commons.lang3.concurrent.LazyInitializerTest
Tests run: 3, Failures: 0, Errors: 0, Skipped: 0, Time elapsed: 0.002 sec - in org.apache.commons.lang3.concurrent.LazyInitializerTest
Running org.apache.commons.lang3.concurrent.BasicThreadFactoryTest
Tests run: 15, Failures: 0, Errors: 0, Skipped: 0, Time elapsed: 0.032 sec - in org.apache.commons.lang3.concurrent.BasicThreadFactoryTest
Running org.apache.commons.lang3.concurrent.ConstantInitializerTest
Tests run: 7, Failures: 0, Errors: 0, Skipped: 0, Time elapsed: 0.001 sec - in org.apache.commons.lang3.concurrent.ConstantInitializerTest
Running org.apache.commons.lang3.concurrent.MultiBackgroundInitializerTest
Tests run: 17, Failures: 0, Errors: 0, Skipped: 0, Time elapsed: 0.042 sec - in org.apache.commons.lang3.concurrent.MultiBackgroundInitializerTest
Running org.apache.commons.lang3.concurrent.AtomicSafeInitializerTest
Tests run: 4, Failures: 0, Errors: 0, Skipped: 0, Time elapsed: 0.006 sec - in org.apache.commons.lang3.concurrent.AtomicSafeInitializerTest
Running org.apache.commons.lang3.concurrent.ConcurrentUtilsTest
Tests run: 40, Failures: 0, Errors: 0, Skipped: 0, Time elapsed: 0.013 sec - in org.apache.commons.lang3.concurrent.ConcurrentUtilsTest
Running org.apache.commons.lang3.concurrent.TimedSemaphoreTest
Tests run: 15, Failures: 0, Errors: 0, Skipped: 0, Time elapsed: 1.177 sec - in org.apache.commons.lang3.concurrent.TimedSemaphoreTest
Running org.apache.commons.lang3.StringUtilsSubstringTest
Tests run: 14, Failures: 0, Errors: 0, Skipped: 0, Time elapsed: 0.005 sec - in org.apache.commons.lang3.StringUtilsSubstringTest
Running org.apache.commons.lang3.SystemUtilsTest
Tests run: 12, Failures: 0, Errors: 0, Skipped: 0, Time elapsed: 0.003 sec - in org.apache.commons.lang3.SystemUtilsTest
Running org.apache.commons.lang3.CharRangeTest
Tests run: 16, Failures: 0, Errors: 0, Skipped: 0, Time elapsed: 0.031 sec - in org.apache.commons.lang3.CharRangeTest
Running org.apache.commons.lang3.CharSetTest
Tests run: 14, Failures: 0, Errors: 0, Skipped: 0, Time elapsed: 0.008 sec - in org.apache.commons.lang3.CharSetTest
Running org.apache.commons.lang3.StringUtilsStartsEndsWithTest
Tests run: 6, Failures: 0, Errors: 0, Skipped: 0, Time elapsed: 0.003 sec - in org.apache.commons.lang3.StringUtilsStartsEndsWithTest
Running org.apache.commons.lang3.RandomStringUtilsTest
Tests run: 11, Failures: 0, Errors: 0, Skipped: 0, Time elapsed: 0.032 sec - in org.apache.commons.lang3.RandomStringUtilsTest
Running org.apache.commons.lang3.SerializationUtilsTest
Tests run: 26, Failures: 0, Errors: 0, Skipped: 0, Time elapsed: 0.046 sec - in org.apache.commons.lang3.SerializationUtilsTest
Running org.apache.commons.lang3.time.StopWatchTest
Tests run: 8, Failures: 0, Errors: 0, Skipped: 0, Time elapsed: 4.766 sec - in org.apache.commons.lang3.time.StopWatchTest
Running org.apache.commons.lang3.time.DateUtilsRoundingTest
Tests run: 22, Failures: 0, Errors: 0, Skipped: 0, Time elapsed: 0.174 sec - in org.apache.commons.lang3.time.DateUtilsRoundingTest
Running org.apache.commons.lang3.time.FastDateParserTest
Tests run: 33, Failures: 0, Errors: 0, Skipped: 0, Time elapsed: 2.054 sec - in org.apache.commons.lang3.time.FastDateParserTest
Running org.apache.commons.lang3.time.FastDateFormat_ParserTest
Tests run: 33, Failures: 0, Errors: 0, Skipped: 0, Time elapsed: 0.647 sec - in org.apache.commons.lang3.time.FastDateFormat_ParserTest
Running org.apache.commons.lang3.time.DurationFormatUtilsTest
Tests run: 25, Failures: 0, Errors: 0, Skipped: 0, Time elapsed: 0.782 sec - in org.apache.commons.lang3.time.DurationFormatUtilsTest
Running org.apache.commons.lang3.time.DateFormatUtilsTest
Tests run: 10, Failures: 0, Errors: 0, Skipped: 0, Time elapsed: 0.001 sec - in org.apache.commons.lang3.time.DateFormatUtilsTest
Running org.apache.commons.lang3.time.DateUtilsFragmentTest
Tests run: 57, Failures: 0, Errors: 0, Skipped: 0, Time elapsed: 0.009 sec - in org.apache.commons.lang3.time.DateUtilsFragmentTest
Running org.apache.commons.lang3.time.FastDatePrinterTimeZonesTest
Tests run: 617, Failures: 0, Errors: 0, Skipped: 0, Time elapsed: 0.218 sec - in org.apache.commons.lang3.time.FastDatePrinterTimeZonesTest
Running org.apache.commons.lang3.time.FastDateFormatTest
>>FastDateFormatTest: FastDateParser:34330  SimpleDateFormat:3657
Tests run: 14, Failures: 0, Errors: 0, Skipped: 0, Time elapsed: 4.134 sec - in org.apache.commons.lang3.time.FastDateFormatTest
Running org.apache.commons.lang3.time.FastDateFormat_PrinterTest
Tests run: 17, Failures: 0, Errors: 0, Skipped: 0, Time elapsed: 0.007 sec - in org.apache.commons.lang3.time.FastDateFormat_PrinterTest
Running org.apache.commons.lang3.time.FastDatePrinterTest
Tests run: 17, Failures: 0, Errors: 0, Skipped: 0, Time elapsed: 0.005 sec - in org.apache.commons.lang3.time.FastDatePrinterTest
Running org.apache.commons.lang3.time.FastDateParserSDFTest
Tests run: 276, Failures: 0, Errors: 0, Skipped: 92, Time elapsed: 0.06 sec - in org.apache.commons.lang3.time.FastDateParserSDFTest
Running org.apache.commons.lang3.time.DateUtilsTest
DateUtilsTest: Default Locale=en_US
Tests run: 38, Failures: 0, Errors: 0, Skipped: 0, Time elapsed: 0.021 sec - in org.apache.commons.lang3.time.DateUtilsTest
Running org.apache.commons.lang3.reflect.InheritanceUtilsTest
Tests run: 9, Failures: 0, Errors: 0, Skipped: 0, Time elapsed: 0.001 sec - in org.apache.commons.lang3.reflect.InheritanceUtilsTest
Running org.apache.commons.lang3.reflect.MethodUtilsTest
Tests run: 23, Failures: 0, Errors: 0, Skipped: 0, Time elapsed: 0.028 sec - in org.apache.commons.lang3.reflect.MethodUtilsTest
Running org.apache.commons.lang3.reflect.ConstructorUtilsTest
Tests run: 7, Failures: 0, Errors: 0, Skipped: 0, Time elapsed: 0.003 sec - in org.apache.commons.lang3.reflect.ConstructorUtilsTest
Running org.apache.commons.lang3.reflect.FieldUtilsTest
Tests run: 64, Failures: 0, Errors: 0, Skipped: 0, Time elapsed: 0.027 sec - in org.apache.commons.lang3.reflect.FieldUtilsTest
Running org.apache.commons.lang3.reflect.TypeLiteralTest
Tests run: 4, Failures: 0, Errors: 0, Skipped: 0, Time elapsed: 0.005 sec - in org.apache.commons.lang3.reflect.TypeLiteralTest
Running org.apache.commons.lang3.reflect.TypeUtilsTest
Tests run: 19, Failures: 0, Errors: 0, Skipped: 0, Time elapsed: 0.033 sec - in org.apache.commons.lang3.reflect.TypeUtilsTest
Running org.apache.commons.lang3.mutable.MutableByteTest
Tests run: 17, Failures: 0, Errors: 0, Skipped: 0, Time elapsed: 0.001 sec - in org.apache.commons.lang3.mutable.MutableByteTest
Running org.apache.commons.lang3.mutable.MutableShortTest
Tests run: 14, Failures: 0, Errors: 0, Skipped: 0, Time elapsed: 0.001 sec - in org.apache.commons.lang3.mutable.MutableShortTest
Running org.apache.commons.lang3.mutable.MutableIntTest
Tests run: 17, Failures: 0, Errors: 0, Skipped: 0, Time elapsed: 0.001 sec - in org.apache.commons.lang3.mutable.MutableIntTest
Running org.apache.commons.lang3.mutable.MutableDoubleTest
Tests run: 18, Failures: 0, Errors: 0, Skipped: 0, Time elapsed: 0.003 sec - in org.apache.commons.lang3.mutable.MutableDoubleTest
Running org.apache.commons.lang3.mutable.MutableFloatTest
Tests run: 18, Failures: 0, Errors: 0, Skipped: 0, Time elapsed: 0.002 sec - in org.apache.commons.lang3.mutable.MutableFloatTest
Running org.apache.commons.lang3.mutable.MutableLongTest
Tests run: 17, Failures: 0, Errors: 0, Skipped: 0, Time elapsed: 0.002 sec - in org.apache.commons.lang3.mutable.MutableLongTest
Running org.apache.commons.lang3.mutable.MutableBooleanTest
Tests run: 9, Failures: 0, Errors: 0, Skipped: 0, Time elapsed: 0.002 sec - in org.apache.commons.lang3.mutable.MutableBooleanTest
Running org.apache.commons.lang3.mutable.MutableObjectTest
Tests run: 5, Failures: 0, Errors: 0, Skipped: 0, Time elapsed: 0 sec - in org.apache.commons.lang3.mutable.MutableObjectTest
Running org.apache.commons.lang3.text.translate.UnicodeEscaperTest
Tests run: 3, Failures: 0, Errors: 0, Skipped: 0, Time elapsed: 0.001 sec - in org.apache.commons.lang3.text.translate.UnicodeEscaperTest
Running org.apache.commons.lang3.text.translate.EntityArraysTest
Tests run: 3, Failures: 0, Errors: 0, Skipped: 0, Time elapsed: 0.001 sec - in org.apache.commons.lang3.text.translate.EntityArraysTest
Running org.apache.commons.lang3.text.translate.UnicodeUnpairedSurrogateRemoverTest
Tests run: 2, Failures: 0, Errors: 0, Skipped: 0, Time elapsed: 0 sec - in org.apache.commons.lang3.text.translate.UnicodeUnpairedSurrogateRemoverTest
Running org.apache.commons.lang3.text.translate.NumericEntityUnescaperTest
Tests run: 3, Failures: 0, Errors: 0, Skipped: 0, Time elapsed: 0.001 sec - in org.apache.commons.lang3.text.translate.NumericEntityUnescaperTest
Running org.apache.commons.lang3.text.translate.NumericEntityEscaperTest
Tests run: 4, Failures: 0, Errors: 0, Skipped: 0, Time elapsed: 0 sec - in org.apache.commons.lang3.text.translate.NumericEntityEscaperTest
Running org.apache.commons.lang3.text.translate.LookupTranslatorTest
Tests run: 2, Failures: 0, Errors: 0, Skipped: 0, Time elapsed: 0 sec - in org.apache.commons.lang3.text.translate.LookupTranslatorTest
Running org.apache.commons.lang3.text.translate.UnicodeUnescaperTest
Tests run: 3, Failures: 0, Errors: 0, Skipped: 0, Time elapsed: 0 sec - in org.apache.commons.lang3.text.translate.UnicodeUnescaperTest
Running org.apache.commons.lang3.text.translate.OctalUnescaperTest
Tests run: 1, Failures: 0, Errors: 0, Skipped: 0, Time elapsed: 0 sec - in org.apache.commons.lang3.text.translate.OctalUnescaperTest
Running org.apache.commons.lang3.text.StrMatcherTest
Tests run: 14, Failures: 0, Errors: 0, Skipped: 0, Time elapsed: 0.001 sec - in org.apache.commons.lang3.text.StrMatcherTest
Running org.apache.commons.lang3.text.StrTokenizerTest
Tests run: 55, Failures: 0, Errors: 0, Skipped: 0, Time elapsed: 0.016 sec - in org.apache.commons.lang3.text.StrTokenizerTest
Running org.apache.commons.lang3.text.FormattableUtilsTest
Tests run: 5, Failures: 0, Errors: 0, Skipped: 0, Time elapsed: 0 sec - in org.apache.commons.lang3.text.FormattableUtilsTest
Running org.apache.commons.lang3.text.CompositeFormatTest
Tests run: 2, Failures: 0, Errors: 0, Skipped: 0, Time elapsed: 0 sec - in org.apache.commons.lang3.text.CompositeFormatTest
Running org.apache.commons.lang3.text.WordUtilsTest
Tests run: 12, Failures: 0, Errors: 0, Skipped: 0, Time elapsed: 0.004 sec - in org.apache.commons.lang3.text.WordUtilsTest
Running org.apache.commons.lang3.text.StrLookupTest
Tests run: 5, Failures: 0, Errors: 0, Skipped: 0, Time elapsed: 0.002 sec - in org.apache.commons.lang3.text.StrLookupTest
Running org.apache.commons.lang3.text.StrBuilderAppendInsertTest
Tests run: 51, Failures: 0, Errors: 0, Skipped: 0, Time elapsed: 0.012 sec - in org.apache.commons.lang3.text.StrBuilderAppendInsertTest
Running org.apache.commons.lang3.text.ExtendedMessageFormatTest
Tests run: 10, Failures: 0, Errors: 0, Skipped: 0, Time elapsed: 0.785 sec - in org.apache.commons.lang3.text.ExtendedMessageFormatTest
Running org.apache.commons.lang3.text.StrSubstitutorTest
Tests run: 40, Failures: 0, Errors: 0, Skipped: 0, Time elapsed: 0.029 sec - in org.apache.commons.lang3.text.StrSubstitutorTest
Running org.apache.commons.lang3.text.StrBuilderTest
Tests run: 90, Failures: 0, Errors: 0, Skipped: 0, Time elapsed: 0.042 sec - in org.apache.commons.lang3.text.StrBuilderTest
Running org.apache.commons.lang3.StringEscapeUtilsTest
Tests run: 28, Failures: 0, Errors: 0, Skipped: 0, Time elapsed: 0.363 sec - in org.apache.commons.lang3.StringEscapeUtilsTest
Running org.apache.commons.lang3.AnnotationUtilsTest
Tests run: 10, Failures: 0, Errors: 0, Skipped: 0, Time elapsed: 0.021 sec - in org.apache.commons.lang3.AnnotationUtilsTest
Running org.apache.commons.lang3.ConversionTest
Tests run: 42, Failures: 0, Errors: 0, Skipped: 0, Time elapsed: 0.014 sec - in org.apache.commons.lang3.ConversionTest
Running org.apache.commons.lang3.StringUtilsTrimEmptyTest
Tests run: 15, Failures: 0, Errors: 0, Skipped: 0, Time elapsed: 0.006 sec - in org.apache.commons.lang3.StringUtilsTrimEmptyTest
Running org.apache.commons.lang3.EnumUtilsTest
Tests run: 34, Failures: 0, Errors: 0, Skipped: 0, Time elapsed: 0.008 sec - in org.apache.commons.lang3.EnumUtilsTest
Running org.apache.commons.lang3.exception.ExceptionUtilsTest
Tests run: 28, Failures: 0, Errors: 0, Skipped: 0, Time elapsed: 0.022 sec - in org.apache.commons.lang3.exception.ExceptionUtilsTest
Running org.apache.commons.lang3.exception.DefaultExceptionContextTest
Tests run: 8, Failures: 0, Errors: 0, Skipped: 0, Time elapsed: 0.004 sec - in org.apache.commons.lang3.exception.DefaultExceptionContextTest
Running org.apache.commons.lang3.exception.ContextedExceptionTest
Tests run: 14, Failures: 0, Errors: 0, Skipped: 0, Time elapsed: 0.008 sec - in org.apache.commons.lang3.exception.ContextedExceptionTest
Running org.apache.commons.lang3.exception.ContextedRuntimeExceptionTest
Tests run: 14, Failures: 0, Errors: 0, Skipped: 0, Time elapsed: 0.009 sec - in org.apache.commons.lang3.exception.ContextedRuntimeExceptionTest
Running org.apache.commons.lang3.BitFieldTest
Tests run: 15, Failures: 0, Errors: 0, Skipped: 0, Time elapsed: 0.002 sec - in org.apache.commons.lang3.BitFieldTest
Running org.apache.commons.lang3.ArrayUtilsRemoveMultipleTest
Tests run: 55, Failures: 0, Errors: 0, Skipped: 0, Time elapsed: 0.011 sec - in org.apache.commons.lang3.ArrayUtilsRemoveMultipleTest
Running org.apache.commons.lang3.HashSetvBitSetTest
Ratio=9% array=100 count=1 extract=20111726 bitset=1926745
Ratio=33% array=100 count=10 extract=5669910 bitset=1871520
Ratio=7% array=100 count=50 extract=11366456 bitset=898657
Ratio=5% array=100 count=100 extract=11673269 bitset=585391
Ratio=85% array=1000 count=10 extract=5596758 bitset=4762663
Ratio=32% array=1000 count=100 extract=14532641 bitset=4786971
Ratio=5% array=1000 count=500 extract=54017217 bitset=2999449
Ratio=1% array=1000 count=1000 extract=69027204 bitset=717422
Ratio=1367% count=0 hash=171509 bits=2344585
Ratio=36% count=5 hash=566781 bits=204957
Ratio=31% count=10 hash=863840 bits=272139
Ratio=22% count=200 hash=18411622 bits=4104717
Ratio=17% count=50 hash=8217944 bits=1401117
Ratio=26% count=100 hash=8580207 bits=2284457
Ratio=22% count=1000 hash=72623463 bits=16007724
Ratio=22% count=2000 hash=143329301 bits=31706626
Tests run: 2, Failures: 0, Errors: 0, Skipped: 0, Time elapsed: 0.614 sec - in org.apache.commons.lang3.HashSetvBitSetTest
Running org.apache.commons.lang3.StringUtilsTest
Tests run: 124, Failures: 0, Errors: 0, Skipped: 0, Time elapsed: 0.158 sec - in org.apache.commons.lang3.StringUtilsTest
Running org.apache.commons.lang3.ArrayUtilsRemoveTest
Tests run: 19, Failures: 0, Errors: 0, Skipped: 0, Time elapsed: 0.001 sec - in org.apache.commons.lang3.ArrayUtilsRemoveTest
Running org.apache.commons.lang3.ObjectUtilsTest
Tests run: 36, Failures: 0, Errors: 0, Skipped: 0, Time elapsed: 0.015 sec - in org.apache.commons.lang3.ObjectUtilsTest
Running org.apache.commons.lang3.ClassPathUtilsTest
Tests run: 13, Failures: 0, Errors: 0, Skipped: 0, Time elapsed: 0.003 sec - in org.apache.commons.lang3.ClassPathUtilsTest
Running org.apache.commons.lang3.math.NumberUtilsTest
Tests run: 91, Failures: 0, Errors: 0, Skipped: 0, Time elapsed: 0.034 sec - in org.apache.commons.lang3.math.NumberUtilsTest
Running org.apache.commons.lang3.math.IEEE754rUtilsTest
Tests run: 3, Failures: 0, Errors: 0, Skipped: 0, Time elapsed: 0.01 sec - in org.apache.commons.lang3.math.IEEE754rUtilsTest
Running org.apache.commons.lang3.math.FractionTest
Tests run: 25, Failures: 0, Errors: 0, Skipped: 0, Time elapsed: 0.286 sec - in org.apache.commons.lang3.math.FractionTest
Running org.apache.commons.lang3.BooleanUtilsTest
Tests run: 72, Failures: 0, Errors: 0, Skipped: 0, Time elapsed: 0.008 sec - in org.apache.commons.lang3.BooleanUtilsTest
Running org.apache.commons.lang3.CharSequenceUtilsTest
Tests run: 2, Failures: 0, Errors: 0, Skipped: 0, Time elapsed: 0 sec - in org.apache.commons.lang3.CharSequenceUtilsTest
Running org.apache.commons.lang3.CharSetUtilsTest
Tests run: 11, Failures: 0, Errors: 0, Skipped: 0, Time elapsed: 0 sec - in org.apache.commons.lang3.CharSetUtilsTest
Running org.apache.commons.lang3.ArrayUtilsAddTest
Tests run: 13, Failures: 0, Errors: 0, Skipped: 0, Time elapsed: 0.001 sec - in org.apache.commons.lang3.ArrayUtilsAddTest
Running org.apache.commons.lang3.CharEncodingTest
Tests run: 6, Failures: 0, Errors: 0, Skipped: 0, Time elapsed: 0.016 sec - in org.apache.commons.lang3.CharEncodingTest
Running org.apache.commons.lang3.ClassUtilsTest
Tests run: 57, Failures: 0, Errors: 0, Skipped: 0, Time elapsed: 0.019 sec - in org.apache.commons.lang3.ClassUtilsTest
Running org.apache.commons.lang3.RangeTest
Tests run: 24, Failures: 0, Errors: 0, Skipped: 0, Time elapsed: 0.012 sec - in org.apache.commons.lang3.RangeTest
Running org.apache.commons.lang3.event.EventUtilsTest
Tests run: 8, Failures: 0, Errors: 0, Skipped: 0, Time elapsed: 0.017 sec - in org.apache.commons.lang3.event.EventUtilsTest
Running org.apache.commons.lang3.event.EventListenerSupportTest
Tests run: 9, Failures: 0, Errors: 0, Skipped: 0, Time elapsed: 0.019 sec - in org.apache.commons.lang3.event.EventListenerSupportTest
Running org.apache.commons.lang3.ArrayUtilsTest
Tests run: 205, Failures: 0, Errors: 0, Skipped: 0, Time elapsed: 0.035 sec - in org.apache.commons.lang3.ArrayUtilsTest
Running org.apache.commons.lang3.CharUtilsTest
Tests run: 24, Failures: 0, Errors: 0, Skipped: 0, Time elapsed: 0.001 sec - in org.apache.commons.lang3.CharUtilsTest
Running org.apache.commons.lang3.NotImplementedExceptionTest
Tests run: 1, Failures: 0, Errors: 0, Skipped: 0, Time elapsed: 0 sec - in org.apache.commons.lang3.NotImplementedExceptionTest
Running org.apache.commons.lang3.StringUtilsEqualsIndexOfTest
Tests run: 50, Failures: 0, Errors: 0, Skipped: 0, Time elapsed: 0.001 sec - in org.apache.commons.lang3.StringUtilsEqualsIndexOfTest
Running org.apache.commons.lang3.RandomUtilsTest
Tests run: 23, Failures: 0, Errors: 0, Skipped: 0, Time elapsed: 0.001 sec - in org.apache.commons.lang3.RandomUtilsTest

Results :

Failed tests: 
  DiffResultTest.testNullList Expected exception: java.lang.IllegalArgumentException

Tests in error: 
  DiffBuilderTest.testBoolean:102 » IllegalArgument List of differences cannot b...
  DiffBuilderTest.testBooleanArray:115 » IllegalArgument List of differences can...
  DiffBuilderTest.testByte:130 » IllegalArgument List of differences cannot be n...
  DiffBuilderTest.testByteArray:142 » IllegalArgument List of differences cannot...
  DiffBuilderTest.testByteArrayEqualAsObject:401 » IllegalArgument List of diffe...
  DiffBuilderTest.testChar:156 » IllegalArgument List of differences cannot be n...
  DiffBuilderTest.testCharArray:169 » IllegalArgument List of differences cannot...
  DiffBuilderTest.testDouble:184 » IllegalArgument List of differences cannot be...
  DiffBuilderTest.testDoubleArray:197 » IllegalArgument List of differences cann...
  DiffBuilderTest.testFloat:211 » IllegalArgument List of differences cannot be ...
  DiffBuilderTest.testFloatArray:224 » IllegalArgument List of differences canno...
  DiffBuilderTest.testInt:239 » IllegalArgument List of differences cannot be nu...
  DiffBuilderTest.testIntArray:252 » IllegalArgument List of differences cannot ...
  DiffBuilderTest.testLong:266 » IllegalArgument List of differences cannot be n...
  DiffBuilderTest.testLongArray:279 » IllegalArgument List of differences cannot...
  DiffBuilderTest.testObject:320 » IllegalArgument List of differences cannot be...
  DiffBuilderTest.testObjectArray:381 » IllegalArgument List of differences cann...
  DiffBuilderTest.testObjectArrayEqual:394 » IllegalArgument List of differences...
  DiffBuilderTest.testObjectsNotSameButEqual:356 » IllegalArgument List of diffe...
  DiffBuilderTest.testObjectsNotSameNorEqual:372 » IllegalArgument List of diffe...
  DiffBuilderTest.testObjectsSameAndEqual:340 » IllegalArgument List of differen...
  DiffBuilderTest.testSameObjectIgnoresAppends:431 » IllegalArgument List of dif...
  DiffBuilderTest.testShort:293 » IllegalArgument List of differences cannot be ...
  DiffBuilderTest.testShortArray:306 » IllegalArgument List of differences canno...
  DiffBuilderTest.testSimilarObjectIgnoresAppends:441 » IllegalArgument List of ...
  DiffBuilderTest.testStylePassedToDiffResult:451 » IllegalArgument List of diff...
  DiffBuilderTest.testTriviallyEqualTestDisabled:466 » IllegalArgument List of d...
  DiffBuilderTest.testTriviallyEqualTestEnabled:484 » IllegalArgument List of di...
  DiffResultTest.testIterator:78 » IllegalArgument List of differences cannot be...
  DiffResultTest.testListIsNonModifiable »  Unexpected exception, expected<java....
  DiffResultTest.testNoDifferencesString:145 » IllegalArgument List of differenc...
  DiffResultTest.testNullStyle:138 » IllegalArgument List of differences cannot ...
  DiffResultTest.testToStringOutput:92 » IllegalArgument List of differences can...
  DiffResultTest.testToStringSpecifyStyleOutput:102 » IllegalArgument List of di...


Tests run: 3526, Failures: 1, Errors: 34, Skipped: 97

[INFO] ------------------------------------------------------------------------
[INFO] BUILD FAILURE
[INFO] ------------------------------------------------------------------------
[INFO] Total time: 34.647s
[INFO] Finished at: Tue Aug 04 05:38:21 BST 2015
[INFO] Final Memory: 23M/413M
[INFO] ------------------------------------------------------------------------
[ERROR] Failed to execute goal org.apache.maven.plugins:maven-surefire-plugin:2.18:test (default-test) on project commons-lang3: There are test failures.
[ERROR] 
[ERROR] Please refer to /home/perham/Study/LittleDarwin/Cases/commons-lang3-3.4-src/target/surefire-reports for the individual test results.
[ERROR] -> [Help 1]
[ERROR] 
[ERROR] To see the full stack trace of the errors, re-run Maven with the -e switch.
[ERROR] Re-run Maven using the -X switch to enable full debug logging.
[ERROR] 
[ERROR] For more information about the errors and possible solutions, please read the following articles:
[ERROR] [Help 1] http://cwiki.apache.org/confluence/display/MAVEN/MojoFailureException
