[INFO] Scanning for projects...
[INFO]                                                                         
[INFO] ------------------------------------------------------------------------
[INFO] Building Apache Commons Lang 3.4
[INFO] ------------------------------------------------------------------------
[INFO] 
[INFO] --- maven-enforcer-plugin:1.3.1:enforce (enforce-maven-3) @ commons-lang3 ---
[INFO] 
[INFO] --- build-helper-maven-plugin:1.8:parse-version (parse-version) @ commons-lang3 ---
[INFO] 
[INFO] --- maven-antrun-plugin:1.8:run (javadoc.resources) @ commons-lang3 ---
[INFO] Executing tasks

main:
[INFO] Executed tasks
[INFO] 
[INFO] --- maven-remote-resources-plugin:1.5:process (default) @ commons-lang3 ---
[INFO] 
[INFO] --- buildnumber-maven-plugin:1.3:create (default) @ commons-lang3 ---
[INFO] Executing: /bin/sh -c cd /home/perham/Study/LittleDarwin/Cases/commons-lang3-3.4-src && svn --non-interactive info
[INFO] Working directory: /home/perham/Study/LittleDarwin/Cases/commons-lang3-3.4-src
[INFO] Storing buildNumber: ?????? at timestamp: 1438654187011
[INFO] Executing: /bin/sh -c cd /home/perham/Study/LittleDarwin/Cases/commons-lang3-3.4-src && svn --non-interactive info
[INFO] Working directory: /home/perham/Study/LittleDarwin/Cases/commons-lang3-3.4-src
[INFO] Storing buildScmBranch: UNKNOWN_BRANCH
[INFO] 
[INFO] --- maven-resources-plugin:2.7:resources (default-resources) @ commons-lang3 ---
[INFO] Using 'ISO-8859-1' encoding to copy filtered resources.
[INFO] Copying 0 resource
[INFO] Copying 2 resources to META-INF
[INFO] 
[INFO] --- maven-compiler-plugin:3.2:compile (default-compile) @ commons-lang3 ---
[INFO] Changes detected - recompiling the module!
[INFO] Compiling 133 source files to /home/perham/Study/LittleDarwin/Cases/commons-lang3-3.4-src/target/classes
[INFO] /home/perham/Study/LittleDarwin/Cases/commons-lang3-3.4-src/src/main/java/org/apache/commons/lang3/SerializationUtils.java: /home/perham/Study/LittleDarwin/Cases/commons-lang3-3.4-src/src/main/java/org/apache/commons/lang3/SerializationUtils.java uses unchecked or unsafe operations.
[INFO] /home/perham/Study/LittleDarwin/Cases/commons-lang3-3.4-src/src/main/java/org/apache/commons/lang3/SerializationUtils.java: Recompile with -Xlint:unchecked for details.
[INFO] 
[INFO] --- maven-bundle-plugin:2.5.3:manifest (bundle-manifest) @ commons-lang3 ---
[INFO] 
[INFO] --- animal-sniffer-maven-plugin:1.13:check (checkAPIcompatibility) @ commons-lang3 ---
[INFO] Checking unresolved references to org.codehaus.mojo.signature:java16:1.0
[INFO] 
[INFO] --- maven-resources-plugin:2.7:testResources (default-testResources) @ commons-lang3 ---
[INFO] Using 'ISO-8859-1' encoding to copy filtered resources.
[INFO] Copying 2 resources
[INFO] Copying 2 resources to META-INF
[INFO] 
[INFO] --- maven-compiler-plugin:3.2:testCompile (default-testCompile) @ commons-lang3 ---
[INFO] Nothing to compile - all classes are up to date
[INFO] 
[INFO] --- maven-surefire-plugin:2.18:test (default-test) @ commons-lang3 ---
[INFO] Surefire report directory: /home/perham/Study/LittleDarwin/Cases/commons-lang3-3.4-src/target/surefire-reports

-------------------------------------------------------
 T E S T S
-------------------------------------------------------
Running org.apache.commons.lang3.ValidateTest
Tests run: 63, Failures: 0, Errors: 1, Skipped: 0, Time elapsed: 0.039 sec <<< FAILURE! - in org.apache.commons.lang3.ValidateTest
testIsTrue2(org.apache.commons.lang3.ValidateTest)  Time elapsed: 0.01 sec  <<< ERROR!
java.lang.IllegalArgumentException: MSG
	at org.apache.commons.lang3.Validate.isTrue(Validate.java:34)
	at org.apache.commons.lang3.ValidateTest.testIsTrue2(ValidateTest.java:62)

Running org.apache.commons.lang3.LocaleUtilsTest
Tests run: 15, Failures: 0, Errors: 0, Skipped: 0, Time elapsed: 0.019 sec - in org.apache.commons.lang3.LocaleUtilsTest
Running org.apache.commons.lang3.tuple.MutableTripleTest
Tests run: 8, Failures: 0, Errors: 0, Skipped: 0, Time elapsed: 0.004 sec - in org.apache.commons.lang3.tuple.MutableTripleTest
Running org.apache.commons.lang3.tuple.TripleTest
Tests run: 10, Failures: 0, Errors: 0, Skipped: 0, Time elapsed: 0.001 sec - in org.apache.commons.lang3.tuple.TripleTest
Running org.apache.commons.lang3.tuple.ImmutablePairTest
Tests run: 6, Failures: 0, Errors: 0, Skipped: 0, Time elapsed: 0.001 sec - in org.apache.commons.lang3.tuple.ImmutablePairTest
Running org.apache.commons.lang3.tuple.MutablePairTest
Tests run: 8, Failures: 0, Errors: 0, Skipped: 0, Time elapsed: 0.001 sec - in org.apache.commons.lang3.tuple.MutablePairTest
Running org.apache.commons.lang3.tuple.ImmutableTripleTest
Tests run: 6, Failures: 0, Errors: 0, Skipped: 0, Time elapsed: 0 sec - in org.apache.commons.lang3.tuple.ImmutableTripleTest
Running org.apache.commons.lang3.tuple.PairTest
Tests run: 9, Failures: 0, Errors: 0, Skipped: 0, Time elapsed: 0.001 sec - in org.apache.commons.lang3.tuple.PairTest
Running org.apache.commons.lang3.StringUtilsIsTest
Tests run: 8, Failures: 0, Errors: 0, Skipped: 0, Time elapsed: 0.001 sec - in org.apache.commons.lang3.StringUtilsIsTest
Running org.apache.commons.lang3.JavaVersionTest
Tests run: 3, Failures: 0, Errors: 0, Skipped: 0, Time elapsed: 0.001 sec - in org.apache.commons.lang3.JavaVersionTest
Running org.apache.commons.lang3.builder.NoFieldNamesToStringStyleTest
Tests run: 8, Failures: 0, Errors: 0, Skipped: 0, Time elapsed: 0 sec - in org.apache.commons.lang3.builder.NoFieldNamesToStringStyleTest
Running org.apache.commons.lang3.builder.ShortPrefixToStringStyleTest
Tests run: 8, Failures: 0, Errors: 0, Skipped: 0, Time elapsed: 0.001 sec - in org.apache.commons.lang3.builder.ShortPrefixToStringStyleTest
Running org.apache.commons.lang3.builder.DiffResultTest
Tests run: 9, Failures: 0, Errors: 0, Skipped: 0, Time elapsed: 0.009 sec - in org.apache.commons.lang3.builder.DiffResultTest
Running org.apache.commons.lang3.builder.CompareToBuilderTest
Tests run: 48, Failures: 0, Errors: 0, Skipped: 0, Time elapsed: 0.021 sec - in org.apache.commons.lang3.builder.CompareToBuilderTest
Running org.apache.commons.lang3.builder.MultilineRecursiveToStringStyleTest
Tests run: 10, Failures: 0, Errors: 0, Skipped: 0, Time elapsed: 0.005 sec - in org.apache.commons.lang3.builder.MultilineRecursiveToStringStyleTest
Running org.apache.commons.lang3.builder.RecursiveToStringStyleTest
Tests run: 8, Failures: 0, Errors: 0, Skipped: 0, Time elapsed: 0.004 sec - in org.apache.commons.lang3.builder.RecursiveToStringStyleTest
Running org.apache.commons.lang3.builder.DefaultToStringStyleTest
Tests run: 8, Failures: 0, Errors: 0, Skipped: 0, Time elapsed: 0.001 sec - in org.apache.commons.lang3.builder.DefaultToStringStyleTest
Running org.apache.commons.lang3.builder.ReflectionToStringBuilderExcludeTest
Tests run: 11, Failures: 0, Errors: 0, Skipped: 0, Time elapsed: 0.004 sec - in org.apache.commons.lang3.builder.ReflectionToStringBuilderExcludeTest
Running org.apache.commons.lang3.builder.StandardToStringStyleTest
Tests run: 8, Failures: 0, Errors: 0, Skipped: 0, Time elapsed: 0.002 sec - in org.apache.commons.lang3.builder.StandardToStringStyleTest
Running org.apache.commons.lang3.builder.ToStringStyleTest
Tests run: 12, Failures: 0, Errors: 0, Skipped: 0, Time elapsed: 0.001 sec - in org.apache.commons.lang3.builder.ToStringStyleTest
Running org.apache.commons.lang3.builder.DiffTest
Tests run: 4, Failures: 0, Errors: 0, Skipped: 0, Time elapsed: 0 sec - in org.apache.commons.lang3.builder.DiffTest
Running org.apache.commons.lang3.builder.SimpleToStringStyleTest
Tests run: 8, Failures: 0, Errors: 0, Skipped: 0, Time elapsed: 0.002 sec - in org.apache.commons.lang3.builder.SimpleToStringStyleTest
Running org.apache.commons.lang3.builder.MultiLineToStringStyleTest
Tests run: 8, Failures: 0, Errors: 0, Skipped: 0, Time elapsed: 0.003 sec - in org.apache.commons.lang3.builder.MultiLineToStringStyleTest
Running org.apache.commons.lang3.builder.ToStringStyleConcurrencyTest
Tests run: 3, Failures: 0, Errors: 0, Skipped: 0, Time elapsed: 3.842 sec - in org.apache.commons.lang3.builder.ToStringStyleConcurrencyTest
Running org.apache.commons.lang3.builder.ReflectionToStringBuilderMutateInspectConcurrencyTest
Tests run: 1, Failures: 0, Errors: 0, Skipped: 1, Time elapsed: 0 sec - in org.apache.commons.lang3.builder.ReflectionToStringBuilderMutateInspectConcurrencyTest
Running org.apache.commons.lang3.builder.ToStringBuilderTest
Tests run: 74, Failures: 0, Errors: 0, Skipped: 1, Time elapsed: 0.046 sec - in org.apache.commons.lang3.builder.ToStringBuilderTest
Running org.apache.commons.lang3.builder.EqualsBuilderTest
Tests run: 48, Failures: 0, Errors: 0, Skipped: 0, Time elapsed: 0.03 sec - in org.apache.commons.lang3.builder.EqualsBuilderTest
Running org.apache.commons.lang3.builder.HashCodeBuilderAndEqualsBuilderTest
Tests run: 4, Failures: 0, Errors: 4, Skipped: 0, Time elapsed: 0 sec <<< FAILURE! - in org.apache.commons.lang3.builder.HashCodeBuilderAndEqualsBuilderTest
testIntegerWithTransients(org.apache.commons.lang3.builder.HashCodeBuilderAndEqualsBuilderTest)  Time elapsed: 0 sec  <<< ERROR!
java.lang.IllegalArgumentException: HashCodeBuilder requires an odd initial value
	at org.apache.commons.lang3.Validate.isTrue(Validate.java:34)
	at org.apache.commons.lang3.builder.HashCodeBuilder.<init>(HashCodeBuilder.java:558)
	at org.apache.commons.lang3.builder.HashCodeBuilder.reflectionHashCode(HashCodeBuilder.java:352)
	at org.apache.commons.lang3.builder.HashCodeBuilder.reflectionHashCode(HashCodeBuilder.java:396)
	at org.apache.commons.lang3.builder.HashCodeBuilderAndEqualsBuilderTest.assertEqualsAndHashCodeContract(HashCodeBuilderAndEqualsBuilderTest.java:87)
	at org.apache.commons.lang3.builder.HashCodeBuilderAndEqualsBuilderTest.testInteger(HashCodeBuilderAndEqualsBuilderTest.java:37)
	at org.apache.commons.lang3.builder.HashCodeBuilderAndEqualsBuilderTest.testIntegerWithTransients(HashCodeBuilderAndEqualsBuilderTest.java:47)

testFixture(org.apache.commons.lang3.builder.HashCodeBuilderAndEqualsBuilderTest)  Time elapsed: 0 sec  <<< ERROR!
java.lang.IllegalArgumentException: HashCodeBuilder requires an odd initial value
	at org.apache.commons.lang3.Validate.isTrue(Validate.java:34)
	at org.apache.commons.lang3.builder.HashCodeBuilder.<init>(HashCodeBuilder.java:558)
	at org.apache.commons.lang3.builder.HashCodeBuilder.reflectionHashCode(HashCodeBuilder.java:352)
	at org.apache.commons.lang3.builder.HashCodeBuilder.reflectionHashCode(HashCodeBuilder.java:396)
	at org.apache.commons.lang3.builder.HashCodeBuilderAndEqualsBuilderTest.assertEqualsAndHashCodeContract(HashCodeBuilderAndEqualsBuilderTest.java:87)
	at org.apache.commons.lang3.builder.HashCodeBuilderAndEqualsBuilderTest.testFixture(HashCodeBuilderAndEqualsBuilderTest.java:61)
	at org.apache.commons.lang3.builder.HashCodeBuilderAndEqualsBuilderTest.testFixture(HashCodeBuilderAndEqualsBuilderTest.java:52)

testFixtureWithTransients(org.apache.commons.lang3.builder.HashCodeBuilderAndEqualsBuilderTest)  Time elapsed: 0 sec  <<< ERROR!
java.lang.IllegalArgumentException: HashCodeBuilder requires an odd initial value
	at org.apache.commons.lang3.Validate.isTrue(Validate.java:34)
	at org.apache.commons.lang3.builder.HashCodeBuilder.<init>(HashCodeBuilder.java:558)
	at org.apache.commons.lang3.builder.HashCodeBuilder.reflectionHashCode(HashCodeBuilder.java:352)
	at org.apache.commons.lang3.builder.HashCodeBuilder.reflectionHashCode(HashCodeBuilder.java:396)
	at org.apache.commons.lang3.builder.HashCodeBuilderAndEqualsBuilderTest.assertEqualsAndHashCodeContract(HashCodeBuilderAndEqualsBuilderTest.java:87)
	at org.apache.commons.lang3.builder.HashCodeBuilderAndEqualsBuilderTest.testFixture(HashCodeBuilderAndEqualsBuilderTest.java:61)
	at org.apache.commons.lang3.builder.HashCodeBuilderAndEqualsBuilderTest.testFixtureWithTransients(HashCodeBuilderAndEqualsBuilderTest.java:57)

testInteger(org.apache.commons.lang3.builder.HashCodeBuilderAndEqualsBuilderTest)  Time elapsed: 0 sec  <<< ERROR!
java.lang.IllegalArgumentException: HashCodeBuilder requires an odd initial value
	at org.apache.commons.lang3.Validate.isTrue(Validate.java:34)
	at org.apache.commons.lang3.builder.HashCodeBuilder.<init>(HashCodeBuilder.java:558)
	at org.apache.commons.lang3.builder.HashCodeBuilder.reflectionHashCode(HashCodeBuilder.java:352)
	at org.apache.commons.lang3.builder.HashCodeBuilder.reflectionHashCode(HashCodeBuilder.java:396)
	at org.apache.commons.lang3.builder.HashCodeBuilderAndEqualsBuilderTest.assertEqualsAndHashCodeContract(HashCodeBuilderAndEqualsBuilderTest.java:87)
	at org.apache.commons.lang3.builder.HashCodeBuilderAndEqualsBuilderTest.testInteger(HashCodeBuilderAndEqualsBuilderTest.java:37)
	at org.apache.commons.lang3.builder.HashCodeBuilderAndEqualsBuilderTest.testInteger(HashCodeBuilderAndEqualsBuilderTest.java:42)

Running org.apache.commons.lang3.builder.ReflectionToStringBuilderConcurrencyTest
Tests run: 3, Failures: 0, Errors: 0, Skipped: 3, Time elapsed: 0.001 sec - in org.apache.commons.lang3.builder.ReflectionToStringBuilderConcurrencyTest
Running org.apache.commons.lang3.builder.JsonToStringStyleTest
Tests run: 9, Failures: 0, Errors: 0, Skipped: 0, Time elapsed: 0.001 sec - in org.apache.commons.lang3.builder.JsonToStringStyleTest
Running org.apache.commons.lang3.builder.NoClassNameToStringStyleTest
Tests run: 8, Failures: 0, Errors: 0, Skipped: 0, Time elapsed: 0.001 sec - in org.apache.commons.lang3.builder.NoClassNameToStringStyleTest
Running org.apache.commons.lang3.builder.DiffBuilderTest
Tests run: 30, Failures: 0, Errors: 0, Skipped: 0, Time elapsed: 0.023 sec - in org.apache.commons.lang3.builder.DiffBuilderTest
Running org.apache.commons.lang3.builder.HashCodeBuilderTest
Tests run: 44, Failures: 6, Errors: 35, Skipped: 0, Time elapsed: 0.026 sec <<< FAILURE! - in org.apache.commons.lang3.builder.HashCodeBuilderTest
testCharArray(org.apache.commons.lang3.builder.HashCodeBuilderTest)  Time elapsed: 0 sec  <<< ERROR!
java.lang.IllegalArgumentException: HashCodeBuilder requires an odd initial value
	at org.apache.commons.lang3.Validate.isTrue(Validate.java:34)
	at org.apache.commons.lang3.builder.HashCodeBuilder.<init>(HashCodeBuilder.java:558)
	at org.apache.commons.lang3.builder.HashCodeBuilderTest.testCharArray(HashCodeBuilderTest.java:358)

testObjectArray(org.apache.commons.lang3.builder.HashCodeBuilderTest)  Time elapsed: 0 sec  <<< ERROR!
java.lang.IllegalArgumentException: HashCodeBuilder requires an odd initial value
	at org.apache.commons.lang3.Validate.isTrue(Validate.java:34)
	at org.apache.commons.lang3.builder.HashCodeBuilder.<init>(HashCodeBuilder.java:558)
	at org.apache.commons.lang3.builder.HashCodeBuilderTest.testObjectArray(HashCodeBuilderTest.java:268)

testObjectBuild(org.apache.commons.lang3.builder.HashCodeBuilderTest)  Time elapsed: 0 sec  <<< ERROR!
java.lang.IllegalArgumentException: HashCodeBuilder requires an odd initial value
	at org.apache.commons.lang3.Validate.isTrue(Validate.java:34)
	at org.apache.commons.lang3.builder.HashCodeBuilder.<init>(HashCodeBuilder.java:558)
	at org.apache.commons.lang3.builder.HashCodeBuilderTest.testObjectBuild(HashCodeBuilderTest.java:204)

testCharArrayAsObject(org.apache.commons.lang3.builder.HashCodeBuilderTest)  Time elapsed: 0 sec  <<< ERROR!
java.lang.IllegalArgumentException: HashCodeBuilder requires an odd initial value
	at org.apache.commons.lang3.Validate.isTrue(Validate.java:34)
	at org.apache.commons.lang3.builder.HashCodeBuilder.<init>(HashCodeBuilder.java:558)
	at org.apache.commons.lang3.builder.HashCodeBuilderTest.testCharArrayAsObject(HashCodeBuilderTest.java:370)

testFloatArray(org.apache.commons.lang3.builder.HashCodeBuilderTest)  Time elapsed: 0.001 sec  <<< ERROR!
java.lang.IllegalArgumentException: HashCodeBuilder requires an odd initial value
	at org.apache.commons.lang3.Validate.isTrue(Validate.java:34)
	at org.apache.commons.lang3.builder.HashCodeBuilder.<init>(HashCodeBuilder.java:558)
	at org.apache.commons.lang3.builder.HashCodeBuilderTest.testFloatArray(HashCodeBuilderTest.java:429)

testInt(org.apache.commons.lang3.builder.HashCodeBuilderTest)  Time elapsed: 0 sec  <<< ERROR!
java.lang.IllegalArgumentException: HashCodeBuilder requires an odd initial value
	at org.apache.commons.lang3.Validate.isTrue(Validate.java:34)
	at org.apache.commons.lang3.builder.HashCodeBuilder.<init>(HashCodeBuilder.java:558)
	at org.apache.commons.lang3.builder.HashCodeBuilderTest.testInt(HashCodeBuilderTest.java:220)

testByteArray(org.apache.commons.lang3.builder.HashCodeBuilderTest)  Time elapsed: 0.001 sec  <<< ERROR!
java.lang.IllegalArgumentException: HashCodeBuilder requires an odd initial value
	at org.apache.commons.lang3.Validate.isTrue(Validate.java:34)
	at org.apache.commons.lang3.builder.HashCodeBuilder.<init>(HashCodeBuilder.java:558)
	at org.apache.commons.lang3.builder.HashCodeBuilderTest.testByteArray(HashCodeBuilderTest.java:379)

testFloat(org.apache.commons.lang3.builder.HashCodeBuilderTest)  Time elapsed: 0 sec  <<< ERROR!
java.lang.IllegalArgumentException: HashCodeBuilder requires an odd initial value
	at org.apache.commons.lang3.Validate.isTrue(Validate.java:34)
	at org.apache.commons.lang3.builder.HashCodeBuilder.<init>(HashCodeBuilder.java:558)
	at org.apache.commons.lang3.builder.HashCodeBuilderTest.testFloat(HashCodeBuilderTest.java:254)

testShort(org.apache.commons.lang3.builder.HashCodeBuilderTest)  Time elapsed: 0 sec  <<< ERROR!
java.lang.IllegalArgumentException: HashCodeBuilder requires an odd initial value
	at org.apache.commons.lang3.Validate.isTrue(Validate.java:34)
	at org.apache.commons.lang3.builder.HashCodeBuilder.<init>(HashCodeBuilder.java:558)
	at org.apache.commons.lang3.builder.HashCodeBuilderTest.testShort(HashCodeBuilderTest.java:226)

testSuper(org.apache.commons.lang3.builder.HashCodeBuilderTest)  Time elapsed: 0 sec  <<< ERROR!
java.lang.IllegalArgumentException: HashCodeBuilder requires an odd initial value
	at org.apache.commons.lang3.Validate.isTrue(Validate.java:34)
	at org.apache.commons.lang3.builder.HashCodeBuilder.<init>(HashCodeBuilder.java:558)
	at org.apache.commons.lang3.builder.HashCodeBuilderTest.testSuper(HashCodeBuilderTest.java:189)

testByte(org.apache.commons.lang3.builder.HashCodeBuilderTest)  Time elapsed: 0 sec  <<< ERROR!
java.lang.IllegalArgumentException: HashCodeBuilder requires an odd initial value
	at org.apache.commons.lang3.Validate.isTrue(Validate.java:34)
	at org.apache.commons.lang3.builder.HashCodeBuilder.<init>(HashCodeBuilder.java:558)
	at org.apache.commons.lang3.builder.HashCodeBuilderTest.testByte(HashCodeBuilderTest.java:238)

testChar(org.apache.commons.lang3.builder.HashCodeBuilderTest)  Time elapsed: 0.001 sec  <<< ERROR!
java.lang.IllegalArgumentException: HashCodeBuilder requires an odd initial value
	at org.apache.commons.lang3.Validate.isTrue(Validate.java:34)
	at org.apache.commons.lang3.builder.HashCodeBuilder.<init>(HashCodeBuilder.java:558)
	at org.apache.commons.lang3.builder.HashCodeBuilderTest.testChar(HashCodeBuilderTest.java:232)

testLong(org.apache.commons.lang3.builder.HashCodeBuilderTest)  Time elapsed: 0 sec  <<< ERROR!
java.lang.IllegalArgumentException: HashCodeBuilder requires an odd initial value
	at org.apache.commons.lang3.Validate.isTrue(Validate.java:34)
	at org.apache.commons.lang3.builder.HashCodeBuilder.<init>(HashCodeBuilder.java:558)
	at org.apache.commons.lang3.builder.HashCodeBuilderTest.testLong(HashCodeBuilderTest.java:212)

testFloatArrayAsObject(org.apache.commons.lang3.builder.HashCodeBuilderTest)  Time elapsed: 0 sec  <<< ERROR!
java.lang.IllegalArgumentException: HashCodeBuilder requires an odd initial value
	at org.apache.commons.lang3.Validate.isTrue(Validate.java:34)
	at org.apache.commons.lang3.builder.HashCodeBuilder.<init>(HashCodeBuilder.java:558)
	at org.apache.commons.lang3.builder.HashCodeBuilderTest.testFloatArrayAsObject(HashCodeBuilderTest.java:443)

testConstructorExZero(org.apache.commons.lang3.builder.HashCodeBuilderTest)  Time elapsed: 0 sec  <<< FAILURE!
java.lang.AssertionError: Expected exception: java.lang.IllegalArgumentException
	at org.junit.internal.runners.statements.ExpectException.evaluate(ExpectException.java:32)
	at org.junit.runners.ParentRunner.runLeaf(ParentRunner.java:325)
	at org.junit.runners.BlockJUnit4ClassRunner.runChild(BlockJUnit4ClassRunner.java:78)
	at org.junit.runners.BlockJUnit4ClassRunner.runChild(BlockJUnit4ClassRunner.java:57)
	at org.junit.runners.ParentRunner$3.run(ParentRunner.java:290)
	at org.junit.runners.ParentRunner$1.schedule(ParentRunner.java:71)
	at org.junit.runners.ParentRunner.runChildren(ParentRunner.java:288)
	at org.junit.runners.ParentRunner.access$000(ParentRunner.java:58)
	at org.junit.runners.ParentRunner$2.evaluate(ParentRunner.java:268)
	at org.junit.runners.ParentRunner.run(ParentRunner.java:363)
	at org.apache.maven.surefire.junit4.JUnit4Provider.execute(JUnit4Provider.java:283)
	at org.apache.maven.surefire.junit4.JUnit4Provider.executeWithRerun(JUnit4Provider.java:173)
	at org.apache.maven.surefire.junit4.JUnit4Provider.executeTestSet(JUnit4Provider.java:153)
	at org.apache.maven.surefire.junit4.JUnit4Provider.invoke(JUnit4Provider.java:128)
	at org.apache.maven.surefire.booter.ForkedBooter.invokeProviderInSameClassLoader(ForkedBooter.java:203)
	at org.apache.maven.surefire.booter.ForkedBooter.runSuitesInProcess(ForkedBooter.java:155)
	at org.apache.maven.surefire.booter.ForkedBooter.main(ForkedBooter.java:103)

testIntArrayAsObject(org.apache.commons.lang3.builder.HashCodeBuilderTest)  Time elapsed: 0.001 sec  <<< ERROR!
java.lang.IllegalArgumentException: HashCodeBuilder requires an odd initial value
	at org.apache.commons.lang3.Validate.isTrue(Validate.java:34)
	at org.apache.commons.lang3.builder.HashCodeBuilder.<init>(HashCodeBuilder.java:558)
	at org.apache.commons.lang3.builder.HashCodeBuilderTest.testIntArrayAsObject(HashCodeBuilderTest.java:328)

testReflectionHashCodeEx1(org.apache.commons.lang3.builder.HashCodeBuilderTest)  Time elapsed: 0.001 sec  <<< FAILURE!
java.lang.AssertionError: Expected exception: java.lang.IllegalArgumentException
	at org.junit.internal.runners.statements.ExpectException.evaluate(ExpectException.java:32)
	at org.junit.runners.ParentRunner.runLeaf(ParentRunner.java:325)
	at org.junit.runners.BlockJUnit4ClassRunner.runChild(BlockJUnit4ClassRunner.java:78)
	at org.junit.runners.BlockJUnit4ClassRunner.runChild(BlockJUnit4ClassRunner.java:57)
	at org.junit.runners.ParentRunner$3.run(ParentRunner.java:290)
	at org.junit.runners.ParentRunner$1.schedule(ParentRunner.java:71)
	at org.junit.runners.ParentRunner.runChildren(ParentRunner.java:288)
	at org.junit.runners.ParentRunner.access$000(ParentRunner.java:58)
	at org.junit.runners.ParentRunner$2.evaluate(ParentRunner.java:268)
	at org.junit.runners.ParentRunner.run(ParentRunner.java:363)
	at org.apache.maven.surefire.junit4.JUnit4Provider.execute(JUnit4Provider.java:283)
	at org.apache.maven.surefire.junit4.JUnit4Provider.executeWithRerun(JUnit4Provider.java:173)
	at org.apache.maven.surefire.junit4.JUnit4Provider.executeTestSet(JUnit4Provider.java:153)
	at org.apache.maven.surefire.junit4.JUnit4Provider.invoke(JUnit4Provider.java:128)
	at org.apache.maven.surefire.booter.ForkedBooter.invokeProviderInSameClassLoader(ForkedBooter.java:203)
	at org.apache.maven.surefire.booter.ForkedBooter.runSuitesInProcess(ForkedBooter.java:155)
	at org.apache.maven.surefire.booter.ForkedBooter.main(ForkedBooter.java:103)

testReflectionHashCodeEx2(org.apache.commons.lang3.builder.HashCodeBuilderTest)  Time elapsed: 0 sec  <<< FAILURE!
java.lang.AssertionError: Expected exception: java.lang.IllegalArgumentException
	at org.junit.internal.runners.statements.ExpectException.evaluate(ExpectException.java:32)
	at org.junit.runners.ParentRunner.runLeaf(ParentRunner.java:325)
	at org.junit.runners.BlockJUnit4ClassRunner.runChild(BlockJUnit4ClassRunner.java:78)
	at org.junit.runners.BlockJUnit4ClassRunner.runChild(BlockJUnit4ClassRunner.java:57)
	at org.junit.runners.ParentRunner$3.run(ParentRunner.java:290)
	at org.junit.runners.ParentRunner$1.schedule(ParentRunner.java:71)
	at org.junit.runners.ParentRunner.runChildren(ParentRunner.java:288)
	at org.junit.runners.ParentRunner.access$000(ParentRunner.java:58)
	at org.junit.runners.ParentRunner$2.evaluate(ParentRunner.java:268)
	at org.junit.runners.ParentRunner.run(ParentRunner.java:363)
	at org.apache.maven.surefire.junit4.JUnit4Provider.execute(JUnit4Provider.java:283)
	at org.apache.maven.surefire.junit4.JUnit4Provider.executeWithRerun(JUnit4Provider.java:173)
	at org.apache.maven.surefire.junit4.JUnit4Provider.executeTestSet(JUnit4Provider.java:153)
	at org.apache.maven.surefire.junit4.JUnit4Provider.invoke(JUnit4Provider.java:128)
	at org.apache.maven.surefire.booter.ForkedBooter.invokeProviderInSameClassLoader(ForkedBooter.java:203)
	at org.apache.maven.surefire.booter.ForkedBooter.runSuitesInProcess(ForkedBooter.java:155)
	at org.apache.maven.surefire.booter.ForkedBooter.main(ForkedBooter.java:103)

testBoolean(org.apache.commons.lang3.builder.HashCodeBuilderTest)  Time elapsed: 0.001 sec  <<< ERROR!
java.lang.IllegalArgumentException: HashCodeBuilder requires an odd initial value
	at org.apache.commons.lang3.Validate.isTrue(Validate.java:34)
	at org.apache.commons.lang3.builder.HashCodeBuilder.<init>(HashCodeBuilder.java:558)
	at org.apache.commons.lang3.builder.HashCodeBuilderTest.testBoolean(HashCodeBuilderTest.java:262)

testBooleanArray(org.apache.commons.lang3.builder.HashCodeBuilderTest)  Time elapsed: 0 sec  <<< ERROR!
java.lang.IllegalArgumentException: HashCodeBuilder requires an odd initial value
	at org.apache.commons.lang3.Validate.isTrue(Validate.java:34)
	at org.apache.commons.lang3.builder.HashCodeBuilder.<init>(HashCodeBuilder.java:558)
	at org.apache.commons.lang3.builder.HashCodeBuilderTest.testBooleanArray(HashCodeBuilderTest.java:454)

testDoubleArrayAsObject(org.apache.commons.lang3.builder.HashCodeBuilderTest)  Time elapsed: 0.001 sec  <<< ERROR!
java.lang.IllegalArgumentException: HashCodeBuilder requires an odd initial value
	at org.apache.commons.lang3.Validate.isTrue(Validate.java:34)
	at org.apache.commons.lang3.builder.HashCodeBuilder.<init>(HashCodeBuilder.java:558)
	at org.apache.commons.lang3.builder.HashCodeBuilderTest.testDoubleArrayAsObject(HashCodeBuilderTest.java:416)

testReflectionHierarchyHashCodeEx1(org.apache.commons.lang3.builder.HashCodeBuilderTest)  Time elapsed: 0.001 sec  <<< FAILURE!
java.lang.AssertionError: Expected exception: java.lang.IllegalArgumentException
	at org.junit.internal.runners.statements.ExpectException.evaluate(ExpectException.java:32)
	at org.junit.runners.ParentRunner.runLeaf(ParentRunner.java:325)
	at org.junit.runners.BlockJUnit4ClassRunner.runChild(BlockJUnit4ClassRunner.java:78)
	at org.junit.runners.BlockJUnit4ClassRunner.runChild(BlockJUnit4ClassRunner.java:57)
	at org.junit.runners.ParentRunner$3.run(ParentRunner.java:290)
	at org.junit.runners.ParentRunner$1.schedule(ParentRunner.java:71)
	at org.junit.runners.ParentRunner.runChildren(ParentRunner.java:288)
	at org.junit.runners.ParentRunner.access$000(ParentRunner.java:58)
	at org.junit.runners.ParentRunner$2.evaluate(ParentRunner.java:268)
	at org.junit.runners.ParentRunner.run(ParentRunner.java:363)
	at org.apache.maven.surefire.junit4.JUnit4Provider.execute(JUnit4Provider.java:283)
	at org.apache.maven.surefire.junit4.JUnit4Provider.executeWithRerun(JUnit4Provider.java:173)
	at org.apache.maven.surefire.junit4.JUnit4Provider.executeTestSet(JUnit4Provider.java:153)
	at org.apache.maven.surefire.junit4.JUnit4Provider.invoke(JUnit4Provider.java:128)
	at org.apache.maven.surefire.booter.ForkedBooter.invokeProviderInSameClassLoader(ForkedBooter.java:203)
	at org.apache.maven.surefire.booter.ForkedBooter.runSuitesInProcess(ForkedBooter.java:155)
	at org.apache.maven.surefire.booter.ForkedBooter.main(ForkedBooter.java:103)

testReflectionHierarchyHashCodeEx2(org.apache.commons.lang3.builder.HashCodeBuilderTest)  Time elapsed: 0 sec  <<< FAILURE!
java.lang.AssertionError: Expected exception: java.lang.IllegalArgumentException
	at org.junit.internal.runners.statements.ExpectException.evaluate(ExpectException.java:32)
	at org.junit.runners.ParentRunner.runLeaf(ParentRunner.java:325)
	at org.junit.runners.BlockJUnit4ClassRunner.runChild(BlockJUnit4ClassRunner.java:78)
	at org.junit.runners.BlockJUnit4ClassRunner.runChild(BlockJUnit4ClassRunner.java:57)
	at org.junit.runners.ParentRunner$3.run(ParentRunner.java:290)
	at org.junit.runners.ParentRunner$1.schedule(ParentRunner.java:71)
	at org.junit.runners.ParentRunner.runChildren(ParentRunner.java:288)
	at org.junit.runners.ParentRunner.access$000(ParentRunner.java:58)
	at org.junit.runners.ParentRunner$2.evaluate(ParentRunner.java:268)
	at org.junit.runners.ParentRunner.run(ParentRunner.java:363)
	at org.apache.maven.surefire.junit4.JUnit4Provider.execute(JUnit4Provider.java:283)
	at org.apache.maven.surefire.junit4.JUnit4Provider.executeWithRerun(JUnit4Provider.java:173)
	at org.apache.maven.surefire.junit4.JUnit4Provider.executeTestSet(JUnit4Provider.java:153)
	at org.apache.maven.surefire.junit4.JUnit4Provider.invoke(JUnit4Provider.java:128)
	at org.apache.maven.surefire.booter.ForkedBooter.invokeProviderInSameClassLoader(ForkedBooter.java:203)
	at org.apache.maven.surefire.booter.ForkedBooter.runSuitesInProcess(ForkedBooter.java:155)
	at org.apache.maven.surefire.booter.ForkedBooter.main(ForkedBooter.java:103)

testReflectionObjectCycle(org.apache.commons.lang3.builder.HashCodeBuilderTest)  Time elapsed: 0.001 sec  <<< ERROR!
java.lang.IllegalArgumentException: HashCodeBuilder requires an odd initial value
	at org.apache.commons.lang3.Validate.isTrue(Validate.java:34)
	at org.apache.commons.lang3.builder.HashCodeBuilder.<init>(HashCodeBuilder.java:558)
	at org.apache.commons.lang3.builder.HashCodeBuilder.reflectionHashCode(HashCodeBuilder.java:352)
	at org.apache.commons.lang3.builder.HashCodeBuilder.reflectionHashCode(HashCodeBuilder.java:473)
	at org.apache.commons.lang3.builder.HashCodeBuilderTest$ReflectionTestCycleA.hashCode(HashCodeBuilderTest.java:39)
	at org.apache.commons.lang3.builder.HashCodeBuilderTest.testReflectionObjectCycle(HashCodeBuilderTest.java:552)

testReflectionHierarchyHashCode(org.apache.commons.lang3.builder.HashCodeBuilderTest)  Time elapsed: 0.001 sec  <<< ERROR!
java.lang.IllegalArgumentException: HashCodeBuilder requires an odd initial value
	at org.apache.commons.lang3.Validate.isTrue(Validate.java:34)
	at org.apache.commons.lang3.builder.HashCodeBuilder.<init>(HashCodeBuilder.java:558)
	at org.apache.commons.lang3.builder.HashCodeBuilder.reflectionHashCode(HashCodeBuilder.java:352)
	at org.apache.commons.lang3.builder.HashCodeBuilder.reflectionHashCode(HashCodeBuilder.java:473)
	at org.apache.commons.lang3.builder.HashCodeBuilderTest.testReflectionHierarchyHashCode(HashCodeBuilderTest.java:153)

testObjectArrayAsObject(org.apache.commons.lang3.builder.HashCodeBuilderTest)  Time elapsed: 0 sec  <<< ERROR!
java.lang.IllegalArgumentException: HashCodeBuilder requires an odd initial value
	at org.apache.commons.lang3.Validate.isTrue(Validate.java:34)
	at org.apache.commons.lang3.builder.HashCodeBuilder.<init>(HashCodeBuilder.java:558)
	at org.apache.commons.lang3.builder.HashCodeBuilderTest.testObjectArrayAsObject(HashCodeBuilderTest.java:281)

testBooleanMultiArray(org.apache.commons.lang3.builder.HashCodeBuilderTest)  Time elapsed: 0 sec  <<< ERROR!
java.lang.IllegalArgumentException: HashCodeBuilder requires an odd initial value
	at org.apache.commons.lang3.Validate.isTrue(Validate.java:34)
	at org.apache.commons.lang3.builder.HashCodeBuilder.<init>(HashCodeBuilder.java:558)
	at org.apache.commons.lang3.builder.HashCodeBuilderTest.testBooleanMultiArray(HashCodeBuilderTest.java:476)

testLongArray(org.apache.commons.lang3.builder.HashCodeBuilderTest)  Time elapsed: 0 sec  <<< ERROR!
java.lang.IllegalArgumentException: HashCodeBuilder requires an odd initial value
	at org.apache.commons.lang3.Validate.isTrue(Validate.java:34)
	at org.apache.commons.lang3.builder.HashCodeBuilder.<init>(HashCodeBuilder.java:558)
	at org.apache.commons.lang3.builder.HashCodeBuilderTest.testLongArray(HashCodeBuilderTest.java:291)

testShortArray(org.apache.commons.lang3.builder.HashCodeBuilderTest)  Time elapsed: 0 sec  <<< ERROR!
java.lang.IllegalArgumentException: HashCodeBuilder requires an odd initial value
	at org.apache.commons.lang3.Validate.isTrue(Validate.java:34)
	at org.apache.commons.lang3.builder.HashCodeBuilder.<init>(HashCodeBuilder.java:558)
	at org.apache.commons.lang3.builder.HashCodeBuilderTest.testShortArray(HashCodeBuilderTest.java:337)

testIntArray(org.apache.commons.lang3.builder.HashCodeBuilderTest)  Time elapsed: 0.001 sec  <<< ERROR!
java.lang.IllegalArgumentException: HashCodeBuilder requires an odd initial value
	at org.apache.commons.lang3.Validate.isTrue(Validate.java:34)
	at org.apache.commons.lang3.builder.HashCodeBuilder.<init>(HashCodeBuilder.java:558)
	at org.apache.commons.lang3.builder.HashCodeBuilderTest.testIntArray(HashCodeBuilderTest.java:316)

testDouble(org.apache.commons.lang3.builder.HashCodeBuilderTest)  Time elapsed: 0 sec  <<< ERROR!
java.lang.IllegalArgumentException: HashCodeBuilder requires an odd initial value
	at org.apache.commons.lang3.Validate.isTrue(Validate.java:34)
	at org.apache.commons.lang3.builder.HashCodeBuilder.<init>(HashCodeBuilder.java:558)
	at org.apache.commons.lang3.builder.HashCodeBuilderTest.testDouble(HashCodeBuilderTest.java:245)

testToHashCodeEqualsHashCode(org.apache.commons.lang3.builder.HashCodeBuilderTest)  Time elapsed: 0.001 sec  <<< ERROR!
java.lang.IllegalArgumentException: HashCodeBuilder requires an odd initial value
	at org.apache.commons.lang3.Validate.isTrue(Validate.java:34)
	at org.apache.commons.lang3.builder.HashCodeBuilder.<init>(HashCodeBuilder.java:558)
	at org.apache.commons.lang3.builder.HashCodeBuilderTest.testToHashCodeEqualsHashCode(HashCodeBuilderTest.java:563)

testReflectionHashCode(org.apache.commons.lang3.builder.HashCodeBuilderTest)  Time elapsed: 0 sec  <<< ERROR!
java.lang.IllegalArgumentException: HashCodeBuilder requires an odd initial value
	at org.apache.commons.lang3.Validate.isTrue(Validate.java:34)
	at org.apache.commons.lang3.builder.HashCodeBuilder.<init>(HashCodeBuilder.java:558)
	at org.apache.commons.lang3.builder.HashCodeBuilder.reflectionHashCode(HashCodeBuilder.java:352)
	at org.apache.commons.lang3.builder.HashCodeBuilder.reflectionHashCode(HashCodeBuilder.java:473)
	at org.apache.commons.lang3.builder.HashCodeBuilderTest.testReflectionHashCode(HashCodeBuilderTest.java:147)

testObject(org.apache.commons.lang3.builder.HashCodeBuilderTest)  Time elapsed: 0 sec  <<< ERROR!
java.lang.IllegalArgumentException: HashCodeBuilder requires an odd initial value
	at org.apache.commons.lang3.Validate.isTrue(Validate.java:34)
	at org.apache.commons.lang3.builder.HashCodeBuilder.<init>(HashCodeBuilder.java:558)
	at org.apache.commons.lang3.builder.HashCodeBuilderTest.testObject(HashCodeBuilderTest.java:196)

testLongArrayAsObject(org.apache.commons.lang3.builder.HashCodeBuilderTest)  Time elapsed: 0 sec  <<< ERROR!
java.lang.IllegalArgumentException: HashCodeBuilder requires an odd initial value
	at org.apache.commons.lang3.Validate.isTrue(Validate.java:34)
	at org.apache.commons.lang3.builder.HashCodeBuilder.<init>(HashCodeBuilder.java:558)
	at org.apache.commons.lang3.builder.HashCodeBuilderTest.testLongArrayAsObject(HashCodeBuilderTest.java:305)

testByteArrayAsObject(org.apache.commons.lang3.builder.HashCodeBuilderTest)  Time elapsed: 0 sec  <<< ERROR!
java.lang.IllegalArgumentException: HashCodeBuilder requires an odd initial value
	at org.apache.commons.lang3.Validate.isTrue(Validate.java:34)
	at org.apache.commons.lang3.builder.HashCodeBuilder.<init>(HashCodeBuilder.java:558)
	at org.apache.commons.lang3.builder.HashCodeBuilderTest.testByteArrayAsObject(HashCodeBuilderTest.java:391)

testConstructorExEvenNegative(org.apache.commons.lang3.builder.HashCodeBuilderTest)  Time elapsed: 0 sec  <<< FAILURE!
java.lang.AssertionError: Expected exception: java.lang.IllegalArgumentException
	at org.junit.internal.runners.statements.ExpectException.evaluate(ExpectException.java:32)
	at org.junit.runners.ParentRunner.runLeaf(ParentRunner.java:325)
	at org.junit.runners.BlockJUnit4ClassRunner.runChild(BlockJUnit4ClassRunner.java:78)
	at org.junit.runners.BlockJUnit4ClassRunner.runChild(BlockJUnit4ClassRunner.java:57)
	at org.junit.runners.ParentRunner$3.run(ParentRunner.java:290)
	at org.junit.runners.ParentRunner$1.schedule(ParentRunner.java:71)
	at org.junit.runners.ParentRunner.runChildren(ParentRunner.java:288)
	at org.junit.runners.ParentRunner.access$000(ParentRunner.java:58)
	at org.junit.runners.ParentRunner$2.evaluate(ParentRunner.java:268)
	at org.junit.runners.ParentRunner.run(ParentRunner.java:363)
	at org.apache.maven.surefire.junit4.JUnit4Provider.execute(JUnit4Provider.java:283)
	at org.apache.maven.surefire.junit4.JUnit4Provider.executeWithRerun(JUnit4Provider.java:173)
	at org.apache.maven.surefire.junit4.JUnit4Provider.executeTestSet(JUnit4Provider.java:153)
	at org.apache.maven.surefire.junit4.JUnit4Provider.invoke(JUnit4Provider.java:128)
	at org.apache.maven.surefire.booter.ForkedBooter.invokeProviderInSameClassLoader(ForkedBooter.java:203)
	at org.apache.maven.surefire.booter.ForkedBooter.runSuitesInProcess(ForkedBooter.java:155)
	at org.apache.maven.surefire.booter.ForkedBooter.main(ForkedBooter.java:103)

testReflectionHashCodeExcludeFields(org.apache.commons.lang3.builder.HashCodeBuilderTest)  Time elapsed: 0 sec  <<< ERROR!
java.lang.IllegalArgumentException: HashCodeBuilder requires an odd initial value
	at org.apache.commons.lang3.Validate.isTrue(Validate.java:34)
	at org.apache.commons.lang3.builder.HashCodeBuilder.<init>(HashCodeBuilder.java:558)
	at org.apache.commons.lang3.builder.HashCodeBuilder.reflectionHashCode(HashCodeBuilder.java:352)
	at org.apache.commons.lang3.builder.HashCodeBuilder.reflectionHashCode(HashCodeBuilder.java:473)
	at org.apache.commons.lang3.builder.HashCodeBuilderTest.testReflectionHashCodeExcludeFields(HashCodeBuilderTest.java:493)

testShortArrayAsObject(org.apache.commons.lang3.builder.HashCodeBuilderTest)  Time elapsed: 0 sec  <<< ERROR!
java.lang.IllegalArgumentException: HashCodeBuilder requires an odd initial value
	at org.apache.commons.lang3.Validate.isTrue(Validate.java:34)
	at org.apache.commons.lang3.builder.HashCodeBuilder.<init>(HashCodeBuilder.java:558)
	at org.apache.commons.lang3.builder.HashCodeBuilderTest.testShortArrayAsObject(HashCodeBuilderTest.java:349)

testDoubleArray(org.apache.commons.lang3.builder.HashCodeBuilderTest)  Time elapsed: 0 sec  <<< ERROR!
java.lang.IllegalArgumentException: HashCodeBuilder requires an odd initial value
	at org.apache.commons.lang3.Validate.isTrue(Validate.java:34)
	at org.apache.commons.lang3.builder.HashCodeBuilder.<init>(HashCodeBuilder.java:558)
	at org.apache.commons.lang3.builder.HashCodeBuilderTest.testDoubleArray(HashCodeBuilderTest.java:400)

testBooleanArrayAsObject(org.apache.commons.lang3.builder.HashCodeBuilderTest)  Time elapsed: 0.003 sec  <<< ERROR!
java.lang.IllegalArgumentException: HashCodeBuilder requires an odd initial value
	at org.apache.commons.lang3.Validate.isTrue(Validate.java:34)
	at org.apache.commons.lang3.builder.HashCodeBuilder.<init>(HashCodeBuilder.java:558)
	at org.apache.commons.lang3.builder.HashCodeBuilderTest.testBooleanArrayAsObject(HashCodeBuilderTest.java:466)

Running org.apache.commons.lang3.concurrent.AtomicInitializerTest
Tests run: 3, Failures: 0, Errors: 0, Skipped: 0, Time elapsed: 0.026 sec - in org.apache.commons.lang3.concurrent.AtomicInitializerTest
Running org.apache.commons.lang3.concurrent.CallableBackgroundInitializerTest
Tests run: 4, Failures: 0, Errors: 0, Skipped: 0, Time elapsed: 0.007 sec - in org.apache.commons.lang3.concurrent.CallableBackgroundInitializerTest
Running org.apache.commons.lang3.concurrent.BackgroundInitializerTest
Exception in thread "Thread-20" java.lang.IllegalArgumentException: Not a checked exception: java.lang.InterruptedException
	at org.apache.commons.lang3.Validate.isTrue(Validate.java:34)
	at org.apache.commons.lang3.concurrent.ConcurrentUtils.checkedException(ConcurrentUtils.java:146)
	at org.apache.commons.lang3.concurrent.ConcurrentException.<init>(ConcurrentException.java:56)
	at org.apache.commons.lang3.concurrent.BackgroundInitializer.get(BackgroundInitializer.java:219)
	at org.apache.commons.lang3.concurrent.BackgroundInitializerTest$1.run(BackgroundInitializerTest.java:230)
Tests run: 15, Failures: 1, Errors: 1, Skipped: 0, Time elapsed: 0.027 sec <<< FAILURE! - in org.apache.commons.lang3.concurrent.BackgroundInitializerTest
testGetCheckedException(org.apache.commons.lang3.concurrent.BackgroundInitializerTest)  Time elapsed: 0.002 sec  <<< ERROR!
java.lang.IllegalArgumentException: Not a checked exception: java.lang.Exception
	at org.apache.commons.lang3.Validate.isTrue(Validate.java:34)
	at org.apache.commons.lang3.concurrent.ConcurrentUtils.checkedException(ConcurrentUtils.java:146)
	at org.apache.commons.lang3.concurrent.ConcurrentException.<init>(ConcurrentException.java:68)
	at org.apache.commons.lang3.concurrent.ConcurrentUtils.extractCause(ConcurrentUtils.java:68)
	at org.apache.commons.lang3.concurrent.ConcurrentUtils.handleCause(ConcurrentUtils.java:108)
	at org.apache.commons.lang3.concurrent.BackgroundInitializer.get(BackgroundInitializer.java:214)
	at org.apache.commons.lang3.concurrent.BackgroundInitializerTest.testGetCheckedException(BackgroundInitializerTest.java:205)

testGetInterruptedException(org.apache.commons.lang3.concurrent.BackgroundInitializerTest)  Time elapsed: 0.002 sec  <<< FAILURE!
java.lang.AssertionError: No interrupted exception
	at org.junit.Assert.fail(Assert.java:88)
	at org.junit.Assert.assertTrue(Assert.java:41)
	at org.junit.Assert.assertNotNull(Assert.java:712)
	at org.apache.commons.lang3.concurrent.BackgroundInitializerTest.testGetInterruptedException(BackgroundInitializerTest.java:246)

Running org.apache.commons.lang3.concurrent.LazyInitializerTest
Tests run: 3, Failures: 0, Errors: 0, Skipped: 0, Time elapsed: 0.005 sec - in org.apache.commons.lang3.concurrent.LazyInitializerTest
Running org.apache.commons.lang3.concurrent.BasicThreadFactoryTest
Tests run: 15, Failures: 0, Errors: 0, Skipped: 0, Time elapsed: 0.033 sec - in org.apache.commons.lang3.concurrent.BasicThreadFactoryTest
Running org.apache.commons.lang3.concurrent.ConstantInitializerTest
Tests run: 7, Failures: 0, Errors: 0, Skipped: 0, Time elapsed: 0.001 sec - in org.apache.commons.lang3.concurrent.ConstantInitializerTest
Running org.apache.commons.lang3.concurrent.MultiBackgroundInitializerTest
Tests run: 17, Failures: 0, Errors: 2, Skipped: 0, Time elapsed: 0.057 sec <<< FAILURE! - in org.apache.commons.lang3.concurrent.MultiBackgroundInitializerTest
testInitializeEx(org.apache.commons.lang3.concurrent.MultiBackgroundInitializerTest)  Time elapsed: 0.001 sec  <<< ERROR!
java.lang.IllegalArgumentException: Not a checked exception: java.lang.Exception
	at org.apache.commons.lang3.Validate.isTrue(Validate.java:34)
	at org.apache.commons.lang3.concurrent.ConcurrentUtils.checkedException(ConcurrentUtils.java:146)
	at org.apache.commons.lang3.concurrent.ConcurrentException.<init>(ConcurrentException.java:68)
	at org.apache.commons.lang3.concurrent.ConcurrentUtils.extractCause(ConcurrentUtils.java:68)
	at org.apache.commons.lang3.concurrent.ConcurrentUtils.handleCause(ConcurrentUtils.java:108)
	at org.apache.commons.lang3.concurrent.BackgroundInitializer.get(BackgroundInitializer.java:214)
	at org.apache.commons.lang3.concurrent.MultiBackgroundInitializer.initialize(MultiBackgroundInitializer.java:208)
	at org.apache.commons.lang3.concurrent.MultiBackgroundInitializer.initialize(MultiBackgroundInitializer.java:97)
	at org.apache.commons.lang3.concurrent.BackgroundInitializer$InitializationTask.call(BackgroundInitializer.java:327)
	at java.util.concurrent.FutureTask.run(FutureTask.java:262)
	at java.util.concurrent.ThreadPoolExecutor.runWorker(ThreadPoolExecutor.java:1145)
	at java.util.concurrent.ThreadPoolExecutor$Worker.run(ThreadPoolExecutor.java:615)
	at java.lang.Thread.run(Thread.java:745)

testInitializeResultsIsSuccessfulFalse(org.apache.commons.lang3.concurrent.MultiBackgroundInitializerTest)  Time elapsed: 0.001 sec  <<< ERROR!
java.lang.IllegalArgumentException: Not a checked exception: java.lang.Exception
	at org.apache.commons.lang3.Validate.isTrue(Validate.java:34)
	at org.apache.commons.lang3.concurrent.ConcurrentUtils.checkedException(ConcurrentUtils.java:146)
	at org.apache.commons.lang3.concurrent.ConcurrentException.<init>(ConcurrentException.java:68)
	at org.apache.commons.lang3.concurrent.ConcurrentUtils.extractCause(ConcurrentUtils.java:68)
	at org.apache.commons.lang3.concurrent.ConcurrentUtils.handleCause(ConcurrentUtils.java:108)
	at org.apache.commons.lang3.concurrent.BackgroundInitializer.get(BackgroundInitializer.java:214)
	at org.apache.commons.lang3.concurrent.MultiBackgroundInitializer.initialize(MultiBackgroundInitializer.java:208)
	at org.apache.commons.lang3.concurrent.MultiBackgroundInitializer.initialize(MultiBackgroundInitializer.java:97)
	at org.apache.commons.lang3.concurrent.BackgroundInitializer$InitializationTask.call(BackgroundInitializer.java:327)
	at java.util.concurrent.FutureTask.run(FutureTask.java:262)
	at java.util.concurrent.ThreadPoolExecutor.runWorker(ThreadPoolExecutor.java:1145)
	at java.util.concurrent.ThreadPoolExecutor$Worker.run(ThreadPoolExecutor.java:615)
	at java.lang.Thread.run(Thread.java:745)

Running org.apache.commons.lang3.concurrent.AtomicSafeInitializerTest
Tests run: 4, Failures: 0, Errors: 0, Skipped: 0, Time elapsed: 0.013 sec - in org.apache.commons.lang3.concurrent.AtomicSafeInitializerTest
Running org.apache.commons.lang3.concurrent.ConcurrentUtilsTest
Tests run: 40, Failures: 6, Errors: 6, Skipped: 0, Time elapsed: 0.022 sec <<< FAILURE! - in org.apache.commons.lang3.concurrent.ConcurrentUtilsTest
testExtractCauseChecked(org.apache.commons.lang3.concurrent.ConcurrentUtilsTest)  Time elapsed: 0 sec  <<< ERROR!
java.lang.IllegalArgumentException: Not a checked exception: java.lang.Exception: Test
	at org.apache.commons.lang3.Validate.isTrue(Validate.java:34)
	at org.apache.commons.lang3.concurrent.ConcurrentUtils.checkedException(ConcurrentUtils.java:146)
	at org.apache.commons.lang3.concurrent.ConcurrentException.<init>(ConcurrentException.java:68)
	at org.apache.commons.lang3.concurrent.ConcurrentUtils.extractCause(ConcurrentUtils.java:68)
	at org.apache.commons.lang3.concurrent.ConcurrentUtilsTest.testExtractCauseChecked(ConcurrentUtilsTest.java:140)

testHandleCauseChecked(org.apache.commons.lang3.concurrent.ConcurrentUtilsTest)  Time elapsed: 0 sec  <<< ERROR!
java.lang.IllegalArgumentException: Not a checked exception: java.lang.Exception: Test
	at org.apache.commons.lang3.Validate.isTrue(Validate.java:34)
	at org.apache.commons.lang3.concurrent.ConcurrentUtils.checkedException(ConcurrentUtils.java:146)
	at org.apache.commons.lang3.concurrent.ConcurrentException.<init>(ConcurrentException.java:68)
	at org.apache.commons.lang3.concurrent.ConcurrentUtils.extractCause(ConcurrentUtils.java:68)
	at org.apache.commons.lang3.concurrent.ConcurrentUtils.handleCause(ConcurrentUtils.java:108)
	at org.apache.commons.lang3.concurrent.ConcurrentUtilsTest.testHandleCauseChecked(ConcurrentUtilsTest.java:240)

testConcurrentExceptionCauseError(org.apache.commons.lang3.concurrent.ConcurrentUtilsTest)  Time elapsed: 0.001 sec  <<< FAILURE!
java.lang.AssertionError: Expected exception: java.lang.IllegalArgumentException
	at org.junit.internal.runners.statements.ExpectException.evaluate(ExpectException.java:32)
	at org.junit.runners.ParentRunner.runLeaf(ParentRunner.java:325)
	at org.junit.runners.BlockJUnit4ClassRunner.runChild(BlockJUnit4ClassRunner.java:78)
	at org.junit.runners.BlockJUnit4ClassRunner.runChild(BlockJUnit4ClassRunner.java:57)
	at org.junit.runners.ParentRunner$3.run(ParentRunner.java:290)
	at org.junit.runners.ParentRunner$1.schedule(ParentRunner.java:71)
	at org.junit.runners.ParentRunner.runChildren(ParentRunner.java:288)
	at org.junit.runners.ParentRunner.access$000(ParentRunner.java:58)
	at org.junit.runners.ParentRunner$2.evaluate(ParentRunner.java:268)
	at org.junit.runners.ParentRunner.run(ParentRunner.java:363)
	at org.apache.maven.surefire.junit4.JUnit4Provider.execute(JUnit4Provider.java:283)
	at org.apache.maven.surefire.junit4.JUnit4Provider.executeWithRerun(JUnit4Provider.java:173)
	at org.apache.maven.surefire.junit4.JUnit4Provider.executeTestSet(JUnit4Provider.java:153)
	at org.apache.maven.surefire.junit4.JUnit4Provider.invoke(JUnit4Provider.java:128)
	at org.apache.maven.surefire.booter.ForkedBooter.invokeProviderInSameClassLoader(ForkedBooter.java:203)
	at org.apache.maven.surefire.booter.ForkedBooter.runSuitesInProcess(ForkedBooter.java:155)
	at org.apache.maven.surefire.booter.ForkedBooter.main(ForkedBooter.java:103)

testConcurrentExceptionCauseNull(org.apache.commons.lang3.concurrent.ConcurrentUtilsTest)  Time elapsed: 0 sec  <<< FAILURE!
java.lang.AssertionError: Expected exception: java.lang.IllegalArgumentException
	at org.junit.internal.runners.statements.ExpectException.evaluate(ExpectException.java:32)
	at org.junit.runners.ParentRunner.runLeaf(ParentRunner.java:325)
	at org.junit.runners.BlockJUnit4ClassRunner.runChild(BlockJUnit4ClassRunner.java:78)
	at org.junit.runners.BlockJUnit4ClassRunner.runChild(BlockJUnit4ClassRunner.java:57)
	at org.junit.runners.ParentRunner$3.run(ParentRunner.java:290)
	at org.junit.runners.ParentRunner$1.schedule(ParentRunner.java:71)
	at org.junit.runners.ParentRunner.runChildren(ParentRunner.java:288)
	at org.junit.runners.ParentRunner.access$000(ParentRunner.java:58)
	at org.junit.runners.ParentRunner$2.evaluate(ParentRunner.java:268)
	at org.junit.runners.ParentRunner.run(ParentRunner.java:363)
	at org.apache.maven.surefire.junit4.JUnit4Provider.execute(JUnit4Provider.java:283)
	at org.apache.maven.surefire.junit4.JUnit4Provider.executeWithRerun(JUnit4Provider.java:173)
	at org.apache.maven.surefire.junit4.JUnit4Provider.executeTestSet(JUnit4Provider.java:153)
	at org.apache.maven.surefire.junit4.JUnit4Provider.invoke(JUnit4Provider.java:128)
	at org.apache.maven.surefire.booter.ForkedBooter.invokeProviderInSameClassLoader(ForkedBooter.java:203)
	at org.apache.maven.surefire.booter.ForkedBooter.runSuitesInProcess(ForkedBooter.java:155)
	at org.apache.maven.surefire.booter.ForkedBooter.main(ForkedBooter.java:103)

testExtractCauseUncheckedChecked(org.apache.commons.lang3.concurrent.ConcurrentUtilsTest)  Time elapsed: 0 sec  <<< ERROR!
java.lang.IllegalArgumentException: Not a checked exception: java.lang.Exception: Test
	at org.apache.commons.lang3.Validate.isTrue(Validate.java:34)
	at org.apache.commons.lang3.concurrent.ConcurrentUtils.checkedException(ConcurrentUtils.java:146)
	at org.apache.commons.lang3.concurrent.ConcurrentRuntimeException.<init>(ConcurrentRuntimeException.java:70)
	at org.apache.commons.lang3.concurrent.ConcurrentUtils.extractCauseUnchecked(ConcurrentUtils.java:90)
	at org.apache.commons.lang3.concurrent.ConcurrentUtilsTest.testExtractCauseUncheckedChecked(ConcurrentUtilsTest.java:196)

testHandleCauseUncheckedChecked(org.apache.commons.lang3.concurrent.ConcurrentUtilsTest)  Time elapsed: 0.001 sec  <<< ERROR!
java.lang.IllegalArgumentException: Not a checked exception: java.lang.Exception: Test
	at org.apache.commons.lang3.Validate.isTrue(Validate.java:34)
	at org.apache.commons.lang3.concurrent.ConcurrentUtils.checkedException(ConcurrentUtils.java:146)
	at org.apache.commons.lang3.concurrent.ConcurrentRuntimeException.<init>(ConcurrentRuntimeException.java:70)
	at org.apache.commons.lang3.concurrent.ConcurrentUtils.extractCauseUnchecked(ConcurrentUtils.java:90)
	at org.apache.commons.lang3.concurrent.ConcurrentUtils.handleCauseUnchecked(ConcurrentUtils.java:129)
	at org.apache.commons.lang3.concurrent.ConcurrentUtilsTest.testHandleCauseUncheckedChecked(ConcurrentUtilsTest.java:295)

testConcurrentRuntimeExceptionCauseUnchecked(org.apache.commons.lang3.concurrent.ConcurrentUtilsTest)  Time elapsed: 0 sec  <<< FAILURE!
java.lang.AssertionError: Expected exception: java.lang.IllegalArgumentException
	at org.junit.internal.runners.statements.ExpectException.evaluate(ExpectException.java:32)
	at org.junit.runners.ParentRunner.runLeaf(ParentRunner.java:325)
	at org.junit.runners.BlockJUnit4ClassRunner.runChild(BlockJUnit4ClassRunner.java:78)
	at org.junit.runners.BlockJUnit4ClassRunner.runChild(BlockJUnit4ClassRunner.java:57)
	at org.junit.runners.ParentRunner$3.run(ParentRunner.java:290)
	at org.junit.runners.ParentRunner$1.schedule(ParentRunner.java:71)
	at org.junit.runners.ParentRunner.runChildren(ParentRunner.java:288)
	at org.junit.runners.ParentRunner.access$000(ParentRunner.java:58)
	at org.junit.runners.ParentRunner$2.evaluate(ParentRunner.java:268)
	at org.junit.runners.ParentRunner.run(ParentRunner.java:363)
	at org.apache.maven.surefire.junit4.JUnit4Provider.execute(JUnit4Provider.java:283)
	at org.apache.maven.surefire.junit4.JUnit4Provider.executeWithRerun(JUnit4Provider.java:173)
	at org.apache.maven.surefire.junit4.JUnit4Provider.executeTestSet(JUnit4Provider.java:153)
	at org.apache.maven.surefire.junit4.JUnit4Provider.invoke(JUnit4Provider.java:128)
	at org.apache.maven.surefire.booter.ForkedBooter.invokeProviderInSameClassLoader(ForkedBooter.java:203)
	at org.apache.maven.surefire.booter.ForkedBooter.runSuitesInProcess(ForkedBooter.java:155)
	at org.apache.maven.surefire.booter.ForkedBooter.main(ForkedBooter.java:103)

testCreateIfAbsentUncheckedException(org.apache.commons.lang3.concurrent.ConcurrentUtilsTest)  Time elapsed: 0.001 sec  <<< ERROR!
java.lang.IllegalArgumentException: Not a checked exception: java.lang.Exception
	at org.apache.commons.lang3.Validate.isTrue(Validate.java:34)
	at org.apache.commons.lang3.concurrent.ConcurrentUtils.checkedException(ConcurrentUtils.java:146)
	at org.apache.commons.lang3.concurrent.ConcurrentException.<init>(ConcurrentException.java:56)
	at org.apache.commons.lang3.concurrent.ConcurrentUtilsTest.testCreateIfAbsentUncheckedException(ConcurrentUtilsTest.java:572)

testConcurrentRuntimeExceptionCauseNull(org.apache.commons.lang3.concurrent.ConcurrentUtilsTest)  Time elapsed: 0 sec  <<< FAILURE!
java.lang.AssertionError: Expected exception: java.lang.IllegalArgumentException
	at org.junit.internal.runners.statements.ExpectException.evaluate(ExpectException.java:32)
	at org.junit.runners.ParentRunner.runLeaf(ParentRunner.java:325)
	at org.junit.runners.BlockJUnit4ClassRunner.runChild(BlockJUnit4ClassRunner.java:78)
	at org.junit.runners.BlockJUnit4ClassRunner.runChild(BlockJUnit4ClassRunner.java:57)
	at org.junit.runners.ParentRunner$3.run(ParentRunner.java:290)
	at org.junit.runners.ParentRunner$1.schedule(ParentRunner.java:71)
	at org.junit.runners.ParentRunner.runChildren(ParentRunner.java:288)
	at org.junit.runners.ParentRunner.access$000(ParentRunner.java:58)
	at org.junit.runners.ParentRunner$2.evaluate(ParentRunner.java:268)
	at org.junit.runners.ParentRunner.run(ParentRunner.java:363)
	at org.apache.maven.surefire.junit4.JUnit4Provider.execute(JUnit4Provider.java:283)
	at org.apache.maven.surefire.junit4.JUnit4Provider.executeWithRerun(JUnit4Provider.java:173)
	at org.apache.maven.surefire.junit4.JUnit4Provider.executeTestSet(JUnit4Provider.java:153)
	at org.apache.maven.surefire.junit4.JUnit4Provider.invoke(JUnit4Provider.java:128)
	at org.apache.maven.surefire.booter.ForkedBooter.invokeProviderInSameClassLoader(ForkedBooter.java:203)
	at org.apache.maven.surefire.booter.ForkedBooter.runSuitesInProcess(ForkedBooter.java:155)
	at org.apache.maven.surefire.booter.ForkedBooter.main(ForkedBooter.java:103)

testConcurrentRuntimeExceptionCauseError(org.apache.commons.lang3.concurrent.ConcurrentUtilsTest)  Time elapsed: 0 sec  <<< FAILURE!
java.lang.AssertionError: Expected exception: java.lang.IllegalArgumentException
	at org.junit.internal.runners.statements.ExpectException.evaluate(ExpectException.java:32)
	at org.junit.runners.ParentRunner.runLeaf(ParentRunner.java:325)
	at org.junit.runners.BlockJUnit4ClassRunner.runChild(BlockJUnit4ClassRunner.java:78)
	at org.junit.runners.BlockJUnit4ClassRunner.runChild(BlockJUnit4ClassRunner.java:57)
	at org.junit.runners.ParentRunner$3.run(ParentRunner.java:290)
	at org.junit.runners.ParentRunner$1.schedule(ParentRunner.java:71)
	at org.junit.runners.ParentRunner.runChildren(ParentRunner.java:288)
	at org.junit.runners.ParentRunner.access$000(ParentRunner.java:58)
	at org.junit.runners.ParentRunner$2.evaluate(ParentRunner.java:268)
	at org.junit.runners.ParentRunner.run(ParentRunner.java:363)
	at org.apache.maven.surefire.junit4.JUnit4Provider.execute(JUnit4Provider.java:283)
	at org.apache.maven.surefire.junit4.JUnit4Provider.executeWithRerun(JUnit4Provider.java:173)
	at org.apache.maven.surefire.junit4.JUnit4Provider.executeTestSet(JUnit4Provider.java:153)
	at org.apache.maven.surefire.junit4.JUnit4Provider.invoke(JUnit4Provider.java:128)
	at org.apache.maven.surefire.booter.ForkedBooter.invokeProviderInSameClassLoader(ForkedBooter.java:203)
	at org.apache.maven.surefire.booter.ForkedBooter.runSuitesInProcess(ForkedBooter.java:155)
	at org.apache.maven.surefire.booter.ForkedBooter.main(ForkedBooter.java:103)

testConcurrentExceptionCauseUnchecked(org.apache.commons.lang3.concurrent.ConcurrentUtilsTest)  Time elapsed: 0 sec  <<< FAILURE!
java.lang.AssertionError: Expected exception: java.lang.IllegalArgumentException
	at org.junit.internal.runners.statements.ExpectException.evaluate(ExpectException.java:32)
	at org.junit.runners.ParentRunner.runLeaf(ParentRunner.java:325)
	at org.junit.runners.BlockJUnit4ClassRunner.runChild(BlockJUnit4ClassRunner.java:78)
	at org.junit.runners.BlockJUnit4ClassRunner.runChild(BlockJUnit4ClassRunner.java:57)
	at org.junit.runners.ParentRunner$3.run(ParentRunner.java:290)
	at org.junit.runners.ParentRunner$1.schedule(ParentRunner.java:71)
	at org.junit.runners.ParentRunner.runChildren(ParentRunner.java:288)
	at org.junit.runners.ParentRunner.access$000(ParentRunner.java:58)
	at org.junit.runners.ParentRunner$2.evaluate(ParentRunner.java:268)
	at org.junit.runners.ParentRunner.run(ParentRunner.java:363)
	at org.apache.maven.surefire.junit4.JUnit4Provider.execute(JUnit4Provider.java:283)
	at org.apache.maven.surefire.junit4.JUnit4Provider.executeWithRerun(JUnit4Provider.java:173)
	at org.apache.maven.surefire.junit4.JUnit4Provider.executeTestSet(JUnit4Provider.java:153)
	at org.apache.maven.surefire.junit4.JUnit4Provider.invoke(JUnit4Provider.java:128)
	at org.apache.maven.surefire.booter.ForkedBooter.invokeProviderInSameClassLoader(ForkedBooter.java:203)
	at org.apache.maven.surefire.booter.ForkedBooter.runSuitesInProcess(ForkedBooter.java:155)
	at org.apache.maven.surefire.booter.ForkedBooter.main(ForkedBooter.java:103)

testInitializeUncheckedEx(org.apache.commons.lang3.concurrent.ConcurrentUtilsTest)  Time elapsed: 0 sec  <<< ERROR!
java.lang.IllegalArgumentException: Not a checked exception: java.lang.Exception
	at org.apache.commons.lang3.Validate.isTrue(Validate.java:34)
	at org.apache.commons.lang3.concurrent.ConcurrentUtils.checkedException(ConcurrentUtils.java:146)
	at org.apache.commons.lang3.concurrent.ConcurrentException.<init>(ConcurrentException.java:56)
	at org.apache.commons.lang3.concurrent.ConcurrentUtilsTest.testInitializeUncheckedEx(ConcurrentUtilsTest.java:383)

Running org.apache.commons.lang3.concurrent.TimedSemaphoreTest
Tests run: 15, Failures: 0, Errors: 0, Skipped: 0, Time elapsed: 1.186 sec - in org.apache.commons.lang3.concurrent.TimedSemaphoreTest
Running org.apache.commons.lang3.StringUtilsSubstringTest
Tests run: 14, Failures: 0, Errors: 0, Skipped: 0, Time elapsed: 0.003 sec - in org.apache.commons.lang3.StringUtilsSubstringTest
Running org.apache.commons.lang3.SystemUtilsTest
Tests run: 12, Failures: 0, Errors: 0, Skipped: 0, Time elapsed: 0.001 sec - in org.apache.commons.lang3.SystemUtilsTest
Running org.apache.commons.lang3.CharRangeTest
Tests run: 16, Failures: 0, Errors: 0, Skipped: 0, Time elapsed: 0.033 sec - in org.apache.commons.lang3.CharRangeTest
Running org.apache.commons.lang3.CharSetTest
Tests run: 14, Failures: 0, Errors: 0, Skipped: 0, Time elapsed: 0.009 sec - in org.apache.commons.lang3.CharSetTest
Running org.apache.commons.lang3.StringUtilsStartsEndsWithTest
Tests run: 6, Failures: 0, Errors: 0, Skipped: 0, Time elapsed: 0.002 sec - in org.apache.commons.lang3.StringUtilsStartsEndsWithTest
Running org.apache.commons.lang3.RandomStringUtilsTest
Tests run: 11, Failures: 0, Errors: 0, Skipped: 0, Time elapsed: 0.032 sec - in org.apache.commons.lang3.RandomStringUtilsTest
Running org.apache.commons.lang3.SerializationUtilsTest
Tests run: 26, Failures: 0, Errors: 0, Skipped: 0, Time elapsed: 0.048 sec - in org.apache.commons.lang3.SerializationUtilsTest
Running org.apache.commons.lang3.time.StopWatchTest
Tests run: 8, Failures: 0, Errors: 0, Skipped: 0, Time elapsed: 4.764 sec - in org.apache.commons.lang3.time.StopWatchTest
Running org.apache.commons.lang3.time.DateUtilsRoundingTest
Tests run: 22, Failures: 0, Errors: 0, Skipped: 0, Time elapsed: 0.192 sec - in org.apache.commons.lang3.time.DateUtilsRoundingTest
Running org.apache.commons.lang3.time.FastDateParserTest
Tests run: 33, Failures: 0, Errors: 0, Skipped: 0, Time elapsed: 2.276 sec - in org.apache.commons.lang3.time.FastDateParserTest
Running org.apache.commons.lang3.time.FastDateFormat_ParserTest
Tests run: 33, Failures: 0, Errors: 0, Skipped: 0, Time elapsed: 0.838 sec - in org.apache.commons.lang3.time.FastDateFormat_ParserTest
Running org.apache.commons.lang3.time.DurationFormatUtilsTest
Tests run: 25, Failures: 2, Errors: 9, Skipped: 0, Time elapsed: 0.015 sec <<< FAILURE! - in org.apache.commons.lang3.time.DurationFormatUtilsTest
testDurationsByBruteForce(org.apache.commons.lang3.time.DurationFormatUtilsTest)  Time elapsed: 0 sec  <<< ERROR!
java.lang.IllegalArgumentException: startMillis must not be greater than endMillis
	at org.apache.commons.lang3.Validate.isTrue(Validate.java:34)
	at org.apache.commons.lang3.time.DurationFormatUtils.formatPeriod(DurationFormatUtils.java:281)
	at org.apache.commons.lang3.time.DurationFormatUtils.formatPeriod(DurationFormatUtils.java:252)
	at org.apache.commons.lang3.time.DurationFormatUtilsTest.assertEqualDuration(DurationFormatUtilsTest.java:623)
	at org.apache.commons.lang3.time.DurationFormatUtilsTest.bruteForce(DurationFormatUtilsTest.java:606)
	at org.apache.commons.lang3.time.DurationFormatUtilsTest.testDurationsByBruteForce(DurationFormatUtilsTest.java:568)

testFormatPeriod(org.apache.commons.lang3.time.DurationFormatUtilsTest)  Time elapsed: 0 sec  <<< ERROR!
java.lang.IllegalArgumentException: startMillis must not be greater than endMillis
	at org.apache.commons.lang3.Validate.isTrue(Validate.java:34)
	at org.apache.commons.lang3.time.DurationFormatUtils.formatPeriod(DurationFormatUtils.java:281)
	at org.apache.commons.lang3.time.DurationFormatUtils.formatPeriod(DurationFormatUtils.java:252)
	at org.apache.commons.lang3.time.DurationFormatUtilsTest.testFormatPeriod(DurationFormatUtilsTest.java:304)

testLANG815(org.apache.commons.lang3.time.DurationFormatUtilsTest)  Time elapsed: 0 sec  <<< ERROR!
java.lang.IllegalArgumentException: startMillis must not be greater than endMillis
	at org.apache.commons.lang3.Validate.isTrue(Validate.java:34)
	at org.apache.commons.lang3.time.DurationFormatUtils.formatPeriod(DurationFormatUtils.java:281)
	at org.apache.commons.lang3.time.DurationFormatUtils.formatPeriod(DurationFormatUtils.java:252)
	at org.apache.commons.lang3.time.DurationFormatUtilsTest.testLANG815(DurationFormatUtilsTest.java:432)

testLowDurations(org.apache.commons.lang3.time.DurationFormatUtilsTest)  Time elapsed: 0 sec  <<< ERROR!
java.lang.IllegalArgumentException: startMillis must not be greater than endMillis
	at org.apache.commons.lang3.Validate.isTrue(Validate.java:34)
	at org.apache.commons.lang3.time.DurationFormatUtils.formatPeriod(DurationFormatUtils.java:281)
	at org.apache.commons.lang3.time.DurationFormatUtils.formatPeriod(DurationFormatUtils.java:252)
	at org.apache.commons.lang3.time.DurationFormatUtilsTest.assertEqualDuration(DurationFormatUtilsTest.java:623)
	at org.apache.commons.lang3.time.DurationFormatUtilsTest.assertEqualDuration(DurationFormatUtilsTest.java:612)
	at org.apache.commons.lang3.time.DurationFormatUtilsTest.testLowDurations(DurationFormatUtilsTest.java:441)

testFormatPeriodISO(org.apache.commons.lang3.time.DurationFormatUtilsTest)  Time elapsed: 0 sec  <<< ERROR!
java.lang.IllegalArgumentException: startMillis must not be greater than endMillis
	at org.apache.commons.lang3.Validate.isTrue(Validate.java:34)
	at org.apache.commons.lang3.time.DurationFormatUtils.formatPeriod(DurationFormatUtils.java:281)
	at org.apache.commons.lang3.time.DurationFormatUtilsTest.testFormatPeriodISO(DurationFormatUtilsTest.java:272)

testFormatPeriodISOMethod(org.apache.commons.lang3.time.DurationFormatUtilsTest)  Time elapsed: 0.001 sec  <<< ERROR!
java.lang.IllegalArgumentException: startMillis must not be greater than endMillis
	at org.apache.commons.lang3.Validate.isTrue(Validate.java:34)
	at org.apache.commons.lang3.time.DurationFormatUtils.formatPeriod(DurationFormatUtils.java:281)
	at org.apache.commons.lang3.time.DurationFormatUtils.formatPeriodISO(DurationFormatUtils.java:238)
	at org.apache.commons.lang3.time.DurationFormatUtilsTest.testFormatPeriodISOMethod(DurationFormatUtilsTest.java:292)

testEdgeDurations(org.apache.commons.lang3.time.DurationFormatUtilsTest)  Time elapsed: 0 sec  <<< ERROR!
java.lang.IllegalArgumentException: startMillis must not be greater than endMillis
	at org.apache.commons.lang3.Validate.isTrue(Validate.java:34)
	at org.apache.commons.lang3.time.DurationFormatUtils.formatPeriod(DurationFormatUtils.java:281)
	at org.apache.commons.lang3.time.DurationFormatUtils.formatPeriod(DurationFormatUtils.java:252)
	at org.apache.commons.lang3.time.DurationFormatUtilsTest.assertEqualDuration(DurationFormatUtilsTest.java:623)
	at org.apache.commons.lang3.time.DurationFormatUtilsTest.assertEqualDuration(DurationFormatUtilsTest.java:612)
	at org.apache.commons.lang3.time.DurationFormatUtilsTest.testEdgeDurations(DurationFormatUtilsTest.java:456)

testBugzilla38401(org.apache.commons.lang3.time.DurationFormatUtilsTest)  Time elapsed: 0 sec  <<< ERROR!
java.lang.IllegalArgumentException: startMillis must not be greater than endMillis
	at org.apache.commons.lang3.Validate.isTrue(Validate.java:34)
	at org.apache.commons.lang3.time.DurationFormatUtils.formatPeriod(DurationFormatUtils.java:281)
	at org.apache.commons.lang3.time.DurationFormatUtils.formatPeriod(DurationFormatUtils.java:252)
	at org.apache.commons.lang3.time.DurationFormatUtilsTest.assertEqualDuration(DurationFormatUtilsTest.java:623)
	at org.apache.commons.lang3.time.DurationFormatUtilsTest.assertEqualDuration(DurationFormatUtilsTest.java:612)
	at org.apache.commons.lang3.time.DurationFormatUtilsTest.testBugzilla38401(DurationFormatUtilsTest.java:412)

testFormatPeriodISOStartGreaterEnd(org.apache.commons.lang3.time.DurationFormatUtilsTest)  Time elapsed: 0 sec  <<< FAILURE!
java.lang.AssertionError: Expected exception: java.lang.IllegalArgumentException
	at org.junit.internal.runners.statements.ExpectException.evaluate(ExpectException.java:32)
	at org.junit.runners.ParentRunner.runLeaf(ParentRunner.java:325)
	at org.junit.runners.BlockJUnit4ClassRunner.runChild(BlockJUnit4ClassRunner.java:78)
	at org.junit.runners.BlockJUnit4ClassRunner.runChild(BlockJUnit4ClassRunner.java:57)
	at org.junit.runners.ParentRunner$3.run(ParentRunner.java:290)
	at org.junit.runners.ParentRunner$1.schedule(ParentRunner.java:71)
	at org.junit.runners.ParentRunner.runChildren(ParentRunner.java:288)
	at org.junit.runners.ParentRunner.access$000(ParentRunner.java:58)
	at org.junit.runners.ParentRunner$2.evaluate(ParentRunner.java:268)
	at org.junit.runners.ParentRunner.run(ParentRunner.java:363)
	at org.apache.maven.surefire.junit4.JUnit4Provider.execute(JUnit4Provider.java:283)
	at org.apache.maven.surefire.junit4.JUnit4Provider.executeWithRerun(JUnit4Provider.java:173)
	at org.apache.maven.surefire.junit4.JUnit4Provider.executeTestSet(JUnit4Provider.java:153)
	at org.apache.maven.surefire.junit4.JUnit4Provider.invoke(JUnit4Provider.java:128)
	at org.apache.maven.surefire.booter.ForkedBooter.invokeProviderInSameClassLoader(ForkedBooter.java:203)
	at org.apache.maven.surefire.booter.ForkedBooter.runSuitesInProcess(ForkedBooter.java:155)
	at org.apache.maven.surefire.booter.ForkedBooter.main(ForkedBooter.java:103)

testJiraLang281(org.apache.commons.lang3.time.DurationFormatUtilsTest)  Time elapsed: 0 sec  <<< ERROR!
java.lang.IllegalArgumentException: startMillis must not be greater than endMillis
	at org.apache.commons.lang3.Validate.isTrue(Validate.java:34)
	at org.apache.commons.lang3.time.DurationFormatUtils.formatPeriod(DurationFormatUtils.java:281)
	at org.apache.commons.lang3.time.DurationFormatUtils.formatPeriod(DurationFormatUtils.java:252)
	at org.apache.commons.lang3.time.DurationFormatUtilsTest.assertEqualDuration(DurationFormatUtilsTest.java:623)
	at org.apache.commons.lang3.time.DurationFormatUtilsTest.assertEqualDuration(DurationFormatUtilsTest.java:612)
	at org.apache.commons.lang3.time.DurationFormatUtilsTest.testJiraLang281(DurationFormatUtilsTest.java:419)

testFormatPeriodeStartGreaterEnd(org.apache.commons.lang3.time.DurationFormatUtilsTest)  Time elapsed: 0 sec  <<< FAILURE!
java.lang.AssertionError: Expected exception: java.lang.IllegalArgumentException
	at org.junit.internal.runners.statements.ExpectException.evaluate(ExpectException.java:32)
	at org.junit.runners.ParentRunner.runLeaf(ParentRunner.java:325)
	at org.junit.runners.BlockJUnit4ClassRunner.runChild(BlockJUnit4ClassRunner.java:78)
	at org.junit.runners.BlockJUnit4ClassRunner.runChild(BlockJUnit4ClassRunner.java:57)
	at org.junit.runners.ParentRunner$3.run(ParentRunner.java:290)
	at org.junit.runners.ParentRunner$1.schedule(ParentRunner.java:71)
	at org.junit.runners.ParentRunner.runChildren(ParentRunner.java:288)
	at org.junit.runners.ParentRunner.access$000(ParentRunner.java:58)
	at org.junit.runners.ParentRunner$2.evaluate(ParentRunner.java:268)
	at org.junit.runners.ParentRunner.run(ParentRunner.java:363)
	at org.apache.maven.surefire.junit4.JUnit4Provider.execute(JUnit4Provider.java:283)
	at org.apache.maven.surefire.junit4.JUnit4Provider.executeWithRerun(JUnit4Provider.java:173)
	at org.apache.maven.surefire.junit4.JUnit4Provider.executeTestSet(JUnit4Provider.java:153)
	at org.apache.maven.surefire.junit4.JUnit4Provider.invoke(JUnit4Provider.java:128)
	at org.apache.maven.surefire.booter.ForkedBooter.invokeProviderInSameClassLoader(ForkedBooter.java:203)
	at org.apache.maven.surefire.booter.ForkedBooter.runSuitesInProcess(ForkedBooter.java:155)
	at org.apache.maven.surefire.booter.ForkedBooter.main(ForkedBooter.java:103)

Running org.apache.commons.lang3.time.DateFormatUtilsTest
Tests run: 10, Failures: 0, Errors: 0, Skipped: 0, Time elapsed: 0.007 sec - in org.apache.commons.lang3.time.DateFormatUtilsTest
Running org.apache.commons.lang3.time.DateUtilsFragmentTest
Tests run: 57, Failures: 0, Errors: 0, Skipped: 0, Time elapsed: 0.013 sec - in org.apache.commons.lang3.time.DateUtilsFragmentTest
Running org.apache.commons.lang3.time.FastDatePrinterTimeZonesTest
Tests run: 617, Failures: 0, Errors: 0, Skipped: 0, Time elapsed: 0.259 sec - in org.apache.commons.lang3.time.FastDatePrinterTimeZonesTest
Running org.apache.commons.lang3.time.FastDateFormatTest
>>FastDateFormatTest: FastDateParser:31787  SimpleDateFormat:3666
Tests run: 14, Failures: 0, Errors: 0, Skipped: 0, Time elapsed: 3.95 sec - in org.apache.commons.lang3.time.FastDateFormatTest
Running org.apache.commons.lang3.time.FastDateFormat_PrinterTest
Tests run: 17, Failures: 0, Errors: 0, Skipped: 0, Time elapsed: 0.007 sec - in org.apache.commons.lang3.time.FastDateFormat_PrinterTest
Running org.apache.commons.lang3.time.FastDatePrinterTest
Tests run: 17, Failures: 0, Errors: 0, Skipped: 0, Time elapsed: 0.003 sec - in org.apache.commons.lang3.time.FastDatePrinterTest
Running org.apache.commons.lang3.time.FastDateParserSDFTest
Tests run: 276, Failures: 0, Errors: 0, Skipped: 92, Time elapsed: 0.057 sec - in org.apache.commons.lang3.time.FastDateParserSDFTest
Running org.apache.commons.lang3.time.DateUtilsTest
DateUtilsTest: Default Locale=en_US
Tests run: 38, Failures: 0, Errors: 0, Skipped: 0, Time elapsed: 0.013 sec - in org.apache.commons.lang3.time.DateUtilsTest
Running org.apache.commons.lang3.reflect.InheritanceUtilsTest
Tests run: 9, Failures: 0, Errors: 0, Skipped: 0, Time elapsed: 0.002 sec - in org.apache.commons.lang3.reflect.InheritanceUtilsTest
Running org.apache.commons.lang3.reflect.MethodUtilsTest
Tests run: 23, Failures: 0, Errors: 4, Skipped: 0, Time elapsed: 0.017 sec <<< FAILURE! - in org.apache.commons.lang3.reflect.MethodUtilsTest
testGetMethodsListWithAnnotationIllegalArgumentException3(org.apache.commons.lang3.reflect.MethodUtilsTest)  Time elapsed: 0 sec  <<< ERROR!
java.lang.Exception: Unexpected exception, expected<java.lang.IllegalArgumentException> but was<java.lang.NullPointerException>
	at org.apache.commons.lang3.reflect.MethodUtils.getMethodsListWithAnnotation(MethodUtils.java:629)
	at org.apache.commons.lang3.reflect.MethodUtilsTest.testGetMethodsListWithAnnotationIllegalArgumentException3(MethodUtilsTest.java:487)

testGetMethodsWithAnnotation(org.apache.commons.lang3.reflect.MethodUtilsTest)  Time elapsed: 0 sec  <<< ERROR!
java.lang.IllegalArgumentException: The class must not be null
	at org.apache.commons.lang3.Validate.isTrue(Validate.java:34)
	at org.apache.commons.lang3.reflect.MethodUtils.getMethodsListWithAnnotation(MethodUtils.java:627)
	at org.apache.commons.lang3.reflect.MethodUtils.getMethodsWithAnnotation(MethodUtils.java:611)
	at org.apache.commons.lang3.reflect.MethodUtilsTest.testGetMethodsWithAnnotation(MethodUtilsTest.java:439)

testGetMethodsWithAnnotationIllegalArgumentException3(org.apache.commons.lang3.reflect.MethodUtilsTest)  Time elapsed: 0 sec  <<< ERROR!
java.lang.Exception: Unexpected exception, expected<java.lang.IllegalArgumentException> but was<java.lang.NullPointerException>
	at org.apache.commons.lang3.reflect.MethodUtils.getMethodsListWithAnnotation(MethodUtils.java:629)
	at org.apache.commons.lang3.reflect.MethodUtils.getMethodsWithAnnotation(MethodUtils.java:611)
	at org.apache.commons.lang3.reflect.MethodUtilsTest.testGetMethodsWithAnnotationIllegalArgumentException3(MethodUtilsTest.java:459)

testGetMethodsListWithAnnotation(org.apache.commons.lang3.reflect.MethodUtilsTest)  Time elapsed: 0 sec  <<< ERROR!
java.lang.IllegalArgumentException: The class must not be null
	at org.apache.commons.lang3.Validate.isTrue(Validate.java:34)
	at org.apache.commons.lang3.reflect.MethodUtils.getMethodsListWithAnnotation(MethodUtils.java:627)
	at org.apache.commons.lang3.reflect.MethodUtilsTest.testGetMethodsListWithAnnotation(MethodUtilsTest.java:465)

Running org.apache.commons.lang3.reflect.ConstructorUtilsTest
Tests run: 7, Failures: 0, Errors: 0, Skipped: 0, Time elapsed: 0.009 sec - in org.apache.commons.lang3.reflect.ConstructorUtilsTest
Running org.apache.commons.lang3.reflect.FieldUtilsTest
Tests run: 64, Failures: 2, Errors: 38, Skipped: 0, Time elapsed: 0.023 sec <<< FAILURE! - in org.apache.commons.lang3.reflect.FieldUtilsTest
testReadStaticFieldForceAccess(org.apache.commons.lang3.reflect.FieldUtilsTest)  Time elapsed: 0.001 sec  <<< ERROR!
java.lang.IllegalArgumentException: The class must not be null
	at org.apache.commons.lang3.Validate.isTrue(Validate.java:34)
	at org.apache.commons.lang3.reflect.FieldUtils.getField(FieldUtils.java:86)
	at org.apache.commons.lang3.reflect.FieldUtils.getField(FieldUtils.java:63)
	at org.apache.commons.lang3.reflect.FieldUtilsTest.testReadStaticFieldForceAccess(FieldUtilsTest.java:322)

testGetAllFieldsList(org.apache.commons.lang3.reflect.FieldUtilsTest)  Time elapsed: 0.001 sec  <<< ERROR!
java.lang.IllegalArgumentException: The class must not be null
	at org.apache.commons.lang3.Validate.isTrue(Validate.java:34)
	at org.apache.commons.lang3.reflect.FieldUtils.getAllFieldsList(FieldUtils.java:214)
	at org.apache.commons.lang3.reflect.FieldUtilsTest.testGetAllFieldsList(FieldUtilsTest.java:161)

testReadDeclaredNamedField(org.apache.commons.lang3.reflect.FieldUtilsTest)  Time elapsed: 0 sec  <<< ERROR!
java.lang.NullPointerException: null
	at org.apache.commons.lang3.reflect.FieldUtils.readDeclaredField(FieldUtils.java:510)
	at org.apache.commons.lang3.reflect.FieldUtils.readDeclaredField(FieldUtils.java:488)
	at org.apache.commons.lang3.reflect.FieldUtilsTest.testReadDeclaredNamedField(FieldUtilsTest.java:680)

testReadNamedStaticField(org.apache.commons.lang3.reflect.FieldUtilsTest)  Time elapsed: 0 sec  <<< ERROR!
java.lang.IllegalArgumentException: The class must not be null
	at org.apache.commons.lang3.Validate.isTrue(Validate.java:34)
	at org.apache.commons.lang3.reflect.FieldUtils.getField(FieldUtils.java:86)
	at org.apache.commons.lang3.reflect.FieldUtils.readStaticField(FieldUtils.java:338)
	at org.apache.commons.lang3.reflect.FieldUtils.readStaticField(FieldUtils.java:316)
	at org.apache.commons.lang3.reflect.FieldUtilsTest.testReadNamedStaticField(FieldUtilsTest.java:340)

testReadDeclaredNamedStaticFieldForceAccess(org.apache.commons.lang3.reflect.FieldUtilsTest)  Time elapsed: 0.001 sec  <<< ERROR!
java.lang.IllegalArgumentException: The class must not be null
	at org.apache.commons.lang3.Validate.isTrue(Validate.java:34)
	at org.apache.commons.lang3.reflect.FieldUtils.getDeclaredField(FieldUtils.java:169)
	at org.apache.commons.lang3.reflect.FieldUtils.readDeclaredStaticField(FieldUtils.java:382)
	at org.apache.commons.lang3.reflect.FieldUtilsTest.testReadDeclaredNamedStaticFieldForceAccess(FieldUtilsTest.java:463)

testReadDeclaredNamedFieldForceAccess(org.apache.commons.lang3.reflect.FieldUtilsTest)  Time elapsed: 0 sec  <<< ERROR!
java.lang.NullPointerException: null
	at org.apache.commons.lang3.reflect.FieldUtils.readDeclaredField(FieldUtils.java:510)
	at org.apache.commons.lang3.reflect.FieldUtilsTest.testReadDeclaredNamedFieldForceAccess(FieldUtilsTest.java:764)

testGetField(org.apache.commons.lang3.reflect.FieldUtilsTest)  Time elapsed: 0 sec  <<< ERROR!
java.lang.IllegalArgumentException: The class must not be null
	at org.apache.commons.lang3.Validate.isTrue(Validate.java:34)
	at org.apache.commons.lang3.reflect.FieldUtils.getField(FieldUtils.java:86)
	at org.apache.commons.lang3.reflect.FieldUtils.getField(FieldUtils.java:63)
	at org.apache.commons.lang3.reflect.FieldUtilsTest.testGetField(FieldUtilsTest.java:73)

testGetFieldsWithAnnotationIllegalArgumentException3(org.apache.commons.lang3.reflect.FieldUtilsTest)  Time elapsed: 0 sec  <<< FAILURE!
java.lang.AssertionError: Expected exception: java.lang.IllegalArgumentException
	at org.junit.internal.runners.statements.ExpectException.evaluate(ExpectException.java:32)
	at org.junit.internal.runners.statements.RunBefores.evaluate(RunBefores.java:26)
	at org.junit.runners.ParentRunner.runLeaf(ParentRunner.java:325)
	at org.junit.runners.BlockJUnit4ClassRunner.runChild(BlockJUnit4ClassRunner.java:78)
	at org.junit.runners.BlockJUnit4ClassRunner.runChild(BlockJUnit4ClassRunner.java:57)
	at org.junit.runners.ParentRunner$3.run(ParentRunner.java:290)
	at org.junit.runners.ParentRunner$1.schedule(ParentRunner.java:71)
	at org.junit.runners.ParentRunner.runChildren(ParentRunner.java:288)
	at org.junit.runners.ParentRunner.access$000(ParentRunner.java:58)
	at org.junit.runners.ParentRunner$2.evaluate(ParentRunner.java:268)
	at org.junit.runners.ParentRunner.run(ParentRunner.java:363)
	at org.apache.maven.surefire.junit4.JUnit4Provider.execute(JUnit4Provider.java:283)
	at org.apache.maven.surefire.junit4.JUnit4Provider.executeWithRerun(JUnit4Provider.java:173)
	at org.apache.maven.surefire.junit4.JUnit4Provider.executeTestSet(JUnit4Provider.java:153)
	at org.apache.maven.surefire.junit4.JUnit4Provider.invoke(JUnit4Provider.java:128)
	at org.apache.maven.surefire.booter.ForkedBooter.invokeProviderInSameClassLoader(ForkedBooter.java:203)
	at org.apache.maven.surefire.booter.ForkedBooter.runSuitesInProcess(ForkedBooter.java:155)
	at org.apache.maven.surefire.booter.ForkedBooter.main(ForkedBooter.java:103)

testReadDeclaredNamedStaticField(org.apache.commons.lang3.reflect.FieldUtilsTest)  Time elapsed: 0 sec  <<< ERROR!
java.lang.IllegalArgumentException: The class must not be null
	at org.apache.commons.lang3.Validate.isTrue(Validate.java:34)
	at org.apache.commons.lang3.reflect.FieldUtils.getDeclaredField(FieldUtils.java:169)
	at org.apache.commons.lang3.reflect.FieldUtils.readDeclaredStaticField(FieldUtils.java:382)
	at org.apache.commons.lang3.reflect.FieldUtils.readDeclaredStaticField(FieldUtils.java:360)
	at org.apache.commons.lang3.reflect.FieldUtilsTest.testReadDeclaredNamedStaticField(FieldUtilsTest.java:440)

testWriteField(org.apache.commons.lang3.reflect.FieldUtilsTest)  Time elapsed: 0 sec  <<< ERROR!
java.lang.IllegalArgumentException: The field must not be null
	at org.apache.commons.lang3.Validate.isTrue(Validate.java:34)
	at org.apache.commons.lang3.reflect.FieldUtils.writeField(FieldUtils.java:684)
	at org.apache.commons.lang3.reflect.FieldUtils.writeField(FieldUtils.java:661)
	at org.apache.commons.lang3.reflect.FieldUtilsTest.testWriteField(FieldUtilsTest.java:1075)

testGetFieldsListWithAnnotation(org.apache.commons.lang3.reflect.FieldUtilsTest)  Time elapsed: 0.001 sec  <<< ERROR!
java.lang.IllegalArgumentException: The annotation class must not be null
	at org.apache.commons.lang3.Validate.isTrue(Validate.java:34)
	at org.apache.commons.lang3.reflect.FieldUtils.getFieldsListWithAnnotation(FieldUtils.java:255)
	at org.apache.commons.lang3.reflect.FieldUtilsTest.testGetFieldsListWithAnnotation(FieldUtilsTest.java:198)

testWriteNamedStaticFieldForceAccess(org.apache.commons.lang3.reflect.FieldUtilsTest)  Time elapsed: 0 sec  <<< ERROR!
java.lang.IllegalArgumentException: The class must not be null
	at org.apache.commons.lang3.Validate.isTrue(Validate.java:34)
	at org.apache.commons.lang3.reflect.FieldUtils.getField(FieldUtils.java:86)
	at org.apache.commons.lang3.reflect.FieldUtils.writeStaticField(FieldUtils.java:596)
	at org.apache.commons.lang3.reflect.FieldUtilsTest.testWriteNamedStaticFieldForceAccess(FieldUtilsTest.java:954)

testWriteFieldForceAccess(org.apache.commons.lang3.reflect.FieldUtilsTest)  Time elapsed: 0 sec  <<< ERROR!
java.lang.IllegalArgumentException: The field must not be null
	at org.apache.commons.lang3.Validate.isTrue(Validate.java:34)
	at org.apache.commons.lang3.reflect.FieldUtils.writeField(FieldUtils.java:684)
	at org.apache.commons.lang3.reflect.FieldUtilsTest.testWriteFieldForceAccess(FieldUtilsTest.java:1103)

testRemoveFinalModifierWithAccess(org.apache.commons.lang3.reflect.FieldUtilsTest)  Time elapsed: 0 sec  <<< ERROR!
java.lang.IllegalArgumentException: The field must not be null
	at org.apache.commons.lang3.Validate.isTrue(Validate.java:34)
	at org.apache.commons.lang3.reflect.FieldUtils.removeFinalModifier(FieldUtils.java:720)
	at org.apache.commons.lang3.reflect.FieldUtilsTest.testRemoveFinalModifierWithAccess(FieldUtilsTest.java:1329)

testReadStaticFieldForceAccessIllegalArgumentException1(org.apache.commons.lang3.reflect.FieldUtilsTest)  Time elapsed: 0.001 sec  <<< ERROR!
java.lang.Exception: Unexpected exception, expected<java.lang.IllegalArgumentException> but was<java.lang.NullPointerException>
	at org.apache.commons.lang3.reflect.FieldUtils.readStaticField(FieldUtils.java:297)
	at org.apache.commons.lang3.reflect.FieldUtilsTest.testReadStaticFieldForceAccessIllegalArgumentException1(FieldUtilsTest.java:328)

testRemoveFinalModifier(org.apache.commons.lang3.reflect.FieldUtilsTest)  Time elapsed: 0 sec  <<< ERROR!
java.lang.IllegalArgumentException: The field must not be null
	at org.apache.commons.lang3.Validate.isTrue(Validate.java:34)
	at org.apache.commons.lang3.reflect.FieldUtils.removeFinalModifier(FieldUtils.java:720)
	at org.apache.commons.lang3.reflect.FieldUtils.removeFinalModifier(FieldUtils.java:703)
	at org.apache.commons.lang3.reflect.FieldUtilsTest.testRemoveFinalModifier(FieldUtilsTest.java:1318)

testWriteNamedField(org.apache.commons.lang3.reflect.FieldUtilsTest)  Time elapsed: 0.001 sec  <<< ERROR!
java.lang.IllegalArgumentException: target object must not be null
	at org.apache.commons.lang3.Validate.isTrue(Validate.java:34)
	at org.apache.commons.lang3.reflect.FieldUtils.writeField(FieldUtils.java:785)
	at org.apache.commons.lang3.reflect.FieldUtils.writeField(FieldUtils.java:761)
	at org.apache.commons.lang3.reflect.FieldUtilsTest.testWriteNamedField(FieldUtilsTest.java:1118)

testWriteDeclaredNamedFieldForceAccess(org.apache.commons.lang3.reflect.FieldUtilsTest)  Time elapsed: 0 sec  <<< ERROR!
java.lang.IllegalArgumentException: target object must not be null
	at org.apache.commons.lang3.Validate.isTrue(Validate.java:34)
	at org.apache.commons.lang3.reflect.FieldUtils.writeDeclaredField(FieldUtils.java:833)
	at org.apache.commons.lang3.reflect.FieldUtilsTest.testWriteDeclaredNamedFieldForceAccess(FieldUtilsTest.java:1289)

testWriteDeclaredNamedStaticField(org.apache.commons.lang3.reflect.FieldUtilsTest)  Time elapsed: 0 sec  <<< ERROR!
java.lang.IllegalArgumentException: The class must not be null
	at org.apache.commons.lang3.Validate.isTrue(Validate.java:34)
	at org.apache.commons.lang3.reflect.FieldUtils.getField(FieldUtils.java:86)
	at org.apache.commons.lang3.reflect.FieldUtils.writeStaticField(FieldUtils.java:596)
	at org.apache.commons.lang3.reflect.FieldUtils.writeStaticField(FieldUtils.java:572)
	at org.apache.commons.lang3.reflect.FieldUtilsTest.testWriteDeclaredNamedStaticField(FieldUtilsTest.java:990)

testReadNamedField(org.apache.commons.lang3.reflect.FieldUtilsTest)  Time elapsed: 0.001 sec  <<< ERROR!
java.lang.IllegalArgumentException: target object must not be null
	at org.apache.commons.lang3.Validate.isTrue(Validate.java:34)
	at org.apache.commons.lang3.reflect.FieldUtils.readField(FieldUtils.java:466)
	at org.apache.commons.lang3.reflect.FieldUtils.readField(FieldUtils.java:445)
	at org.apache.commons.lang3.reflect.FieldUtilsTest.testReadNamedField(FieldUtilsTest.java:539)

testReadStaticFieldIllegalArgumentException1(org.apache.commons.lang3.reflect.FieldUtilsTest)  Time elapsed: 0 sec  <<< ERROR!
java.lang.Exception: Unexpected exception, expected<java.lang.IllegalArgumentException> but was<java.lang.NullPointerException>
	at org.apache.commons.lang3.reflect.FieldUtils.readStaticField(FieldUtils.java:297)
	at org.apache.commons.lang3.reflect.FieldUtils.readStaticField(FieldUtils.java:278)
	at org.apache.commons.lang3.reflect.FieldUtilsTest.testReadStaticFieldIllegalArgumentException1(FieldUtilsTest.java:309)

testGetFieldForceAccess(org.apache.commons.lang3.reflect.FieldUtilsTest)  Time elapsed: 0 sec  <<< ERROR!
java.lang.IllegalArgumentException: The class must not be null
	at org.apache.commons.lang3.Validate.isTrue(Validate.java:34)
	at org.apache.commons.lang3.reflect.FieldUtils.getField(FieldUtils.java:86)
	at org.apache.commons.lang3.reflect.FieldUtilsTest.testGetFieldForceAccess(FieldUtilsTest.java:112)

testGetFieldsListWithAnnotationIllegalArgumentException3(org.apache.commons.lang3.reflect.FieldUtilsTest)  Time elapsed: 0 sec  <<< FAILURE!
java.lang.AssertionError: Expected exception: java.lang.IllegalArgumentException
	at org.junit.internal.runners.statements.ExpectException.evaluate(ExpectException.java:32)
	at org.junit.internal.runners.statements.RunBefores.evaluate(RunBefores.java:26)
	at org.junit.runners.ParentRunner.runLeaf(ParentRunner.java:325)
	at org.junit.runners.BlockJUnit4ClassRunner.runChild(BlockJUnit4ClassRunner.java:78)
	at org.junit.runners.BlockJUnit4ClassRunner.runChild(BlockJUnit4ClassRunner.java:57)
	at org.junit.runners.ParentRunner$3.run(ParentRunner.java:290)
	at org.junit.runners.ParentRunner$1.schedule(ParentRunner.java:71)
	at org.junit.runners.ParentRunner.runChildren(ParentRunner.java:288)
	at org.junit.runners.ParentRunner.access$000(ParentRunner.java:58)
	at org.junit.runners.ParentRunner$2.evaluate(ParentRunner.java:268)
	at org.junit.runners.ParentRunner.run(ParentRunner.java:363)
	at org.apache.maven.surefire.junit4.JUnit4Provider.execute(JUnit4Provider.java:283)
	at org.apache.maven.surefire.junit4.JUnit4Provider.executeWithRerun(JUnit4Provider.java:173)
	at org.apache.maven.surefire.junit4.JUnit4Provider.executeTestSet(JUnit4Provider.java:153)
	at org.apache.maven.surefire.junit4.JUnit4Provider.invoke(JUnit4Provider.java:128)
	at org.apache.maven.surefire.booter.ForkedBooter.invokeProviderInSameClassLoader(ForkedBooter.java:203)
	at org.apache.maven.surefire.booter.ForkedBooter.runSuitesInProcess(ForkedBooter.java:155)
	at org.apache.maven.surefire.booter.ForkedBooter.main(ForkedBooter.java:103)

testReadField(org.apache.commons.lang3.reflect.FieldUtilsTest)  Time elapsed: 0.001 sec  <<< ERROR!
java.lang.IllegalArgumentException: The class must not be null
	at org.apache.commons.lang3.Validate.isTrue(Validate.java:34)
	at org.apache.commons.lang3.reflect.FieldUtils.getDeclaredField(FieldUtils.java:169)
	at org.apache.commons.lang3.reflect.FieldUtils.getDeclaredField(FieldUtils.java:149)
	at org.apache.commons.lang3.reflect.FieldUtilsTest.testReadField(FieldUtilsTest.java:481)

testWriteNamedStaticField(org.apache.commons.lang3.reflect.FieldUtilsTest)  Time elapsed: 0 sec  <<< ERROR!
java.lang.IllegalArgumentException: The class must not be null
	at org.apache.commons.lang3.Validate.isTrue(Validate.java:34)
	at org.apache.commons.lang3.reflect.FieldUtils.getField(FieldUtils.java:86)
	at org.apache.commons.lang3.reflect.FieldUtils.writeStaticField(FieldUtils.java:596)
	at org.apache.commons.lang3.reflect.FieldUtils.writeStaticField(FieldUtils.java:572)
	at org.apache.commons.lang3.reflect.FieldUtilsTest.testWriteNamedStaticField(FieldUtilsTest.java:906)

testWriteStaticFieldForceAccess(org.apache.commons.lang3.reflect.FieldUtilsTest)  Time elapsed: 0.001 sec  <<< ERROR!
java.lang.IllegalArgumentException: The field must not be null
	at org.apache.commons.lang3.Validate.isTrue(Validate.java:34)
	at org.apache.commons.lang3.reflect.FieldUtils.writeStaticField(FieldUtils.java:550)
	at org.apache.commons.lang3.reflect.FieldUtilsTest.testWriteStaticFieldForceAccess(FieldUtilsTest.java:863)

testWriteStaticField(org.apache.commons.lang3.reflect.FieldUtilsTest)  Time elapsed: 0 sec  <<< ERROR!
java.lang.IllegalArgumentException: The field must not be null
	at org.apache.commons.lang3.Validate.isTrue(Validate.java:34)
	at org.apache.commons.lang3.reflect.FieldUtils.writeStaticField(FieldUtils.java:550)
	at org.apache.commons.lang3.reflect.FieldUtils.writeStaticField(FieldUtils.java:530)
	at org.apache.commons.lang3.reflect.FieldUtilsTest.testWriteStaticField(FieldUtilsTest.java:807)

testWriteNamedFieldForceAccess(org.apache.commons.lang3.reflect.FieldUtilsTest)  Time elapsed: 0 sec  <<< ERROR!
java.lang.IllegalArgumentException: target object must not be null
	at org.apache.commons.lang3.Validate.isTrue(Validate.java:34)
	at org.apache.commons.lang3.reflect.FieldUtils.writeField(FieldUtils.java:785)
	at org.apache.commons.lang3.reflect.FieldUtilsTest.testWriteNamedFieldForceAccess(FieldUtilsTest.java:1172)

testReadNamedStaticFieldForceAccess(org.apache.commons.lang3.reflect.FieldUtilsTest)  Time elapsed: 0 sec  <<< ERROR!
java.lang.IllegalArgumentException: The class must not be null
	at org.apache.commons.lang3.Validate.isTrue(Validate.java:34)
	at org.apache.commons.lang3.reflect.FieldUtils.getField(FieldUtils.java:86)
	at org.apache.commons.lang3.reflect.FieldUtils.readStaticField(FieldUtils.java:338)
	at org.apache.commons.lang3.reflect.FieldUtilsTest.testReadNamedStaticFieldForceAccess(FieldUtilsTest.java:390)

testGetFieldsWithAnnotation(org.apache.commons.lang3.reflect.FieldUtilsTest)  Time elapsed: 0 sec  <<< ERROR!
java.lang.IllegalArgumentException: The annotation class must not be null
	at org.apache.commons.lang3.Validate.isTrue(Validate.java:34)
	at org.apache.commons.lang3.reflect.FieldUtils.getFieldsListWithAnnotation(FieldUtils.java:255)
	at org.apache.commons.lang3.reflect.FieldUtils.getFieldsWithAnnotation(FieldUtils.java:239)
	at org.apache.commons.lang3.reflect.FieldUtilsTest.testGetFieldsWithAnnotation(FieldUtilsTest.java:173)

testGetAllFields(org.apache.commons.lang3.reflect.FieldUtilsTest)  Time elapsed: 0 sec  <<< ERROR!
java.lang.IllegalArgumentException: The class must not be null
	at org.apache.commons.lang3.Validate.isTrue(Validate.java:34)
	at org.apache.commons.lang3.reflect.FieldUtils.getAllFieldsList(FieldUtils.java:214)
	at org.apache.commons.lang3.reflect.FieldUtils.getAllFields(FieldUtils.java:199)
	at org.apache.commons.lang3.reflect.FieldUtilsTest.testGetAllFields(FieldUtilsTest.java:151)

testReadStaticField(org.apache.commons.lang3.reflect.FieldUtilsTest)  Time elapsed: 0.001 sec  <<< ERROR!
java.lang.IllegalArgumentException: The class must not be null
	at org.apache.commons.lang3.Validate.isTrue(Validate.java:34)
	at org.apache.commons.lang3.reflect.FieldUtils.getField(FieldUtils.java:86)
	at org.apache.commons.lang3.reflect.FieldUtils.getField(FieldUtils.java:63)
	at org.apache.commons.lang3.reflect.FieldUtilsTest.testReadStaticField(FieldUtilsTest.java:304)

testWriteDeclaredNamedStaticFieldForceAccess(org.apache.commons.lang3.reflect.FieldUtilsTest)  Time elapsed: 0 sec  <<< ERROR!
java.lang.IllegalArgumentException: The class must not be null
	at org.apache.commons.lang3.Validate.isTrue(Validate.java:34)
	at org.apache.commons.lang3.reflect.FieldUtils.getDeclaredField(FieldUtils.java:169)
	at org.apache.commons.lang3.reflect.FieldUtils.writeDeclaredStaticField(FieldUtils.java:641)
	at org.apache.commons.lang3.reflect.FieldUtilsTest.testWriteDeclaredNamedStaticFieldForceAccess(FieldUtilsTest.java:1038)

testWriteDeclaredNamedField(org.apache.commons.lang3.reflect.FieldUtilsTest)  Time elapsed: 0 sec  <<< ERROR!
java.lang.IllegalArgumentException: target object must not be null
	at org.apache.commons.lang3.Validate.isTrue(Validate.java:34)
	at org.apache.commons.lang3.reflect.FieldUtils.writeDeclaredField(FieldUtils.java:833)
	at org.apache.commons.lang3.reflect.FieldUtils.writeDeclaredField(FieldUtils.java:809)
	at org.apache.commons.lang3.reflect.FieldUtilsTest.testWriteDeclaredNamedField(FieldUtilsTest.java:1227)

testRemoveFinalModifierWithoutAccess(org.apache.commons.lang3.reflect.FieldUtilsTest)  Time elapsed: 0.001 sec  <<< ERROR!
java.lang.IllegalArgumentException: The field must not be null
	at org.apache.commons.lang3.Validate.isTrue(Validate.java:34)
	at org.apache.commons.lang3.reflect.FieldUtils.removeFinalModifier(FieldUtils.java:720)
	at org.apache.commons.lang3.reflect.FieldUtilsTest.testRemoveFinalModifierWithoutAccess(FieldUtilsTest.java:1340)

testRemoveFinalModifierAccessNotNeeded(org.apache.commons.lang3.reflect.FieldUtilsTest)  Time elapsed: 0 sec  <<< ERROR!
java.lang.IllegalArgumentException: The field must not be null
	at org.apache.commons.lang3.Validate.isTrue(Validate.java:34)
	at org.apache.commons.lang3.reflect.FieldUtils.removeFinalModifier(FieldUtils.java:720)
	at org.apache.commons.lang3.reflect.FieldUtilsTest.testRemoveFinalModifierAccessNotNeeded(FieldUtilsTest.java:1351)

testGetDeclaredField(org.apache.commons.lang3.reflect.FieldUtilsTest)  Time elapsed: 0.001 sec  <<< ERROR!
java.lang.IllegalArgumentException: The class must not be null
	at org.apache.commons.lang3.Validate.isTrue(Validate.java:34)
	at org.apache.commons.lang3.reflect.FieldUtils.getDeclaredField(FieldUtils.java:169)
	at org.apache.commons.lang3.reflect.FieldUtils.getDeclaredField(FieldUtils.java:149)
	at org.apache.commons.lang3.reflect.FieldUtilsTest.testGetDeclaredField(FieldUtilsTest.java:226)

testGetDeclaredFieldForceAccess(org.apache.commons.lang3.reflect.FieldUtilsTest)  Time elapsed: 0 sec  <<< ERROR!
java.lang.IllegalArgumentException: The class must not be null
	at org.apache.commons.lang3.Validate.isTrue(Validate.java:34)
	at org.apache.commons.lang3.reflect.FieldUtils.getDeclaredField(FieldUtils.java:169)
	at org.apache.commons.lang3.reflect.FieldUtilsTest.testGetDeclaredFieldForceAccess(FieldUtilsTest.java:265)

testReadFieldForceAccess(org.apache.commons.lang3.reflect.FieldUtilsTest)  Time elapsed: 0 sec  <<< ERROR!
java.lang.IllegalArgumentException: The class must not be null
	at org.apache.commons.lang3.Validate.isTrue(Validate.java:34)
	at org.apache.commons.lang3.reflect.FieldUtils.getDeclaredField(FieldUtils.java:169)
	at org.apache.commons.lang3.reflect.FieldUtils.getDeclaredField(FieldUtils.java:149)
	at org.apache.commons.lang3.reflect.FieldUtilsTest.testReadFieldForceAccess(FieldUtilsTest.java:508)

testReadNamedFieldForceAccess(org.apache.commons.lang3.reflect.FieldUtilsTest)  Time elapsed: 0 sec  <<< ERROR!
java.lang.IllegalArgumentException: target object must not be null
	at org.apache.commons.lang3.Validate.isTrue(Validate.java:34)
	at org.apache.commons.lang3.reflect.FieldUtils.readField(FieldUtils.java:466)
	at org.apache.commons.lang3.reflect.FieldUtilsTest.testReadNamedFieldForceAccess(FieldUtilsTest.java:614)

Running org.apache.commons.lang3.reflect.TypeLiteralTest
Tests run: 4, Failures: 0, Errors: 2, Skipped: 0, Time elapsed: 0.002 sec <<< FAILURE! - in org.apache.commons.lang3.reflect.TypeLiteralTest
testBasic(org.apache.commons.lang3.reflect.TypeLiteralTest)  Time elapsed: 0 sec  <<< ERROR!
java.lang.IllegalArgumentException: no owner allowed for top-level interface java.util.List
	at org.apache.commons.lang3.Validate.isTrue(Validate.java:34)
	at org.apache.commons.lang3.reflect.TypeUtils.parameterizeWithOwner(TypeUtils.java:1492)
	at org.apache.commons.lang3.reflect.TypeUtils.parameterize(TypeUtils.java:1459)
	at org.apache.commons.lang3.reflect.TypeLiteralTest.testBasic(TypeLiteralTest.java:32)

testTyped(org.apache.commons.lang3.reflect.TypeLiteralTest)  Time elapsed: 0 sec  <<< ERROR!
java.lang.IllegalArgumentException: no owner allowed for top-level interface java.util.List
	at org.apache.commons.lang3.Validate.isTrue(Validate.java:34)
	at org.apache.commons.lang3.reflect.TypeUtils.parameterizeWithOwner(TypeUtils.java:1492)
	at org.apache.commons.lang3.reflect.TypeUtils.parameterize(TypeUtils.java:1459)
	at org.apache.commons.lang3.reflect.TypeLiteralTest.testTyped(TypeLiteralTest.java:41)

Running org.apache.commons.lang3.reflect.TypeUtilsTest
Tests run: 19, Failures: 0, Errors: 3, Skipped: 0, Time elapsed: 0.044 sec <<< FAILURE! - in org.apache.commons.lang3.reflect.TypeUtilsTest
testParameterize(org.apache.commons.lang3.reflect.TypeUtilsTest)  Time elapsed: 0 sec  <<< ERROR!
java.lang.IllegalArgumentException: no owner allowed for top-level interface java.lang.Comparable
	at org.apache.commons.lang3.Validate.isTrue(Validate.java:34)
	at org.apache.commons.lang3.reflect.TypeUtils.parameterizeWithOwner(TypeUtils.java:1492)
	at org.apache.commons.lang3.reflect.TypeUtils.parameterize(TypeUtils.java:1459)
	at org.apache.commons.lang3.reflect.TypeUtilsTest.testParameterize(TypeUtilsTest.java:680)

testParameterizeWithOwner(org.apache.commons.lang3.reflect.TypeUtilsTest)  Time elapsed: 0 sec  <<< ERROR!
java.lang.IllegalArgumentException: no owner allowed for top-level class org.apache.commons.lang3.reflect.TypeUtilsTest
	at org.apache.commons.lang3.Validate.isTrue(Validate.java:34)
	at org.apache.commons.lang3.reflect.TypeUtils.parameterizeWithOwner(TypeUtils.java:1492)
	at org.apache.commons.lang3.reflect.TypeUtils.parameterize(TypeUtils.java:1459)
	at org.apache.commons.lang3.reflect.TypeUtilsTest.testParameterizeWithOwner(TypeUtilsTest.java:688)

testGenericArrayType(org.apache.commons.lang3.reflect.TypeUtilsTest)  Time elapsed: 0 sec  <<< ERROR!
java.lang.IllegalArgumentException: no owner allowed for top-level interface java.lang.Comparable
	at org.apache.commons.lang3.Validate.isTrue(Validate.java:34)
	at org.apache.commons.lang3.reflect.TypeUtils.parameterizeWithOwner(TypeUtils.java:1492)
	at org.apache.commons.lang3.reflect.TypeUtils.parameterize(TypeUtils.java:1459)
	at org.apache.commons.lang3.reflect.TypeUtilsTest.testGenericArrayType(TypeUtilsTest.java:728)

Running org.apache.commons.lang3.mutable.MutableByteTest
Tests run: 17, Failures: 0, Errors: 0, Skipped: 0, Time elapsed: 0.002 sec - in org.apache.commons.lang3.mutable.MutableByteTest
Running org.apache.commons.lang3.mutable.MutableShortTest
Tests run: 14, Failures: 0, Errors: 0, Skipped: 0, Time elapsed: 0.002 sec - in org.apache.commons.lang3.mutable.MutableShortTest
Running org.apache.commons.lang3.mutable.MutableIntTest
Tests run: 17, Failures: 0, Errors: 0, Skipped: 0, Time elapsed: 0.003 sec - in org.apache.commons.lang3.mutable.MutableIntTest
Running org.apache.commons.lang3.mutable.MutableDoubleTest
Tests run: 18, Failures: 0, Errors: 0, Skipped: 0, Time elapsed: 0.003 sec - in org.apache.commons.lang3.mutable.MutableDoubleTest
Running org.apache.commons.lang3.mutable.MutableFloatTest
Tests run: 18, Failures: 0, Errors: 0, Skipped: 0, Time elapsed: 0.005 sec - in org.apache.commons.lang3.mutable.MutableFloatTest
Running org.apache.commons.lang3.mutable.MutableLongTest
Tests run: 17, Failures: 0, Errors: 0, Skipped: 0, Time elapsed: 0.002 sec - in org.apache.commons.lang3.mutable.MutableLongTest
Running org.apache.commons.lang3.mutable.MutableBooleanTest
Tests run: 9, Failures: 0, Errors: 0, Skipped: 0, Time elapsed: 0.001 sec - in org.apache.commons.lang3.mutable.MutableBooleanTest
Running org.apache.commons.lang3.mutable.MutableObjectTest
Tests run: 5, Failures: 0, Errors: 0, Skipped: 0, Time elapsed: 0 sec - in org.apache.commons.lang3.mutable.MutableObjectTest
Running org.apache.commons.lang3.text.translate.UnicodeEscaperTest
Tests run: 3, Failures: 0, Errors: 0, Skipped: 0, Time elapsed: 0.001 sec - in org.apache.commons.lang3.text.translate.UnicodeEscaperTest
Running org.apache.commons.lang3.text.translate.EntityArraysTest
Tests run: 3, Failures: 0, Errors: 0, Skipped: 0, Time elapsed: 0 sec - in org.apache.commons.lang3.text.translate.EntityArraysTest
Running org.apache.commons.lang3.text.translate.UnicodeUnpairedSurrogateRemoverTest
Tests run: 2, Failures: 0, Errors: 0, Skipped: 0, Time elapsed: 0 sec - in org.apache.commons.lang3.text.translate.UnicodeUnpairedSurrogateRemoverTest
Running org.apache.commons.lang3.text.translate.NumericEntityUnescaperTest
Tests run: 3, Failures: 0, Errors: 0, Skipped: 0, Time elapsed: 0 sec - in org.apache.commons.lang3.text.translate.NumericEntityUnescaperTest
Running org.apache.commons.lang3.text.translate.NumericEntityEscaperTest
Tests run: 4, Failures: 0, Errors: 0, Skipped: 0, Time elapsed: 0 sec - in org.apache.commons.lang3.text.translate.NumericEntityEscaperTest
Running org.apache.commons.lang3.text.translate.LookupTranslatorTest
Tests run: 2, Failures: 0, Errors: 0, Skipped: 0, Time elapsed: 0 sec - in org.apache.commons.lang3.text.translate.LookupTranslatorTest
Running org.apache.commons.lang3.text.translate.UnicodeUnescaperTest
Tests run: 3, Failures: 0, Errors: 0, Skipped: 0, Time elapsed: 0 sec - in org.apache.commons.lang3.text.translate.UnicodeUnescaperTest
Running org.apache.commons.lang3.text.translate.OctalUnescaperTest
Tests run: 1, Failures: 0, Errors: 0, Skipped: 0, Time elapsed: 0 sec - in org.apache.commons.lang3.text.translate.OctalUnescaperTest
Running org.apache.commons.lang3.text.StrMatcherTest
Tests run: 14, Failures: 0, Errors: 0, Skipped: 0, Time elapsed: 0.002 sec - in org.apache.commons.lang3.text.StrMatcherTest
Running org.apache.commons.lang3.text.StrTokenizerTest
Tests run: 55, Failures: 0, Errors: 0, Skipped: 0, Time elapsed: 0.013 sec - in org.apache.commons.lang3.text.StrTokenizerTest
Running org.apache.commons.lang3.text.FormattableUtilsTest
Tests run: 5, Failures: 0, Errors: 5, Skipped: 0, Time elapsed: 0.002 sec <<< FAILURE! - in org.apache.commons.lang3.text.FormattableUtilsTest
testDefaultAppend(org.apache.commons.lang3.text.FormattableUtilsTest)  Time elapsed: 0 sec  <<< ERROR!
java.lang.IllegalArgumentException: Specified ellipsis 'null' exceeds precision of -1
	at org.apache.commons.lang3.Validate.isTrue(Validate.java:34)
	at org.apache.commons.lang3.text.FormattableUtils.append(FormattableUtils.java:136)
	at org.apache.commons.lang3.text.FormattableUtils.append(FormattableUtils.java:83)
	at org.apache.commons.lang3.text.FormattableUtilsTest.testDefaultAppend(FormattableUtilsTest.java:35)

testAlternatePadCharacter(org.apache.commons.lang3.text.FormattableUtilsTest)  Time elapsed: 0 sec  <<< ERROR!
java.lang.IllegalArgumentException: Specified ellipsis 'null' exceeds precision of -1
	at org.apache.commons.lang3.Validate.isTrue(Validate.java:34)
	at org.apache.commons.lang3.text.FormattableUtils.append(FormattableUtils.java:136)
	at org.apache.commons.lang3.text.FormattableUtils.append(FormattableUtils.java:100)
	at org.apache.commons.lang3.text.FormattableUtilsTest.testAlternatePadCharacter(FormattableUtilsTest.java:50)

testAlternatePadCharAndEllipsis(org.apache.commons.lang3.text.FormattableUtilsTest)  Time elapsed: 0 sec  <<< ERROR!
java.lang.IllegalArgumentException: Specified ellipsis '*' exceeds precision of -1
	at org.apache.commons.lang3.Validate.isTrue(Validate.java:34)
	at org.apache.commons.lang3.text.FormattableUtils.append(FormattableUtils.java:136)
	at org.apache.commons.lang3.text.FormattableUtilsTest.testAlternatePadCharAndEllipsis(FormattableUtilsTest.java:94)

testIllegalEllipsis(org.apache.commons.lang3.text.FormattableUtilsTest)  Time elapsed: 0.001 sec  <<< ERROR!
java.lang.Exception: Unexpected exception, expected<java.lang.IllegalArgumentException> but was<java.lang.StringIndexOutOfBoundsException>
	at java.lang.AbstractStringBuilder.replace(AbstractStringBuilder.java:789)
	at java.lang.StringBuilder.replace(StringBuilder.java:266)
	at org.apache.commons.lang3.text.FormattableUtils.append(FormattableUtils.java:141)
	at org.apache.commons.lang3.text.FormattableUtils.append(FormattableUtils.java:118)
	at org.apache.commons.lang3.text.FormattableUtilsTest.testIllegalEllipsis(FormattableUtilsTest.java:89)

testEllipsis(org.apache.commons.lang3.text.FormattableUtilsTest)  Time elapsed: 0 sec  <<< ERROR!
java.lang.IllegalArgumentException: Specified ellipsis '*' exceeds precision of -1
	at org.apache.commons.lang3.Validate.isTrue(Validate.java:34)
	at org.apache.commons.lang3.text.FormattableUtils.append(FormattableUtils.java:136)
	at org.apache.commons.lang3.text.FormattableUtils.append(FormattableUtils.java:118)
	at org.apache.commons.lang3.text.FormattableUtilsTest.testEllipsis(FormattableUtilsTest.java:64)

Running org.apache.commons.lang3.text.CompositeFormatTest
Tests run: 2, Failures: 0, Errors: 0, Skipped: 0, Time elapsed: 0 sec - in org.apache.commons.lang3.text.CompositeFormatTest
Running org.apache.commons.lang3.text.WordUtilsTest
Tests run: 12, Failures: 0, Errors: 0, Skipped: 0, Time elapsed: 0.002 sec - in org.apache.commons.lang3.text.WordUtilsTest
Running org.apache.commons.lang3.text.StrLookupTest
Tests run: 5, Failures: 0, Errors: 0, Skipped: 0, Time elapsed: 0.002 sec - in org.apache.commons.lang3.text.StrLookupTest
Running org.apache.commons.lang3.text.StrBuilderAppendInsertTest
Tests run: 51, Failures: 0, Errors: 0, Skipped: 0, Time elapsed: 0.01 sec - in org.apache.commons.lang3.text.StrBuilderAppendInsertTest
Running org.apache.commons.lang3.text.ExtendedMessageFormatTest
Tests run: 10, Failures: 0, Errors: 0, Skipped: 0, Time elapsed: 0.649 sec - in org.apache.commons.lang3.text.ExtendedMessageFormatTest
Running org.apache.commons.lang3.text.StrSubstitutorTest
Tests run: 40, Failures: 0, Errors: 0, Skipped: 0, Time elapsed: 0.019 sec - in org.apache.commons.lang3.text.StrSubstitutorTest
Running org.apache.commons.lang3.text.StrBuilderTest
Tests run: 90, Failures: 0, Errors: 0, Skipped: 0, Time elapsed: 0.031 sec - in org.apache.commons.lang3.text.StrBuilderTest
Running org.apache.commons.lang3.StringEscapeUtilsTest
Tests run: 28, Failures: 0, Errors: 0, Skipped: 0, Time elapsed: 0.463 sec - in org.apache.commons.lang3.StringEscapeUtilsTest
Running org.apache.commons.lang3.AnnotationUtilsTest
Tests run: 10, Failures: 0, Errors: 0, Skipped: 0, Time elapsed: 0.022 sec - in org.apache.commons.lang3.AnnotationUtilsTest
Running org.apache.commons.lang3.ConversionTest
Tests run: 42, Failures: 0, Errors: 0, Skipped: 0, Time elapsed: 0.013 sec - in org.apache.commons.lang3.ConversionTest
Running org.apache.commons.lang3.StringUtilsTrimEmptyTest
Tests run: 15, Failures: 0, Errors: 0, Skipped: 0, Time elapsed: 0.006 sec - in org.apache.commons.lang3.StringUtilsTrimEmptyTest
Running org.apache.commons.lang3.EnumUtilsTest
Tests run: 34, Failures: 0, Errors: 12, Skipped: 0, Time elapsed: 0.01 sec <<< FAILURE! - in org.apache.commons.lang3.EnumUtilsTest
test_generateBitVector(org.apache.commons.lang3.EnumUtilsTest)  Time elapsed: 0.001 sec  <<< ERROR!
java.lang.IllegalArgumentException: class org.apache.commons.lang3.Traffic does not seem to be an Enum type
	at org.apache.commons.lang3.Validate.isTrue(Validate.java:34)
	at org.apache.commons.lang3.EnumUtils.asEnum(EnumUtils.java:308)
	at org.apache.commons.lang3.EnumUtils.checkBitVectorable(EnumUtils.java:290)
	at org.apache.commons.lang3.EnumUtils.generateBitVector(EnumUtils.java:143)
	at org.apache.commons.lang3.EnumUtilsTest.test_generateBitVector(EnumUtilsTest.java:211)

test_generateBitVectorFromArray(org.apache.commons.lang3.EnumUtilsTest)  Time elapsed: 0 sec  <<< ERROR!
java.lang.IllegalArgumentException: class org.apache.commons.lang3.Traffic does not seem to be an Enum type
	at org.apache.commons.lang3.Validate.isTrue(Validate.java:34)
	at org.apache.commons.lang3.EnumUtils.asEnum(EnumUtils.java:308)
	at org.apache.commons.lang3.EnumUtils.checkBitVectorable(EnumUtils.java:290)
	at org.apache.commons.lang3.EnumUtils.generateBitVector(EnumUtils.java:143)
	at org.apache.commons.lang3.EnumUtils.generateBitVector(EnumUtils.java:204)
	at org.apache.commons.lang3.EnumUtilsTest.test_generateBitVectorFromArray(EnumUtilsTest.java:235)

test_generateBitVector_nullIterable(org.apache.commons.lang3.EnumUtilsTest)  Time elapsed: 0 sec  <<< ERROR!
java.lang.Exception: Unexpected exception, expected<java.lang.NullPointerException> but was<java.lang.IllegalArgumentException>
	at org.apache.commons.lang3.Validate.isTrue(Validate.java:34)
	at org.apache.commons.lang3.EnumUtils.asEnum(EnumUtils.java:308)
	at org.apache.commons.lang3.EnumUtils.checkBitVectorable(EnumUtils.java:290)
	at org.apache.commons.lang3.EnumUtils.generateBitVector(EnumUtils.java:143)
	at org.apache.commons.lang3.EnumUtilsTest.test_generateBitVector_nullIterable(EnumUtilsTest.java:109)

test_generateBitVectors_nonEnumClass(org.apache.commons.lang3.EnumUtilsTest)  Time elapsed: 0 sec  <<< ERROR!
java.lang.Exception: Unexpected exception, expected<java.lang.IllegalArgumentException> but was<java.lang.ClassCastException>
	at java.util.EnumSet.noneOf(EnumSet.java:110)
	at org.apache.commons.lang3.EnumUtils.generateBitVectors(EnumUtils.java:172)
	at org.apache.commons.lang3.EnumUtilsTest.test_generateBitVectors_nonEnumClass(EnumUtilsTest.java:188)

test_processBitVectors(org.apache.commons.lang3.EnumUtilsTest)  Time elapsed: 0 sec  <<< ERROR!
java.lang.IllegalArgumentException: class org.apache.commons.lang3.Traffic does not seem to be an Enum type
	at org.apache.commons.lang3.Validate.isTrue(Validate.java:34)
	at org.apache.commons.lang3.EnumUtils.asEnum(EnumUtils.java:308)
	at org.apache.commons.lang3.EnumUtils.processBitVectors(EnumUtils.java:268)
	at org.apache.commons.lang3.EnumUtilsTest.test_processBitVectors(EnumUtilsTest.java:291)

test_generateBitVector_nonEnumClass(org.apache.commons.lang3.EnumUtilsTest)  Time elapsed: 0 sec  <<< ERROR!
java.lang.Exception: Unexpected exception, expected<java.lang.IllegalArgumentException> but was<java.lang.NullPointerException>
	at org.apache.commons.lang3.EnumUtils.checkBitVectorable(EnumUtils.java:291)
	at org.apache.commons.lang3.EnumUtils.generateBitVector(EnumUtils.java:143)
	at org.apache.commons.lang3.EnumUtilsTest.test_generateBitVector_nonEnumClass(EnumUtilsTest.java:176)

test_generateBitVectorsFromArray(org.apache.commons.lang3.EnumUtilsTest)  Time elapsed: 0 sec  <<< ERROR!
java.lang.IllegalArgumentException: class org.apache.commons.lang3.Traffic does not seem to be an Enum type
	at org.apache.commons.lang3.Validate.isTrue(Validate.java:34)
	at org.apache.commons.lang3.EnumUtils.asEnum(EnumUtils.java:308)
	at org.apache.commons.lang3.EnumUtils.generateBitVectors(EnumUtils.java:224)
	at org.apache.commons.lang3.EnumUtilsTest.test_generateBitVectorsFromArray(EnumUtilsTest.java:249)

test_generateBitVectors_nonEnumClassWithArray(org.apache.commons.lang3.EnumUtilsTest)  Time elapsed: 0.001 sec  <<< ERROR!
java.lang.Exception: Unexpected exception, expected<java.lang.IllegalArgumentException> but was<java.lang.ClassCastException>
	at java.util.EnumSet.noneOf(EnumSet.java:110)
	at org.apache.commons.lang3.EnumUtils.generateBitVectors(EnumUtils.java:226)
	at org.apache.commons.lang3.EnumUtilsTest.test_generateBitVectors_nonEnumClassWithArray(EnumUtilsTest.java:206)

test_generateBitVector_nonEnumClassWithArray(org.apache.commons.lang3.EnumUtilsTest)  Time elapsed: 0 sec  <<< ERROR!
java.lang.Exception: Unexpected exception, expected<java.lang.IllegalArgumentException> but was<java.lang.NullPointerException>
	at org.apache.commons.lang3.EnumUtils.checkBitVectorable(EnumUtils.java:291)
	at org.apache.commons.lang3.EnumUtils.generateBitVector(EnumUtils.java:143)
	at org.apache.commons.lang3.EnumUtils.generateBitVector(EnumUtils.java:204)
	at org.apache.commons.lang3.EnumUtilsTest.test_generateBitVector_nonEnumClassWithArray(EnumUtilsTest.java:197)

test_processBitVector(org.apache.commons.lang3.EnumUtilsTest)  Time elapsed: 0 sec  <<< ERROR!
java.lang.IllegalArgumentException: class org.apache.commons.lang3.Traffic does not seem to be an Enum type
	at org.apache.commons.lang3.Validate.isTrue(Validate.java:34)
	at org.apache.commons.lang3.EnumUtils.asEnum(EnumUtils.java:308)
	at org.apache.commons.lang3.EnumUtils.checkBitVectorable(EnumUtils.java:290)
	at org.apache.commons.lang3.EnumUtils.processBitVector(EnumUtils.java:250)
	at org.apache.commons.lang3.EnumUtilsTest.test_processBitVector(EnumUtilsTest.java:279)

test_generateBitVectors(org.apache.commons.lang3.EnumUtilsTest)  Time elapsed: 0 sec  <<< ERROR!
java.lang.IllegalArgumentException: class org.apache.commons.lang3.Traffic does not seem to be an Enum type
	at org.apache.commons.lang3.Validate.isTrue(Validate.java:34)
	at org.apache.commons.lang3.EnumUtils.asEnum(EnumUtils.java:308)
	at org.apache.commons.lang3.EnumUtils.generateBitVectors(EnumUtils.java:170)
	at org.apache.commons.lang3.EnumUtilsTest.test_generateBitVectors(EnumUtilsTest.java:223)

test_generateBitVectors_nullArray(org.apache.commons.lang3.EnumUtilsTest)  Time elapsed: 0 sec  <<< ERROR!
java.lang.Exception: Unexpected exception, expected<java.lang.NullPointerException> but was<java.lang.IllegalArgumentException>
	at org.apache.commons.lang3.Validate.isTrue(Validate.java:34)
	at org.apache.commons.lang3.EnumUtils.asEnum(EnumUtils.java:308)
	at org.apache.commons.lang3.EnumUtils.generateBitVectors(EnumUtils.java:224)
	at org.apache.commons.lang3.EnumUtilsTest.test_generateBitVectors_nullArray(EnumUtilsTest.java:144)

Running org.apache.commons.lang3.exception.ExceptionUtilsTest
Tests run: 28, Failures: 0, Errors: 0, Skipped: 0, Time elapsed: 0.022 sec - in org.apache.commons.lang3.exception.ExceptionUtilsTest
Running org.apache.commons.lang3.exception.DefaultExceptionContextTest
Tests run: 8, Failures: 0, Errors: 0, Skipped: 0, Time elapsed: 0.004 sec - in org.apache.commons.lang3.exception.DefaultExceptionContextTest
Running org.apache.commons.lang3.exception.ContextedExceptionTest
Tests run: 14, Failures: 0, Errors: 0, Skipped: 0, Time elapsed: 0.009 sec - in org.apache.commons.lang3.exception.ContextedExceptionTest
Running org.apache.commons.lang3.exception.ContextedRuntimeExceptionTest
Tests run: 14, Failures: 0, Errors: 0, Skipped: 0, Time elapsed: 0.01 sec - in org.apache.commons.lang3.exception.ContextedRuntimeExceptionTest
Running org.apache.commons.lang3.BitFieldTest
Tests run: 15, Failures: 0, Errors: 0, Skipped: 0, Time elapsed: 0.002 sec - in org.apache.commons.lang3.BitFieldTest
Running org.apache.commons.lang3.ArrayUtilsRemoveMultipleTest
Tests run: 55, Failures: 0, Errors: 0, Skipped: 0, Time elapsed: 0.011 sec - in org.apache.commons.lang3.ArrayUtilsRemoveMultipleTest
Running org.apache.commons.lang3.HashSetvBitSetTest
Ratio=243% array=100 count=1 extract=11718563 bitset=28575901
Ratio=1247% array=100 count=10 extract=2457427 bitset=30644723
Ratio=7% array=100 count=50 extract=6923540 bitset=550213
Ratio=4% array=100 count=100 extract=9753764 bitset=436404
Ratio=80% array=1000 count=10 extract=5932360 bitset=4756372
Ratio=33% array=1000 count=100 extract=14747269 bitset=5006325
Ratio=7% array=1000 count=500 extract=44308855 bitset=3155596
Ratio=1% array=1000 count=1000 extract=69640681 bitset=812451
Ratio=101% count=0 hash=2459312 bits=2506006
Ratio=5% count=5 hash=3692728 bits=210619
Ratio=10% count=10 hash=2733870 bits=297271
Ratio=23% count=200 hash=18071430 bits=4235874
Ratio=18% count=50 hash=5678902 bits=1024607
Ratio=26% count=100 hash=8607527 bits=2276983
Ratio=22% count=1000 hash=71950777 bits=16068948
Ratio=20% count=2000 hash=150561349 bits=31566386
Tests run: 2, Failures: 0, Errors: 0, Skipped: 0, Time elapsed: 0.642 sec - in org.apache.commons.lang3.HashSetvBitSetTest
Running org.apache.commons.lang3.StringUtilsTest
Tests run: 124, Failures: 0, Errors: 0, Skipped: 0, Time elapsed: 0.163 sec - in org.apache.commons.lang3.StringUtilsTest
Running org.apache.commons.lang3.ArrayUtilsRemoveTest
Tests run: 19, Failures: 0, Errors: 0, Skipped: 0, Time elapsed: 0 sec - in org.apache.commons.lang3.ArrayUtilsRemoveTest
Running org.apache.commons.lang3.ObjectUtilsTest
Tests run: 36, Failures: 0, Errors: 0, Skipped: 0, Time elapsed: 0.008 sec - in org.apache.commons.lang3.ObjectUtilsTest
Running org.apache.commons.lang3.ClassPathUtilsTest
Tests run: 13, Failures: 0, Errors: 0, Skipped: 0, Time elapsed: 0.002 sec - in org.apache.commons.lang3.ClassPathUtilsTest
Running org.apache.commons.lang3.math.NumberUtilsTest
Tests run: 91, Failures: 0, Errors: 25, Skipped: 0, Time elapsed: 0.028 sec <<< FAILURE! - in org.apache.commons.lang3.math.NumberUtilsTest
testMinDouble_emptyArray(org.apache.commons.lang3.math.NumberUtilsTest)  Time elapsed: 0 sec  <<< ERROR!
java.lang.Exception: Unexpected exception, expected<java.lang.IllegalArgumentException> but was<java.lang.ArrayIndexOutOfBoundsException>
	at org.apache.commons.lang3.math.NumberUtils.min(NumberUtils.java:920)
	at org.apache.commons.lang3.math.NumberUtilsTest.testMinDouble_emptyArray(NumberUtilsTest.java:605)

testMaxByte_emptyArray(org.apache.commons.lang3.math.NumberUtilsTest)  Time elapsed: 0 sec  <<< ERROR!
java.lang.Exception: Unexpected exception, expected<java.lang.IllegalArgumentException> but was<java.lang.ArrayIndexOutOfBoundsException>
	at org.apache.commons.lang3.math.NumberUtils.max(NumberUtils.java:1049)
	at org.apache.commons.lang3.math.NumberUtilsTest.testMaxByte_emptyArray(NumberUtilsTest.java:761)

testMinShort_emptyArray(org.apache.commons.lang3.math.NumberUtilsTest)  Time elapsed: 0 sec  <<< ERROR!
java.lang.Exception: Unexpected exception, expected<java.lang.IllegalArgumentException> but was<java.lang.ArrayIndexOutOfBoundsException>
	at org.apache.commons.lang3.math.NumberUtils.min(NumberUtils.java:871)
	at org.apache.commons.lang3.math.NumberUtilsTest.testMinShort_emptyArray(NumberUtilsTest.java:553)

testMaxShort_emptyArray(org.apache.commons.lang3.math.NumberUtilsTest)  Time elapsed: 0 sec  <<< ERROR!
java.lang.Exception: Unexpected exception, expected<java.lang.IllegalArgumentException> but was<java.lang.ArrayIndexOutOfBoundsException>
	at org.apache.commons.lang3.math.NumberUtils.max(NumberUtils.java:1025)
	at org.apache.commons.lang3.math.NumberUtilsTest.testMaxShort_emptyArray(NumberUtilsTest.java:731)

testMaxDouble_emptyArray(org.apache.commons.lang3.math.NumberUtilsTest)  Time elapsed: 0 sec  <<< ERROR!
java.lang.Exception: Unexpected exception, expected<java.lang.IllegalArgumentException> but was<java.lang.ArrayIndexOutOfBoundsException>
	at org.apache.commons.lang3.math.NumberUtils.max(NumberUtils.java:1074)
	at org.apache.commons.lang3.math.NumberUtilsTest.testMaxDouble_emptyArray(NumberUtilsTest.java:791)

testMaxInt_emptyArray(org.apache.commons.lang3.math.NumberUtilsTest)  Time elapsed: 0.001 sec  <<< ERROR!
java.lang.Exception: Unexpected exception, expected<java.lang.IllegalArgumentException> but was<java.lang.ArrayIndexOutOfBoundsException>
	at org.apache.commons.lang3.math.NumberUtils.max(NumberUtils.java:1001)
	at org.apache.commons.lang3.math.NumberUtilsTest.testMaxInt_emptyArray(NumberUtilsTest.java:701)

testMaxLong_emptyArray(org.apache.commons.lang3.math.NumberUtilsTest)  Time elapsed: 0 sec  <<< ERROR!
java.lang.Exception: Unexpected exception, expected<java.lang.IllegalArgumentException> but was<java.lang.ArrayIndexOutOfBoundsException>
	at org.apache.commons.lang3.math.NumberUtils.max(NumberUtils.java:977)
	at org.apache.commons.lang3.math.NumberUtilsTest.testMaxLong_emptyArray(NumberUtilsTest.java:671)

testMinFloat_emptyArray(org.apache.commons.lang3.math.NumberUtilsTest)  Time elapsed: 0 sec  <<< ERROR!
java.lang.Exception: Unexpected exception, expected<java.lang.IllegalArgumentException> but was<java.lang.ArrayIndexOutOfBoundsException>
	at org.apache.commons.lang3.math.NumberUtils.min(NumberUtils.java:948)
	at org.apache.commons.lang3.math.NumberUtilsTest.testMinFloat_emptyArray(NumberUtilsTest.java:638)

testMinFloat(org.apache.commons.lang3.math.NumberUtilsTest)  Time elapsed: 0 sec  <<< ERROR!
java.lang.IllegalArgumentException: Array cannot be empty.
	at org.apache.commons.lang3.Validate.isTrue(Validate.java:34)
	at org.apache.commons.lang3.math.NumberUtils.validateArray(NumberUtils.java:1125)
	at org.apache.commons.lang3.math.NumberUtils.min(NumberUtils.java:945)
	at org.apache.commons.lang3.math.NumberUtilsTest.testMinFloat(NumberUtilsTest.java:643)

testMaxFloat_emptyArray(org.apache.commons.lang3.math.NumberUtilsTest)  Time elapsed: 0.001 sec  <<< ERROR!
java.lang.Exception: Unexpected exception, expected<java.lang.IllegalArgumentException> but was<java.lang.ArrayIndexOutOfBoundsException>
	at org.apache.commons.lang3.math.NumberUtils.max(NumberUtils.java:1102)
	at org.apache.commons.lang3.math.NumberUtilsTest.testMaxFloat_emptyArray(NumberUtilsTest.java:835)

testMinShort(org.apache.commons.lang3.math.NumberUtilsTest)  Time elapsed: 0 sec  <<< ERROR!
java.lang.IllegalArgumentException: Array cannot be empty.
	at org.apache.commons.lang3.Validate.isTrue(Validate.java:34)
	at org.apache.commons.lang3.math.NumberUtils.validateArray(NumberUtils.java:1125)
	at org.apache.commons.lang3.math.NumberUtils.min(NumberUtils.java:868)
	at org.apache.commons.lang3.math.NumberUtilsTest.testMinShort(NumberUtilsTest.java:558)

testLang381(org.apache.commons.lang3.math.NumberUtilsTest)  Time elapsed: 0.001 sec  <<< ERROR!
java.lang.IllegalArgumentException: Array cannot be empty.
	at org.apache.commons.lang3.Validate.isTrue(Validate.java:34)
	at org.apache.commons.lang3.math.NumberUtils.validateArray(NumberUtils.java:1125)
	at org.apache.commons.lang3.math.NumberUtils.max(NumberUtils.java:1071)
	at org.apache.commons.lang3.math.NumberUtilsTest.testLang381(NumberUtilsTest.java:1364)

testMaxDouble(org.apache.commons.lang3.math.NumberUtilsTest)  Time elapsed: 0 sec  <<< ERROR!
java.lang.ArrayIndexOutOfBoundsException: 0
	at org.apache.commons.lang3.math.NumberUtils.max(NumberUtils.java:1074)
	at org.apache.commons.lang3.math.NumberUtilsTest.testMaxDouble(NumberUtilsTest.java:803)

testMinDouble(org.apache.commons.lang3.math.NumberUtilsTest)  Time elapsed: 0.001 sec  <<< ERROR!
java.lang.IllegalArgumentException: Array cannot be empty.
	at org.apache.commons.lang3.Validate.isTrue(Validate.java:34)
	at org.apache.commons.lang3.math.NumberUtils.validateArray(NumberUtils.java:1125)
	at org.apache.commons.lang3.math.NumberUtils.min(NumberUtils.java:917)
	at org.apache.commons.lang3.math.NumberUtilsTest.testMinDouble(NumberUtilsTest.java:610)

testMaxByte(org.apache.commons.lang3.math.NumberUtilsTest)  Time elapsed: 0 sec  <<< ERROR!
java.lang.IllegalArgumentException: Array cannot be empty.
	at org.apache.commons.lang3.Validate.isTrue(Validate.java:34)
	at org.apache.commons.lang3.math.NumberUtils.validateArray(NumberUtils.java:1125)
	at org.apache.commons.lang3.math.NumberUtils.max(NumberUtils.java:1046)
	at org.apache.commons.lang3.math.NumberUtilsTest.testMaxByte(NumberUtilsTest.java:766)

testMaxLong(org.apache.commons.lang3.math.NumberUtilsTest)  Time elapsed: 0 sec  <<< ERROR!
java.lang.IllegalArgumentException: Array cannot be empty.
	at org.apache.commons.lang3.Validate.isTrue(Validate.java:34)
	at org.apache.commons.lang3.math.NumberUtils.validateArray(NumberUtils.java:1125)
	at org.apache.commons.lang3.math.NumberUtils.max(NumberUtils.java:974)
	at org.apache.commons.lang3.math.NumberUtilsTest.testMaxLong(NumberUtilsTest.java:676)

testMinByte(org.apache.commons.lang3.math.NumberUtilsTest)  Time elapsed: 0 sec  <<< ERROR!
java.lang.IllegalArgumentException: Array cannot be empty.
	at org.apache.commons.lang3.Validate.isTrue(Validate.java:34)
	at org.apache.commons.lang3.math.NumberUtils.validateArray(NumberUtils.java:1125)
	at org.apache.commons.lang3.math.NumberUtils.min(NumberUtils.java:892)
	at org.apache.commons.lang3.math.NumberUtilsTest.testMinByte(NumberUtilsTest.java:584)

testMinLong(org.apache.commons.lang3.math.NumberUtilsTest)  Time elapsed: 0.001 sec  <<< ERROR!
java.lang.IllegalArgumentException: Array cannot be empty.
	at org.apache.commons.lang3.Validate.isTrue(Validate.java:34)
	at org.apache.commons.lang3.math.NumberUtils.validateArray(NumberUtils.java:1125)
	at org.apache.commons.lang3.math.NumberUtils.min(NumberUtils.java:820)
	at org.apache.commons.lang3.math.NumberUtilsTest.testMinLong(NumberUtilsTest.java:506)

testMaxFloat(org.apache.commons.lang3.math.NumberUtilsTest)  Time elapsed: 0 sec  <<< ERROR!
java.lang.IllegalArgumentException: Array cannot be empty.
	at org.apache.commons.lang3.Validate.isTrue(Validate.java:34)
	at org.apache.commons.lang3.math.NumberUtils.validateArray(NumberUtils.java:1125)
	at org.apache.commons.lang3.math.NumberUtils.max(NumberUtils.java:1099)
	at org.apache.commons.lang3.math.NumberUtilsTest.testMaxFloat(NumberUtilsTest.java:840)

testMaxShort(org.apache.commons.lang3.math.NumberUtilsTest)  Time elapsed: 0 sec  <<< ERROR!
java.lang.IllegalArgumentException: Array cannot be empty.
	at org.apache.commons.lang3.Validate.isTrue(Validate.java:34)
	at org.apache.commons.lang3.math.NumberUtils.validateArray(NumberUtils.java:1125)
	at org.apache.commons.lang3.math.NumberUtils.max(NumberUtils.java:1022)
	at org.apache.commons.lang3.math.NumberUtilsTest.testMaxShort(NumberUtilsTest.java:736)

testMinInt_emptyArray(org.apache.commons.lang3.math.NumberUtilsTest)  Time elapsed: 0 sec  <<< ERROR!
java.lang.Exception: Unexpected exception, expected<java.lang.IllegalArgumentException> but was<java.lang.ArrayIndexOutOfBoundsException>
	at org.apache.commons.lang3.math.NumberUtils.min(NumberUtils.java:847)
	at org.apache.commons.lang3.math.NumberUtilsTest.testMinInt_emptyArray(NumberUtilsTest.java:527)

testMinByte_emptyArray(org.apache.commons.lang3.math.NumberUtilsTest)  Time elapsed: 0 sec  <<< ERROR!
java.lang.Exception: Unexpected exception, expected<java.lang.IllegalArgumentException> but was<java.lang.ArrayIndexOutOfBoundsException>
	at org.apache.commons.lang3.math.NumberUtils.min(NumberUtils.java:895)
	at org.apache.commons.lang3.math.NumberUtilsTest.testMinByte_emptyArray(NumberUtilsTest.java:579)

testMaxInt(org.apache.commons.lang3.math.NumberUtilsTest)  Time elapsed: 0 sec  <<< ERROR!
java.lang.IllegalArgumentException: Array cannot be empty.
	at org.apache.commons.lang3.Validate.isTrue(Validate.java:34)
	at org.apache.commons.lang3.math.NumberUtils.validateArray(NumberUtils.java:1125)
	at org.apache.commons.lang3.math.NumberUtils.max(NumberUtils.java:998)
	at org.apache.commons.lang3.math.NumberUtilsTest.testMaxInt(NumberUtilsTest.java:706)

testMinInt(org.apache.commons.lang3.math.NumberUtilsTest)  Time elapsed: 0 sec  <<< ERROR!
java.lang.IllegalArgumentException: Array cannot be empty.
	at org.apache.commons.lang3.Validate.isTrue(Validate.java:34)
	at org.apache.commons.lang3.math.NumberUtils.validateArray(NumberUtils.java:1125)
	at org.apache.commons.lang3.math.NumberUtils.min(NumberUtils.java:844)
	at org.apache.commons.lang3.math.NumberUtilsTest.testMinInt(NumberUtilsTest.java:532)

testMinLong_emptyArray(org.apache.commons.lang3.math.NumberUtilsTest)  Time elapsed: 0 sec  <<< ERROR!
java.lang.Exception: Unexpected exception, expected<java.lang.IllegalArgumentException> but was<java.lang.ArrayIndexOutOfBoundsException>
	at org.apache.commons.lang3.math.NumberUtils.min(NumberUtils.java:823)
	at org.apache.commons.lang3.math.NumberUtilsTest.testMinLong_emptyArray(NumberUtilsTest.java:501)

Running org.apache.commons.lang3.math.IEEE754rUtilsTest
Tests run: 3, Failures: 0, Errors: 2, Skipped: 0, Time elapsed: 0 sec <<< FAILURE! - in org.apache.commons.lang3.math.IEEE754rUtilsTest
testLang381(org.apache.commons.lang3.math.IEEE754rUtilsTest)  Time elapsed: 0 sec  <<< ERROR!
java.lang.IllegalArgumentException: Array cannot be empty.
	at org.apache.commons.lang3.Validate.isTrue(Validate.java:34)
	at org.apache.commons.lang3.math.IEEE754rUtils.max(IEEE754rUtils.java:164)
	at org.apache.commons.lang3.math.IEEE754rUtilsTest.testLang381(IEEE754rUtilsTest.java:42)

testEnforceExceptions(org.apache.commons.lang3.math.IEEE754rUtilsTest)  Time elapsed: 0 sec  <<< ERROR!
java.lang.ArrayIndexOutOfBoundsException: 0
	at org.apache.commons.lang3.math.IEEE754rUtils.min(IEEE754rUtils.java:74)
	at org.apache.commons.lang3.math.IEEE754rUtilsTest.testEnforceExceptions(IEEE754rUtilsTest.java:66)

Running org.apache.commons.lang3.math.FractionTest
Tests run: 25, Failures: 0, Errors: 0, Skipped: 0, Time elapsed: 0.3 sec - in org.apache.commons.lang3.math.FractionTest
Running org.apache.commons.lang3.BooleanUtilsTest
Tests run: 72, Failures: 0, Errors: 0, Skipped: 0, Time elapsed: 0.009 sec - in org.apache.commons.lang3.BooleanUtilsTest
Running org.apache.commons.lang3.CharSequenceUtilsTest
Tests run: 2, Failures: 0, Errors: 0, Skipped: 0, Time elapsed: 0 sec - in org.apache.commons.lang3.CharSequenceUtilsTest
Running org.apache.commons.lang3.CharSetUtilsTest
Tests run: 11, Failures: 0, Errors: 0, Skipped: 0, Time elapsed: 0 sec - in org.apache.commons.lang3.CharSetUtilsTest
Running org.apache.commons.lang3.ArrayUtilsAddTest
Tests run: 13, Failures: 0, Errors: 0, Skipped: 0, Time elapsed: 0.007 sec - in org.apache.commons.lang3.ArrayUtilsAddTest
Running org.apache.commons.lang3.CharEncodingTest
Tests run: 6, Failures: 0, Errors: 0, Skipped: 0, Time elapsed: 0.015 sec - in org.apache.commons.lang3.CharEncodingTest
Running org.apache.commons.lang3.ClassUtilsTest
Tests run: 57, Failures: 0, Errors: 0, Skipped: 0, Time elapsed: 0.02 sec - in org.apache.commons.lang3.ClassUtilsTest
Running org.apache.commons.lang3.RangeTest
Tests run: 24, Failures: 0, Errors: 0, Skipped: 0, Time elapsed: 0.005 sec - in org.apache.commons.lang3.RangeTest
Running org.apache.commons.lang3.event.EventUtilsTest
Tests run: 8, Failures: 0, Errors: 6, Skipped: 0, Time elapsed: 0.005 sec <<< FAILURE! - in org.apache.commons.lang3.event.EventUtilsTest
testAddEventListenerWithNoAddMethod(org.apache.commons.lang3.event.EventUtilsTest)  Time elapsed: 0 sec  <<< ERROR!
java.lang.IllegalArgumentException: Class {0} is not an interface
	at org.apache.commons.lang3.Validate.isTrue(Validate.java:34)
	at org.apache.commons.lang3.event.EventListenerSupport.<init>(EventListenerSupport.java:146)
	at org.apache.commons.lang3.event.EventListenerSupport.<init>(EventListenerSupport.java:126)
	at org.apache.commons.lang3.event.EventListenerSupport.create(EventListenerSupport.java:110)
	at org.apache.commons.lang3.event.EventUtilsTest$PropertyChangeSource.<init>(EventUtilsTest.java:255)
	at org.apache.commons.lang3.event.EventUtilsTest.testAddEventListenerWithNoAddMethod(EventUtilsTest.java:74)

testAddEventListener(org.apache.commons.lang3.event.EventUtilsTest)  Time elapsed: 0 sec  <<< ERROR!
java.lang.IllegalArgumentException: Class {0} is not an interface
	at org.apache.commons.lang3.Validate.isTrue(Validate.java:34)
	at org.apache.commons.lang3.event.EventListenerSupport.<init>(EventListenerSupport.java:146)
	at org.apache.commons.lang3.event.EventListenerSupport.<init>(EventListenerSupport.java:126)
	at org.apache.commons.lang3.event.EventListenerSupport.create(EventListenerSupport.java:110)
	at org.apache.commons.lang3.event.EventUtilsTest$PropertyChangeSource.<init>(EventUtilsTest.java:255)
	at org.apache.commons.lang3.event.EventUtilsTest.testAddEventListener(EventUtilsTest.java:61)

testBindEventsToMethod(org.apache.commons.lang3.event.EventUtilsTest)  Time elapsed: 0 sec  <<< ERROR!
java.lang.IllegalArgumentException: Class {0} is not an interface
	at org.apache.commons.lang3.Validate.isTrue(Validate.java:34)
	at org.apache.commons.lang3.event.EventListenerSupport.<init>(EventListenerSupport.java:146)
	at org.apache.commons.lang3.event.EventListenerSupport.<init>(EventListenerSupport.java:126)
	at org.apache.commons.lang3.event.EventListenerSupport.create(EventListenerSupport.java:110)
	at org.apache.commons.lang3.event.EventUtilsTest$PropertyChangeSource.<init>(EventUtilsTest.java:255)
	at org.apache.commons.lang3.event.EventUtilsTest.testBindEventsToMethod(EventUtilsTest.java:130)

testAddEventListenerWithPrivateAddMethod(org.apache.commons.lang3.event.EventUtilsTest)  Time elapsed: 0.001 sec  <<< ERROR!
java.lang.IllegalArgumentException: Class {0} is not an interface
	at org.apache.commons.lang3.Validate.isTrue(Validate.java:34)
	at org.apache.commons.lang3.event.EventListenerSupport.<init>(EventListenerSupport.java:146)
	at org.apache.commons.lang3.event.EventListenerSupport.<init>(EventListenerSupport.java:126)
	at org.apache.commons.lang3.event.EventListenerSupport.create(EventListenerSupport.java:110)
	at org.apache.commons.lang3.event.EventUtilsTest$PropertyChangeSource.<init>(EventUtilsTest.java:255)
	at org.apache.commons.lang3.event.EventUtilsTest.testAddEventListenerWithPrivateAddMethod(EventUtilsTest.java:113)

testBindFilteredEventsToMethod(org.apache.commons.lang3.event.EventUtilsTest)  Time elapsed: 0.001 sec  <<< ERROR!
java.lang.IllegalArgumentException: Class {0} is not an interface
	at org.apache.commons.lang3.Validate.isTrue(Validate.java:34)
	at org.apache.commons.lang3.event.EventListenerSupport.<init>(EventListenerSupport.java:146)
	at org.apache.commons.lang3.event.EventListenerSupport.<init>(EventListenerSupport.java:126)
	at org.apache.commons.lang3.event.EventListenerSupport.create(EventListenerSupport.java:110)
	at org.apache.commons.lang3.event.EventUtilsTest$MultipleEventSource.<init>(EventUtilsTest.java:237)
	at org.apache.commons.lang3.event.EventUtilsTest.testBindFilteredEventsToMethod(EventUtilsTest.java:154)

testBindEventsToMethodWithEvent(org.apache.commons.lang3.event.EventUtilsTest)  Time elapsed: 0 sec  <<< ERROR!
java.lang.IllegalArgumentException: Class {0} is not an interface
	at org.apache.commons.lang3.Validate.isTrue(Validate.java:34)
	at org.apache.commons.lang3.event.EventListenerSupport.<init>(EventListenerSupport.java:146)
	at org.apache.commons.lang3.event.EventListenerSupport.<init>(EventListenerSupport.java:126)
	at org.apache.commons.lang3.event.EventListenerSupport.create(EventListenerSupport.java:110)
	at org.apache.commons.lang3.event.EventUtilsTest$PropertyChangeSource.<init>(EventUtilsTest.java:255)
	at org.apache.commons.lang3.event.EventUtilsTest.testBindEventsToMethodWithEvent(EventUtilsTest.java:142)

Running org.apache.commons.lang3.event.EventListenerSupportTest
Tests run: 9, Failures: 0, Errors: 7, Skipped: 0, Time elapsed: 0.003 sec <<< FAILURE! - in org.apache.commons.lang3.event.EventListenerSupportTest
testRemoveNullListener(org.apache.commons.lang3.event.EventListenerSupportTest)  Time elapsed: 0 sec  <<< ERROR!
java.lang.Exception: Unexpected exception, expected<java.lang.NullPointerException> but was<java.lang.IllegalArgumentException>
	at org.apache.commons.lang3.Validate.isTrue(Validate.java:34)
	at org.apache.commons.lang3.event.EventListenerSupport.<init>(EventListenerSupport.java:146)
	at org.apache.commons.lang3.event.EventListenerSupport.<init>(EventListenerSupport.java:126)
	at org.apache.commons.lang3.event.EventListenerSupport.create(EventListenerSupport.java:110)
	at org.apache.commons.lang3.event.EventListenerSupportTest.testRemoveNullListener(EventListenerSupportTest.java:55)

testRemoveListenerDuringEvent(org.apache.commons.lang3.event.EventListenerSupportTest)  Time elapsed: 0 sec  <<< ERROR!
java.lang.IllegalArgumentException: Class {0} is not an interface
	at org.apache.commons.lang3.Validate.isTrue(Validate.java:34)
	at org.apache.commons.lang3.event.EventListenerSupport.<init>(EventListenerSupport.java:146)
	at org.apache.commons.lang3.event.EventListenerSupport.<init>(EventListenerSupport.java:126)
	at org.apache.commons.lang3.event.EventListenerSupport.create(EventListenerSupport.java:110)
	at org.apache.commons.lang3.event.EventListenerSupportTest.testRemoveListenerDuringEvent(EventListenerSupportTest.java:90)

testSerialization(org.apache.commons.lang3.event.EventListenerSupportTest)  Time elapsed: 0 sec  <<< ERROR!
java.lang.IllegalArgumentException: Class {0} is not an interface
	at org.apache.commons.lang3.Validate.isTrue(Validate.java:34)
	at org.apache.commons.lang3.event.EventListenerSupport.<init>(EventListenerSupport.java:146)
	at org.apache.commons.lang3.event.EventListenerSupport.<init>(EventListenerSupport.java:126)
	at org.apache.commons.lang3.event.EventListenerSupport.create(EventListenerSupport.java:110)
	at org.apache.commons.lang3.event.EventListenerSupportTest.testSerialization(EventListenerSupportTest.java:125)

testAddNullListener(org.apache.commons.lang3.event.EventListenerSupportTest)  Time elapsed: 0.001 sec  <<< ERROR!
java.lang.Exception: Unexpected exception, expected<java.lang.NullPointerException> but was<java.lang.IllegalArgumentException>
	at org.apache.commons.lang3.Validate.isTrue(Validate.java:34)
	at org.apache.commons.lang3.event.EventListenerSupport.<init>(EventListenerSupport.java:146)
	at org.apache.commons.lang3.event.EventListenerSupport.<init>(EventListenerSupport.java:126)
	at org.apache.commons.lang3.event.EventListenerSupport.create(EventListenerSupport.java:110)
	at org.apache.commons.lang3.event.EventListenerSupportTest.testAddNullListener(EventListenerSupportTest.java:48)

testGetListeners(org.apache.commons.lang3.event.EventListenerSupportTest)  Time elapsed: 0 sec  <<< ERROR!
java.lang.IllegalArgumentException: Class {0} is not an interface
	at org.apache.commons.lang3.Validate.isTrue(Validate.java:34)
	at org.apache.commons.lang3.event.EventListenerSupport.<init>(EventListenerSupport.java:146)
	at org.apache.commons.lang3.event.EventListenerSupport.<init>(EventListenerSupport.java:126)
	at org.apache.commons.lang3.event.EventListenerSupport.create(EventListenerSupport.java:110)
	at org.apache.commons.lang3.event.EventListenerSupportTest.testGetListeners(EventListenerSupportTest.java:102)

testEventDispatchOrder(org.apache.commons.lang3.event.EventListenerSupportTest)  Time elapsed: 0 sec  <<< ERROR!
java.lang.IllegalArgumentException: Class {0} is not an interface
	at org.apache.commons.lang3.Validate.isTrue(Validate.java:34)
	at org.apache.commons.lang3.event.EventListenerSupport.<init>(EventListenerSupport.java:146)
	at org.apache.commons.lang3.event.EventListenerSupport.<init>(EventListenerSupport.java:126)
	at org.apache.commons.lang3.event.EventListenerSupport.create(EventListenerSupport.java:110)
	at org.apache.commons.lang3.event.EventListenerSupportTest.testEventDispatchOrder(EventListenerSupportTest.java:62)

testSubclassInvocationHandling(org.apache.commons.lang3.event.EventListenerSupportTest)  Time elapsed: 0.001 sec  <<< ERROR!
java.lang.IllegalArgumentException: Class {0} is not an interface
	at org.apache.commons.lang3.Validate.isTrue(Validate.java:34)
	at org.apache.commons.lang3.event.EventListenerSupport.<init>(EventListenerSupport.java:146)
	at org.apache.commons.lang3.event.EventListenerSupport.<init>(EventListenerSupport.java:126)
	at org.apache.commons.lang3.event.EventListenerSupportTest$2.<init>(EventListenerSupportTest.java:170)
	at org.apache.commons.lang3.event.EventListenerSupportTest.testSubclassInvocationHandling(EventListenerSupportTest.java:169)

Running org.apache.commons.lang3.ArrayUtilsTest
Tests run: 205, Failures: 0, Errors: 0, Skipped: 0, Time elapsed: 0.035 sec - in org.apache.commons.lang3.ArrayUtilsTest
Running org.apache.commons.lang3.CharUtilsTest
Tests run: 24, Failures: 0, Errors: 0, Skipped: 0, Time elapsed: 0.002 sec - in org.apache.commons.lang3.CharUtilsTest
Running org.apache.commons.lang3.NotImplementedExceptionTest
Tests run: 1, Failures: 0, Errors: 0, Skipped: 0, Time elapsed: 0 sec - in org.apache.commons.lang3.NotImplementedExceptionTest
Running org.apache.commons.lang3.StringUtilsEqualsIndexOfTest
Tests run: 50, Failures: 0, Errors: 0, Skipped: 0, Time elapsed: 0.004 sec - in org.apache.commons.lang3.StringUtilsEqualsIndexOfTest
Running org.apache.commons.lang3.RandomUtilsTest
Tests run: 23, Failures: 0, Errors: 15, Skipped: 0, Time elapsed: 0.015 sec <<< FAILURE! - in org.apache.commons.lang3.RandomUtilsTest
testExtremeRangeLong(org.apache.commons.lang3.RandomUtilsTest)  Time elapsed: 0 sec  <<< ERROR!
java.lang.IllegalArgumentException: Start value must be smaller or equal to end value.
	at org.apache.commons.lang3.Validate.isTrue(Validate.java:34)
	at org.apache.commons.lang3.RandomUtils.nextLong(RandomUtils.java:111)
	at org.apache.commons.lang3.RandomUtilsTest.testExtremeRangeLong(RandomUtilsTest.java:183)

testZeroLengthNextBytes(org.apache.commons.lang3.RandomUtilsTest)  Time elapsed: 0 sec  <<< ERROR!
java.lang.IllegalArgumentException: Count cannot be negative.
	at org.apache.commons.lang3.Validate.isTrue(Validate.java:34)
	at org.apache.commons.lang3.RandomUtils.nextBytes(RandomUtils.java:63)
	at org.apache.commons.lang3.RandomUtilsTest.testZeroLengthNextBytes(RandomUtilsTest.java:88)

testNextDoubleMinimalRange(org.apache.commons.lang3.RandomUtilsTest)  Time elapsed: 0 sec  <<< ERROR!
java.lang.IllegalArgumentException: Start value must be smaller or equal to end value.
	at org.apache.commons.lang3.Validate.isTrue(Validate.java:34)
	at org.apache.commons.lang3.RandomUtils.nextDouble(RandomUtils.java:138)
	at org.apache.commons.lang3.RandomUtilsTest.testNextDoubleMinimalRange(RandomUtilsTest.java:122)

testExtremeRangeDouble(org.apache.commons.lang3.RandomUtilsTest)  Time elapsed: 0 sec  <<< ERROR!
java.lang.IllegalArgumentException: Start value must be smaller or equal to end value.
	at org.apache.commons.lang3.Validate.isTrue(Validate.java:34)
	at org.apache.commons.lang3.RandomUtils.nextDouble(RandomUtils.java:138)
	at org.apache.commons.lang3.RandomUtilsTest.testExtremeRangeDouble(RandomUtilsTest.java:201)

testExtremeRangeInt(org.apache.commons.lang3.RandomUtilsTest)  Time elapsed: 0 sec  <<< ERROR!
java.lang.IllegalArgumentException: Start value must be smaller or equal to end value.
	at org.apache.commons.lang3.Validate.isTrue(Validate.java:34)
	at org.apache.commons.lang3.RandomUtils.nextInt(RandomUtils.java:85)
	at org.apache.commons.lang3.RandomUtilsTest.testExtremeRangeInt(RandomUtilsTest.java:174)

testNextLongMinimalRange(org.apache.commons.lang3.RandomUtilsTest)  Time elapsed: 0 sec  <<< ERROR!
java.lang.IllegalArgumentException: Start value must be smaller or equal to end value.
	at org.apache.commons.lang3.Validate.isTrue(Validate.java:34)
	at org.apache.commons.lang3.RandomUtils.nextLong(RandomUtils.java:111)
	at org.apache.commons.lang3.RandomUtilsTest.testNextLongMinimalRange(RandomUtilsTest.java:156)

testNextFloatMinimalRange(org.apache.commons.lang3.RandomUtilsTest)  Time elapsed: 0 sec  <<< ERROR!
java.lang.IllegalArgumentException: Start value must be smaller or equal to end value.
	at org.apache.commons.lang3.Validate.isTrue(Validate.java:34)
	at org.apache.commons.lang3.RandomUtils.nextFloat(RandomUtils.java:164)
	at org.apache.commons.lang3.RandomUtilsTest.testNextFloatMinimalRange(RandomUtilsTest.java:130)

testNextInt(org.apache.commons.lang3.RandomUtilsTest)  Time elapsed: 0 sec  <<< ERROR!
java.lang.IllegalArgumentException: Start value must be smaller or equal to end value.
	at org.apache.commons.lang3.Validate.isTrue(Validate.java:34)
	at org.apache.commons.lang3.RandomUtils.nextInt(RandomUtils.java:85)
	at org.apache.commons.lang3.RandomUtilsTest.testNextInt(RandomUtilsTest.java:113)

testNextBytesNegative(org.apache.commons.lang3.RandomUtilsTest)  Time elapsed: 0 sec  <<< ERROR!
java.lang.Exception: Unexpected exception, expected<java.lang.IllegalArgumentException> but was<java.lang.NegativeArraySizeException>
	at org.apache.commons.lang3.RandomUtils.nextBytes(RandomUtils.java:65)
	at org.apache.commons.lang3.RandomUtilsTest.testNextBytesNegative(RandomUtilsTest.java:40)

testNextBytes(org.apache.commons.lang3.RandomUtilsTest)  Time elapsed: 0 sec  <<< ERROR!
java.lang.IllegalArgumentException: Count cannot be negative.
	at org.apache.commons.lang3.Validate.isTrue(Validate.java:34)
	at org.apache.commons.lang3.RandomUtils.nextBytes(RandomUtils.java:63)
	at org.apache.commons.lang3.RandomUtilsTest.testNextBytes(RandomUtilsTest.java:96)

testNextFloat(org.apache.commons.lang3.RandomUtilsTest)  Time elapsed: 0 sec  <<< ERROR!
java.lang.IllegalArgumentException: Start value must be smaller or equal to end value.
	at org.apache.commons.lang3.Validate.isTrue(Validate.java:34)
	at org.apache.commons.lang3.RandomUtils.nextFloat(RandomUtils.java:164)
	at org.apache.commons.lang3.RandomUtilsTest.testNextFloat(RandomUtilsTest.java:147)

testNextDouble(org.apache.commons.lang3.RandomUtilsTest)  Time elapsed: 0 sec  <<< ERROR!
java.lang.IllegalArgumentException: Start value must be smaller or equal to end value.
	at org.apache.commons.lang3.Validate.isTrue(Validate.java:34)
	at org.apache.commons.lang3.RandomUtils.nextDouble(RandomUtils.java:138)
	at org.apache.commons.lang3.RandomUtilsTest.testNextDouble(RandomUtilsTest.java:138)

testNextIntMinimalRange(org.apache.commons.lang3.RandomUtilsTest)  Time elapsed: 0 sec  <<< ERROR!
java.lang.IllegalArgumentException: Start value must be smaller or equal to end value.
	at org.apache.commons.lang3.Validate.isTrue(Validate.java:34)
	at org.apache.commons.lang3.RandomUtils.nextInt(RandomUtils.java:85)
	at org.apache.commons.lang3.RandomUtilsTest.testNextIntMinimalRange(RandomUtilsTest.java:105)

testExtremeRangeFloat(org.apache.commons.lang3.RandomUtilsTest)  Time elapsed: 0.001 sec  <<< ERROR!
java.lang.IllegalArgumentException: Start value must be smaller or equal to end value.
	at org.apache.commons.lang3.Validate.isTrue(Validate.java:34)
	at org.apache.commons.lang3.RandomUtils.nextFloat(RandomUtils.java:164)
	at org.apache.commons.lang3.RandomUtilsTest.testExtremeRangeFloat(RandomUtilsTest.java:192)

testNextLong(org.apache.commons.lang3.RandomUtilsTest)  Time elapsed: 0 sec  <<< ERROR!
java.lang.IllegalArgumentException: Start value must be smaller or equal to end value.
	at org.apache.commons.lang3.Validate.isTrue(Validate.java:34)
	at org.apache.commons.lang3.RandomUtils.nextLong(RandomUtils.java:111)
	at org.apache.commons.lang3.RandomUtilsTest.testNextLong(RandomUtilsTest.java:164)


Results :

Failed tests: 
  HashCodeBuilderTest.testConstructorExEvenNegative Expected exception: java.lang.IllegalArgumentException
  HashCodeBuilderTest.testConstructorExZero Expected exception: java.lang.IllegalArgumentException
  HashCodeBuilderTest.testReflectionHashCodeEx1 Expected exception: java.lang.IllegalArgumentException
  HashCodeBuilderTest.testReflectionHashCodeEx2 Expected exception: java.lang.IllegalArgumentException
  HashCodeBuilderTest.testReflectionHierarchyHashCodeEx1 Expected exception: java.lang.IllegalArgumentException
  HashCodeBuilderTest.testReflectionHierarchyHashCodeEx2 Expected exception: java.lang.IllegalArgumentException
  BackgroundInitializerTest.testGetInterruptedException:246 No interrupted exception
  ConcurrentUtilsTest.testConcurrentExceptionCauseError Expected exception: java.lang.IllegalArgumentException
  ConcurrentUtilsTest.testConcurrentExceptionCauseNull Expected exception: java.lang.IllegalArgumentException
  ConcurrentUtilsTest.testConcurrentExceptionCauseUnchecked Expected exception: java.lang.IllegalArgumentException
  ConcurrentUtilsTest.testConcurrentRuntimeExceptionCauseError Expected exception: java.lang.IllegalArgumentException
  ConcurrentUtilsTest.testConcurrentRuntimeExceptionCauseNull Expected exception: java.lang.IllegalArgumentException
  ConcurrentUtilsTest.testConcurrentRuntimeExceptionCauseUnchecked Expected exception: java.lang.IllegalArgumentException
  FieldUtilsTest.testGetFieldsListWithAnnotationIllegalArgumentException3 Expected exception: java.lang.IllegalArgumentException
  FieldUtilsTest.testGetFieldsWithAnnotationIllegalArgumentException3 Expected exception: java.lang.IllegalArgumentException
  DurationFormatUtilsTest.testFormatPeriodISOStartGreaterEnd Expected exception: java.lang.IllegalArgumentException
  DurationFormatUtilsTest.testFormatPeriodeStartGreaterEnd Expected exception: java.lang.IllegalArgumentException

Tests in error: 
  EnumUtilsTest.test_generateBitVector:211 » IllegalArgument class org.apache.co...
  EnumUtilsTest.test_generateBitVectorFromArray:235 » IllegalArgument class org....
  EnumUtilsTest.test_generateBitVector_nonEnumClass »  Unexpected exception, exp...
  EnumUtilsTest.test_generateBitVector_nonEnumClassWithArray »  Unexpected excep...
  EnumUtilsTest.test_generateBitVector_nullIterable »  Unexpected exception, exp...
  EnumUtilsTest.test_generateBitVectors:223 » IllegalArgument class org.apache.c...
  EnumUtilsTest.test_generateBitVectorsFromArray:249 » IllegalArgument class org...
  EnumUtilsTest.test_generateBitVectors_nonEnumClass »  Unexpected exception, ex...
  EnumUtilsTest.test_generateBitVectors_nonEnumClassWithArray »  Unexpected exce...
  EnumUtilsTest.test_generateBitVectors_nullArray »  Unexpected exception, expec...
  EnumUtilsTest.test_processBitVector:279 » IllegalArgument class org.apache.com...
  EnumUtilsTest.test_processBitVectors:291 » IllegalArgument class org.apache.co...
  RandomUtilsTest.testExtremeRangeDouble:201 » IllegalArgument Start value must ...
  RandomUtilsTest.testExtremeRangeFloat:192 » IllegalArgument Start value must b...
  RandomUtilsTest.testExtremeRangeInt:174 » IllegalArgument Start value must be ...
  RandomUtilsTest.testExtremeRangeLong:183 » IllegalArgument Start value must be...
  RandomUtilsTest.testNextBytes:96 » IllegalArgument Count cannot be negative.
  RandomUtilsTest.testNextBytesNegative »  Unexpected exception, expected<java.l...
  RandomUtilsTest.testNextDouble:138 » IllegalArgument Start value must be small...
  RandomUtilsTest.testNextDoubleMinimalRange:122 » IllegalArgument Start value m...
  RandomUtilsTest.testNextFloat:147 » IllegalArgument Start value must be smalle...
  RandomUtilsTest.testNextFloatMinimalRange:130 » IllegalArgument Start value mu...
  RandomUtilsTest.testNextInt:113 » IllegalArgument Start value must be smaller ...
  RandomUtilsTest.testNextIntMinimalRange:105 » IllegalArgument Start value must...
  RandomUtilsTest.testNextLong:164 » IllegalArgument Start value must be smaller...
  RandomUtilsTest.testNextLongMinimalRange:156 » IllegalArgument Start value mus...
  RandomUtilsTest.testZeroLengthNextBytes:88 » IllegalArgument Count cannot be n...
  ValidateTest.testIsTrue2:62 » IllegalArgument MSG
  HashCodeBuilderAndEqualsBuilderTest.testFixture:52->testFixture:61->assertEqualsAndHashCodeContract:87 » IllegalArgument
  HashCodeBuilderAndEqualsBuilderTest.testFixtureWithTransients:57->testFixture:61->assertEqualsAndHashCodeContract:87 » IllegalArgument
  HashCodeBuilderAndEqualsBuilderTest.testInteger:42->testInteger:37->assertEqualsAndHashCodeContract:87 » IllegalArgument
  HashCodeBuilderAndEqualsBuilderTest.testIntegerWithTransients:47->testInteger:37->assertEqualsAndHashCodeContract:87 » IllegalArgument
  HashCodeBuilderTest.testBoolean:262 » IllegalArgument HashCodeBuilder requires...
  HashCodeBuilderTest.testBooleanArray:454 » IllegalArgument HashCodeBuilder req...
  HashCodeBuilderTest.testBooleanArrayAsObject:466 » IllegalArgument HashCodeBui...
  HashCodeBuilderTest.testBooleanMultiArray:476 » IllegalArgument HashCodeBuilde...
  HashCodeBuilderTest.testByte:238 » IllegalArgument HashCodeBuilder requires an...
  HashCodeBuilderTest.testByteArray:379 » IllegalArgument HashCodeBuilder requir...
  HashCodeBuilderTest.testByteArrayAsObject:391 » IllegalArgument HashCodeBuilde...
  HashCodeBuilderTest.testChar:232 » IllegalArgument HashCodeBuilder requires an...
  HashCodeBuilderTest.testCharArray:358 » IllegalArgument HashCodeBuilder requir...
  HashCodeBuilderTest.testCharArrayAsObject:370 » IllegalArgument HashCodeBuilde...
  HashCodeBuilderTest.testDouble:245 » IllegalArgument HashCodeBuilder requires ...
  HashCodeBuilderTest.testDoubleArray:400 » IllegalArgument HashCodeBuilder requ...
  HashCodeBuilderTest.testDoubleArrayAsObject:416 » IllegalArgument HashCodeBuil...
  HashCodeBuilderTest.testFloat:254 » IllegalArgument HashCodeBuilder requires a...
  HashCodeBuilderTest.testFloatArray:429 » IllegalArgument HashCodeBuilder requi...
  HashCodeBuilderTest.testFloatArrayAsObject:443 » IllegalArgument HashCodeBuild...
  HashCodeBuilderTest.testInt:220 » IllegalArgument HashCodeBuilder requires an ...
  HashCodeBuilderTest.testIntArray:316 » IllegalArgument HashCodeBuilder require...
  HashCodeBuilderTest.testIntArrayAsObject:328 » IllegalArgument HashCodeBuilder...
  HashCodeBuilderTest.testLong:212 » IllegalArgument HashCodeBuilder requires an...
  HashCodeBuilderTest.testLongArray:291 » IllegalArgument HashCodeBuilder requir...
  HashCodeBuilderTest.testLongArrayAsObject:305 » IllegalArgument HashCodeBuilde...
  HashCodeBuilderTest.testObject:196 » IllegalArgument HashCodeBuilder requires ...
  HashCodeBuilderTest.testObjectArray:268 » IllegalArgument HashCodeBuilder requ...
  HashCodeBuilderTest.testObjectArrayAsObject:281 » IllegalArgument HashCodeBuil...
  HashCodeBuilderTest.testObjectBuild:204 » IllegalArgument HashCodeBuilder requ...
  HashCodeBuilderTest.testReflectionHashCode:147 » IllegalArgument HashCodeBuild...
  HashCodeBuilderTest.testReflectionHashCodeExcludeFields:493 » IllegalArgument ...
  HashCodeBuilderTest.testReflectionHierarchyHashCode:153 » IllegalArgument Hash...
  HashCodeBuilderTest.testReflectionObjectCycle:552 » IllegalArgument HashCodeBu...
  HashCodeBuilderTest.testShort:226 » IllegalArgument HashCodeBuilder requires a...
  HashCodeBuilderTest.testShortArray:337 » IllegalArgument HashCodeBuilder requi...
  HashCodeBuilderTest.testShortArrayAsObject:349 » IllegalArgument HashCodeBuild...
  HashCodeBuilderTest.testSuper:189 » IllegalArgument HashCodeBuilder requires a...
  HashCodeBuilderTest.testToHashCodeEqualsHashCode:563 » IllegalArgument HashCod...
  BackgroundInitializerTest.testGetCheckedException:205 » IllegalArgument Not a ...
  ConcurrentUtilsTest.testCreateIfAbsentUncheckedException:572 » IllegalArgument
  ConcurrentUtilsTest.testExtractCauseChecked:140 » IllegalArgument Not a checke...
  ConcurrentUtilsTest.testExtractCauseUncheckedChecked:196 » IllegalArgument Not...
  ConcurrentUtilsTest.testHandleCauseChecked:240 » IllegalArgument Not a checked...
  ConcurrentUtilsTest.testHandleCauseUncheckedChecked:295 » IllegalArgument Not ...
  ConcurrentUtilsTest.testInitializeUncheckedEx:383 » IllegalArgument Not a chec...
  MultiBackgroundInitializerTest.testInitializeEx » IllegalArgument Not a checke...
  MultiBackgroundInitializerTest.testInitializeResultsIsSuccessfulFalse » IllegalArgument
  EventListenerSupportTest.testAddNullListener »  Unexpected exception, expected...
  EventListenerSupportTest.testEventDispatchOrder:62 » IllegalArgument Class {0}...
  EventListenerSupportTest.testGetListeners:102 » IllegalArgument Class {0} is n...
  EventListenerSupportTest.testRemoveListenerDuringEvent:90 » IllegalArgument Cl...
  EventListenerSupportTest.testRemoveNullListener »  Unexpected exception, expec...
  EventListenerSupportTest.testSerialization:125 » IllegalArgument Class {0} is ...
  EventListenerSupportTest.testSubclassInvocationHandling:169 » IllegalArgument ...
  EventUtilsTest.testAddEventListener:61 » IllegalArgument Class {0} is not an i...
  EventUtilsTest.testAddEventListenerWithNoAddMethod:74 » IllegalArgument Class ...
  EventUtilsTest.testAddEventListenerWithPrivateAddMethod:113 » IllegalArgument ...
  EventUtilsTest.testBindEventsToMethod:130 » IllegalArgument Class {0} is not a...
  EventUtilsTest.testBindEventsToMethodWithEvent:142 » IllegalArgument Class {0}...
  EventUtilsTest.testBindFilteredEventsToMethod:154 » IllegalArgument Class {0} ...
  IEEE754rUtilsTest.testEnforceExceptions:66 » ArrayIndexOutOfBounds 0
  IEEE754rUtilsTest.testLang381:42 » IllegalArgument Array cannot be empty.
  NumberUtilsTest.testLang381:1364 » IllegalArgument Array cannot be empty.
  NumberUtilsTest.testMaxByte:766 » IllegalArgument Array cannot be empty.
  NumberUtilsTest.testMaxByte_emptyArray »  Unexpected exception, expected<java....
  NumberUtilsTest.testMaxDouble:803 » ArrayIndexOutOfBounds 0
  NumberUtilsTest.testMaxDouble_emptyArray »  Unexpected exception, expected<jav...
  NumberUtilsTest.testMaxFloat:840 » IllegalArgument Array cannot be empty.
  NumberUtilsTest.testMaxFloat_emptyArray »  Unexpected exception, expected<java...
  NumberUtilsTest.testMaxInt:706 » IllegalArgument Array cannot be empty.
  NumberUtilsTest.testMaxInt_emptyArray »  Unexpected exception, expected<java.l...
  NumberUtilsTest.testMaxLong:676 » IllegalArgument Array cannot be empty.
  NumberUtilsTest.testMaxLong_emptyArray »  Unexpected exception, expected<java....
  NumberUtilsTest.testMaxShort:736 » IllegalArgument Array cannot be empty.
  NumberUtilsTest.testMaxShort_emptyArray »  Unexpected exception, expected<java...
  NumberUtilsTest.testMinByte:584 » IllegalArgument Array cannot be empty.
  NumberUtilsTest.testMinByte_emptyArray »  Unexpected exception, expected<java....
  NumberUtilsTest.testMinDouble:610 » IllegalArgument Array cannot be empty.
  NumberUtilsTest.testMinDouble_emptyArray »  Unexpected exception, expected<jav...
  NumberUtilsTest.testMinFloat:643 » IllegalArgument Array cannot be empty.
  NumberUtilsTest.testMinFloat_emptyArray »  Unexpected exception, expected<java...
  NumberUtilsTest.testMinInt:532 » IllegalArgument Array cannot be empty.
  NumberUtilsTest.testMinInt_emptyArray »  Unexpected exception, expected<java.l...
  NumberUtilsTest.testMinLong:506 » IllegalArgument Array cannot be empty.
  NumberUtilsTest.testMinLong_emptyArray »  Unexpected exception, expected<java....
  NumberUtilsTest.testMinShort:558 » IllegalArgument Array cannot be empty.
  NumberUtilsTest.testMinShort_emptyArray »  Unexpected exception, expected<java...
  FieldUtilsTest.testGetAllFields:151 » IllegalArgument The class must not be nu...
  FieldUtilsTest.testGetAllFieldsList:161 » IllegalArgument The class must not b...
  FieldUtilsTest.testGetDeclaredField:226 » IllegalArgument The class must not b...
  FieldUtilsTest.testGetDeclaredFieldForceAccess:265 » IllegalArgument The class...
  FieldUtilsTest.testGetField:73 » IllegalArgument The class must not be null
  FieldUtilsTest.testGetFieldForceAccess:112 » IllegalArgument The class must no...
  FieldUtilsTest.testGetFieldsListWithAnnotation:198 » IllegalArgument The annot...
  FieldUtilsTest.testGetFieldsWithAnnotation:173 » IllegalArgument The annotatio...
  FieldUtilsTest.testReadDeclaredNamedField:680 » NullPointer
  FieldUtilsTest.testReadDeclaredNamedFieldForceAccess:764 » NullPointer
  FieldUtilsTest.testReadDeclaredNamedStaticField:440 » IllegalArgument The clas...
  FieldUtilsTest.testReadDeclaredNamedStaticFieldForceAccess:463 » IllegalArgument
  FieldUtilsTest.testReadField:481 » IllegalArgument The class must not be null
  FieldUtilsTest.testReadFieldForceAccess:508 » IllegalArgument The class must n...
  FieldUtilsTest.testReadNamedField:539 » IllegalArgument target object must not...
  FieldUtilsTest.testReadNamedFieldForceAccess:614 » IllegalArgument target obje...
  FieldUtilsTest.testReadNamedStaticField:340 » IllegalArgument The class must n...
  FieldUtilsTest.testReadNamedStaticFieldForceAccess:390 » IllegalArgument The c...
  FieldUtilsTest.testReadStaticField:304 » IllegalArgument The class must not be...
  FieldUtilsTest.testReadStaticFieldForceAccess:322 » IllegalArgument The class ...
  FieldUtilsTest.testReadStaticFieldForceAccessIllegalArgumentException1 »  Unex...
  FieldUtilsTest.testReadStaticFieldIllegalArgumentException1 »  Unexpected exce...
  FieldUtilsTest.testRemoveFinalModifier:1318 » IllegalArgument The field must n...
  FieldUtilsTest.testRemoveFinalModifierAccessNotNeeded:1351 » IllegalArgument T...
  FieldUtilsTest.testRemoveFinalModifierWithAccess:1329 » IllegalArgument The fi...
  FieldUtilsTest.testRemoveFinalModifierWithoutAccess:1340 » IllegalArgument The...
  FieldUtilsTest.testWriteDeclaredNamedField:1227 » IllegalArgument target objec...
  FieldUtilsTest.testWriteDeclaredNamedFieldForceAccess:1289 » IllegalArgument t...
  FieldUtilsTest.testWriteDeclaredNamedStaticField:990 » IllegalArgument The cla...
  FieldUtilsTest.testWriteDeclaredNamedStaticFieldForceAccess:1038 » IllegalArgument
  FieldUtilsTest.testWriteField:1075 » IllegalArgument The field must not be nul...
  FieldUtilsTest.testWriteFieldForceAccess:1103 » IllegalArgument The field must...
  FieldUtilsTest.testWriteNamedField:1118 » IllegalArgument target object must n...
  FieldUtilsTest.testWriteNamedFieldForceAccess:1172 » IllegalArgument target ob...
  FieldUtilsTest.testWriteNamedStaticField:906 » IllegalArgument The class must ...
  FieldUtilsTest.testWriteNamedStaticFieldForceAccess:954 » IllegalArgument The ...
  FieldUtilsTest.testWriteStaticField:807 » IllegalArgument The field must not b...
  FieldUtilsTest.testWriteStaticFieldForceAccess:863 » IllegalArgument The field...
  MethodUtilsTest.testGetMethodsListWithAnnotation:465 » IllegalArgument The cla...
  MethodUtilsTest.testGetMethodsListWithAnnotationIllegalArgumentException3 »  U...
  MethodUtilsTest.testGetMethodsWithAnnotation:439 » IllegalArgument The class m...
  MethodUtilsTest.testGetMethodsWithAnnotationIllegalArgumentException3 »  Unexp...
  TypeLiteralTest.testBasic:32 » IllegalArgument no owner allowed for top-level ...
  TypeLiteralTest.testTyped:41 » IllegalArgument no owner allowed for top-level ...
  TypeUtilsTest.testGenericArrayType:728 » IllegalArgument no owner allowed for ...
  TypeUtilsTest.testParameterize:680 » IllegalArgument no owner allowed for top-...
  TypeUtilsTest.testParameterizeWithOwner:688 » IllegalArgument no owner allowed...
  FormattableUtilsTest.testAlternatePadCharAndEllipsis:94 » IllegalArgument Spec...
  FormattableUtilsTest.testAlternatePadCharacter:50 » IllegalArgument Specified ...
  FormattableUtilsTest.testDefaultAppend:35 » IllegalArgument Specified ellipsis...
  FormattableUtilsTest.testEllipsis:64 » IllegalArgument Specified ellipsis '*' ...
  FormattableUtilsTest.testIllegalEllipsis »  Unexpected exception, expected<jav...
  DurationFormatUtilsTest.testBugzilla38401:412->assertEqualDuration:612->assertEqualDuration:623 » IllegalArgument
  DurationFormatUtilsTest.testDurationsByBruteForce:568->bruteForce:606->assertEqualDuration:623 » IllegalArgument
  DurationFormatUtilsTest.testEdgeDurations:456->assertEqualDuration:612->assertEqualDuration:623 » IllegalArgument
  DurationFormatUtilsTest.testFormatPeriod:304 » IllegalArgument startMillis mus...
  DurationFormatUtilsTest.testFormatPeriodISO:272 » IllegalArgument startMillis ...
  DurationFormatUtilsTest.testFormatPeriodISOMethod:292 » IllegalArgument startM...
  DurationFormatUtilsTest.testJiraLang281:419->assertEqualDuration:612->assertEqualDuration:623 » IllegalArgument
  DurationFormatUtilsTest.testLANG815:432 » IllegalArgument startMillis must not...
  DurationFormatUtilsTest.testLowDurations:441->assertEqualDuration:612->assertEqualDuration:623 » IllegalArgument


Tests run: 3526, Failures: 17, Errors: 177, Skipped: 97

[INFO] ------------------------------------------------------------------------
[INFO] BUILD FAILURE
[INFO] ------------------------------------------------------------------------
[INFO] Total time: 34.731s
[INFO] Finished at: Tue Aug 04 03:10:18 BST 2015
[INFO] Final Memory: 23M/413M
[INFO] ------------------------------------------------------------------------
[ERROR] Failed to execute goal org.apache.maven.plugins:maven-surefire-plugin:2.18:test (default-test) on project commons-lang3: There are test failures.
[ERROR] 
[ERROR] Please refer to /home/perham/Study/LittleDarwin/Cases/commons-lang3-3.4-src/target/surefire-reports for the individual test results.
[ERROR] -> [Help 1]
[ERROR] 
[ERROR] To see the full stack trace of the errors, re-run Maven with the -e switch.
[ERROR] Re-run Maven using the -X switch to enable full debug logging.
[ERROR] 
[ERROR] For more information about the errors and possible solutions, please read the following articles:
[ERROR] [Help 1] http://cwiki.apache.org/confluence/display/MAVEN/MojoFailureException
