[INFO] Scanning for projects...
[INFO]                                                                         
[INFO] ------------------------------------------------------------------------
[INFO] Building Apache Commons Lang 3.4
[INFO] ------------------------------------------------------------------------
[INFO] 
[INFO] --- maven-enforcer-plugin:1.3.1:enforce (enforce-maven-3) @ commons-lang3 ---
[INFO] 
[INFO] --- build-helper-maven-plugin:1.8:parse-version (parse-version) @ commons-lang3 ---
[INFO] 
[INFO] --- maven-antrun-plugin:1.8:run (javadoc.resources) @ commons-lang3 ---
[INFO] Executing tasks

main:
[INFO] Executed tasks
[INFO] 
[INFO] --- maven-remote-resources-plugin:1.5:process (default) @ commons-lang3 ---
[INFO] 
[INFO] --- buildnumber-maven-plugin:1.3:create (default) @ commons-lang3 ---
[INFO] Executing: /bin/sh -c cd /home/perham/Study/LittleDarwin/Cases/commons-lang3-3.4-src && svn --non-interactive info
[INFO] Working directory: /home/perham/Study/LittleDarwin/Cases/commons-lang3-3.4-src
[INFO] Storing buildNumber: ?????? at timestamp: 1438654114395
[INFO] Executing: /bin/sh -c cd /home/perham/Study/LittleDarwin/Cases/commons-lang3-3.4-src && svn --non-interactive info
[INFO] Working directory: /home/perham/Study/LittleDarwin/Cases/commons-lang3-3.4-src
[INFO] Storing buildScmBranch: UNKNOWN_BRANCH
[INFO] 
[INFO] --- maven-resources-plugin:2.7:resources (default-resources) @ commons-lang3 ---
[INFO] Using 'ISO-8859-1' encoding to copy filtered resources.
[INFO] Copying 0 resource
[INFO] Copying 2 resources to META-INF
[INFO] 
[INFO] --- maven-compiler-plugin:3.2:compile (default-compile) @ commons-lang3 ---
[INFO] Changes detected - recompiling the module!
[INFO] Compiling 133 source files to /home/perham/Study/LittleDarwin/Cases/commons-lang3-3.4-src/target/classes
[INFO] /home/perham/Study/LittleDarwin/Cases/commons-lang3-3.4-src/src/main/java/org/apache/commons/lang3/SerializationUtils.java: /home/perham/Study/LittleDarwin/Cases/commons-lang3-3.4-src/src/main/java/org/apache/commons/lang3/SerializationUtils.java uses unchecked or unsafe operations.
[INFO] /home/perham/Study/LittleDarwin/Cases/commons-lang3-3.4-src/src/main/java/org/apache/commons/lang3/SerializationUtils.java: Recompile with -Xlint:unchecked for details.
[INFO] 
[INFO] --- maven-bundle-plugin:2.5.3:manifest (bundle-manifest) @ commons-lang3 ---
[INFO] 
[INFO] --- animal-sniffer-maven-plugin:1.13:check (checkAPIcompatibility) @ commons-lang3 ---
[INFO] Checking unresolved references to org.codehaus.mojo.signature:java16:1.0
[INFO] 
[INFO] --- maven-resources-plugin:2.7:testResources (default-testResources) @ commons-lang3 ---
[INFO] Using 'ISO-8859-1' encoding to copy filtered resources.
[INFO] Copying 2 resources
[INFO] Copying 2 resources to META-INF
[INFO] 
[INFO] --- maven-compiler-plugin:3.2:testCompile (default-testCompile) @ commons-lang3 ---
[INFO] Nothing to compile - all classes are up to date
[INFO] 
[INFO] --- maven-surefire-plugin:2.18:test (default-test) @ commons-lang3 ---
[INFO] Surefire report directory: /home/perham/Study/LittleDarwin/Cases/commons-lang3-3.4-src/target/surefire-reports

-------------------------------------------------------
 T E S T S
-------------------------------------------------------
Running org.apache.commons.lang3.ValidateTest
Tests run: 63, Failures: 0, Errors: 12, Skipped: 0, Time elapsed: 0.037 sec <<< FAILURE! - in org.apache.commons.lang3.ValidateTest
testNotNull1(org.apache.commons.lang3.ValidateTest)  Time elapsed: 0.003 sec  <<< ERROR!
java.lang.NullPointerException: The validated object is null
	at org.apache.commons.lang3.Validate.notNull(Validate.java:37)
	at org.apache.commons.lang3.Validate.notNull(Validate.java:36)
	at org.apache.commons.lang3.ValidateTest.testNotNull1(ValidateTest.java:112)

testNotNull2(org.apache.commons.lang3.ValidateTest)  Time elapsed: 0 sec  <<< ERROR!
java.lang.NullPointerException: MSG
	at org.apache.commons.lang3.Validate.notNull(Validate.java:37)
	at org.apache.commons.lang3.ValidateTest.testNotNull2(ValidateTest.java:129)

testValidIndex_array(org.apache.commons.lang3.ValidateTest)  Time elapsed: 0 sec  <<< ERROR!
java.lang.NullPointerException: The validated object is null
	at org.apache.commons.lang3.Validate.notNull(Validate.java:37)
	at org.apache.commons.lang3.Validate.notNull(Validate.java:36)
	at org.apache.commons.lang3.Validate.validIndex(Validate.java:74)
	at org.apache.commons.lang3.Validate.validIndex(Validate.java:77)
	at org.apache.commons.lang3.ValidateTest.testValidIndex_array(ValidateTest.java:684)

testValidIndex_charSequence(org.apache.commons.lang3.ValidateTest)  Time elapsed: 0.001 sec  <<< ERROR!
java.lang.NullPointerException: The validated object is null
	at org.apache.commons.lang3.Validate.notNull(Validate.java:37)
	at org.apache.commons.lang3.Validate.notNull(Validate.java:36)
	at org.apache.commons.lang3.Validate.validIndex(Validate.java:82)
	at org.apache.commons.lang3.Validate.validIndex(Validate.java:85)
	at org.apache.commons.lang3.ValidateTest.testValidIndex_charSequence(ValidateTest.java:784)

testValidIndex_withMessage_collection(org.apache.commons.lang3.ValidateTest)  Time elapsed: 0.001 sec  <<< ERROR!
java.lang.NullPointerException: The validated object is null
	at org.apache.commons.lang3.Validate.notNull(Validate.java:37)
	at org.apache.commons.lang3.Validate.notNull(Validate.java:36)
	at org.apache.commons.lang3.Validate.validIndex(Validate.java:78)
	at org.apache.commons.lang3.ValidateTest.testValidIndex_withMessage_collection(ValidateTest.java:711)

testValidIndex_withMessage_charSequence(org.apache.commons.lang3.ValidateTest)  Time elapsed: 0 sec  <<< ERROR!
java.lang.NullPointerException: The validated object is null
	at org.apache.commons.lang3.Validate.notNull(Validate.java:37)
	at org.apache.commons.lang3.Validate.notNull(Validate.java:36)
	at org.apache.commons.lang3.Validate.validIndex(Validate.java:82)
	at org.apache.commons.lang3.ValidateTest.testValidIndex_withMessage_charSequence(ValidateTest.java:761)

testValidIndex_withMessage_array(org.apache.commons.lang3.ValidateTest)  Time elapsed: 0 sec  <<< ERROR!
java.lang.NullPointerException: The validated object is null
	at org.apache.commons.lang3.Validate.notNull(Validate.java:37)
	at org.apache.commons.lang3.Validate.notNull(Validate.java:36)
	at org.apache.commons.lang3.Validate.validIndex(Validate.java:74)
	at org.apache.commons.lang3.ValidateTest.testValidIndex_withMessage_array(ValidateTest.java:661)

testNoNullElementsCollection1(org.apache.commons.lang3.ValidateTest)  Time elapsed: 0 sec  <<< ERROR!
java.lang.NullPointerException: The validated object is null
	at org.apache.commons.lang3.Validate.notNull(Validate.java:37)
	at org.apache.commons.lang3.Validate.notNull(Validate.java:36)
	at org.apache.commons.lang3.Validate.noNullElements(Validate.java:66)
	at org.apache.commons.lang3.Validate.noNullElements(Validate.java:73)
	at org.apache.commons.lang3.ValidateTest.testNoNullElementsCollection1(ValidateTest.java:598)

testNoNullElementsCollection2(org.apache.commons.lang3.ValidateTest)  Time elapsed: 0 sec  <<< ERROR!
java.lang.NullPointerException: The validated object is null
	at org.apache.commons.lang3.Validate.notNull(Validate.java:37)
	at org.apache.commons.lang3.Validate.notNull(Validate.java:36)
	at org.apache.commons.lang3.Validate.noNullElements(Validate.java:66)
	at org.apache.commons.lang3.ValidateTest.testNoNullElementsCollection2(ValidateTest.java:624)

testValidIndex_collection(org.apache.commons.lang3.ValidateTest)  Time elapsed: 0 sec  <<< ERROR!
java.lang.NullPointerException: The validated object is null
	at org.apache.commons.lang3.Validate.notNull(Validate.java:37)
	at org.apache.commons.lang3.Validate.notNull(Validate.java:36)
	at org.apache.commons.lang3.Validate.validIndex(Validate.java:78)
	at org.apache.commons.lang3.Validate.validIndex(Validate.java:81)
	at org.apache.commons.lang3.ValidateTest.testValidIndex_collection(ValidateTest.java:736)

testNoNullElementsArray1(org.apache.commons.lang3.ValidateTest)  Time elapsed: 0.001 sec  <<< ERROR!
java.lang.NullPointerException: The validated object is null
	at org.apache.commons.lang3.Validate.notNull(Validate.java:37)
	at org.apache.commons.lang3.Validate.notNull(Validate.java:36)
	at org.apache.commons.lang3.Validate.noNullElements(Validate.java:59)
	at org.apache.commons.lang3.Validate.noNullElements(Validate.java:65)
	at org.apache.commons.lang3.ValidateTest.testNoNullElementsArray1(ValidateTest.java:547)

testNoNullElementsArray2(org.apache.commons.lang3.ValidateTest)  Time elapsed: 0 sec  <<< ERROR!
java.lang.NullPointerException: The validated object is null
	at org.apache.commons.lang3.Validate.notNull(Validate.java:37)
	at org.apache.commons.lang3.Validate.notNull(Validate.java:36)
	at org.apache.commons.lang3.Validate.noNullElements(Validate.java:59)
	at org.apache.commons.lang3.ValidateTest.testNoNullElementsArray2(ValidateTest.java:571)

Running org.apache.commons.lang3.LocaleUtilsTest
Tests run: 15, Failures: 0, Errors: 0, Skipped: 0, Time elapsed: 0.016 sec - in org.apache.commons.lang3.LocaleUtilsTest
Running org.apache.commons.lang3.tuple.MutableTripleTest
Tests run: 8, Failures: 0, Errors: 0, Skipped: 0, Time elapsed: 0.014 sec - in org.apache.commons.lang3.tuple.MutableTripleTest
Running org.apache.commons.lang3.tuple.TripleTest
Tests run: 10, Failures: 0, Errors: 0, Skipped: 0, Time elapsed: 0.001 sec - in org.apache.commons.lang3.tuple.TripleTest
Running org.apache.commons.lang3.tuple.ImmutablePairTest
Tests run: 6, Failures: 0, Errors: 0, Skipped: 0, Time elapsed: 0 sec - in org.apache.commons.lang3.tuple.ImmutablePairTest
Running org.apache.commons.lang3.tuple.MutablePairTest
Tests run: 8, Failures: 0, Errors: 0, Skipped: 0, Time elapsed: 0 sec - in org.apache.commons.lang3.tuple.MutablePairTest
Running org.apache.commons.lang3.tuple.ImmutableTripleTest
Tests run: 6, Failures: 0, Errors: 0, Skipped: 0, Time elapsed: 0 sec - in org.apache.commons.lang3.tuple.ImmutableTripleTest
Running org.apache.commons.lang3.tuple.PairTest
Tests run: 9, Failures: 0, Errors: 0, Skipped: 0, Time elapsed: 0.001 sec - in org.apache.commons.lang3.tuple.PairTest
Running org.apache.commons.lang3.StringUtilsIsTest
Tests run: 8, Failures: 0, Errors: 0, Skipped: 0, Time elapsed: 0.006 sec - in org.apache.commons.lang3.StringUtilsIsTest
Running org.apache.commons.lang3.JavaVersionTest
Tests run: 3, Failures: 0, Errors: 0, Skipped: 0, Time elapsed: 0.001 sec - in org.apache.commons.lang3.JavaVersionTest
Running org.apache.commons.lang3.builder.NoFieldNamesToStringStyleTest
Tests run: 8, Failures: 0, Errors: 0, Skipped: 0, Time elapsed: 0.009 sec - in org.apache.commons.lang3.builder.NoFieldNamesToStringStyleTest
Running org.apache.commons.lang3.builder.ShortPrefixToStringStyleTest
Tests run: 8, Failures: 0, Errors: 0, Skipped: 0, Time elapsed: 0.002 sec - in org.apache.commons.lang3.builder.ShortPrefixToStringStyleTest
Running org.apache.commons.lang3.builder.DiffResultTest
Tests run: 9, Failures: 0, Errors: 0, Skipped: 0, Time elapsed: 0.006 sec - in org.apache.commons.lang3.builder.DiffResultTest
Running org.apache.commons.lang3.builder.CompareToBuilderTest
Tests run: 48, Failures: 0, Errors: 0, Skipped: 0, Time elapsed: 0.021 sec - in org.apache.commons.lang3.builder.CompareToBuilderTest
Running org.apache.commons.lang3.builder.MultilineRecursiveToStringStyleTest
Tests run: 10, Failures: 0, Errors: 0, Skipped: 0, Time elapsed: 0.005 sec - in org.apache.commons.lang3.builder.MultilineRecursiveToStringStyleTest
Running org.apache.commons.lang3.builder.RecursiveToStringStyleTest
Tests run: 8, Failures: 0, Errors: 0, Skipped: 0, Time elapsed: 0.006 sec - in org.apache.commons.lang3.builder.RecursiveToStringStyleTest
Running org.apache.commons.lang3.builder.DefaultToStringStyleTest
Tests run: 8, Failures: 0, Errors: 0, Skipped: 0, Time elapsed: 0.003 sec - in org.apache.commons.lang3.builder.DefaultToStringStyleTest
Running org.apache.commons.lang3.builder.ReflectionToStringBuilderExcludeTest
Tests run: 11, Failures: 0, Errors: 0, Skipped: 0, Time elapsed: 0.003 sec - in org.apache.commons.lang3.builder.ReflectionToStringBuilderExcludeTest
Running org.apache.commons.lang3.builder.StandardToStringStyleTest
Tests run: 8, Failures: 0, Errors: 0, Skipped: 0, Time elapsed: 0.002 sec - in org.apache.commons.lang3.builder.StandardToStringStyleTest
Running org.apache.commons.lang3.builder.ToStringStyleTest
Tests run: 12, Failures: 0, Errors: 0, Skipped: 0, Time elapsed: 0.002 sec - in org.apache.commons.lang3.builder.ToStringStyleTest
Running org.apache.commons.lang3.builder.DiffTest
Tests run: 4, Failures: 0, Errors: 0, Skipped: 0, Time elapsed: 0 sec - in org.apache.commons.lang3.builder.DiffTest
Running org.apache.commons.lang3.builder.SimpleToStringStyleTest
Tests run: 8, Failures: 0, Errors: 0, Skipped: 0, Time elapsed: 0.002 sec - in org.apache.commons.lang3.builder.SimpleToStringStyleTest
Running org.apache.commons.lang3.builder.MultiLineToStringStyleTest
Tests run: 8, Failures: 0, Errors: 0, Skipped: 0, Time elapsed: 0.004 sec - in org.apache.commons.lang3.builder.MultiLineToStringStyleTest
Running org.apache.commons.lang3.builder.ToStringStyleConcurrencyTest
Tests run: 3, Failures: 0, Errors: 0, Skipped: 0, Time elapsed: 3.751 sec - in org.apache.commons.lang3.builder.ToStringStyleConcurrencyTest
Running org.apache.commons.lang3.builder.ReflectionToStringBuilderMutateInspectConcurrencyTest
Tests run: 1, Failures: 0, Errors: 0, Skipped: 1, Time elapsed: 0 sec - in org.apache.commons.lang3.builder.ReflectionToStringBuilderMutateInspectConcurrencyTest
Running org.apache.commons.lang3.builder.ToStringBuilderTest
Tests run: 74, Failures: 0, Errors: 0, Skipped: 1, Time elapsed: 0.046 sec - in org.apache.commons.lang3.builder.ToStringBuilderTest
Running org.apache.commons.lang3.builder.EqualsBuilderTest
Tests run: 48, Failures: 0, Errors: 0, Skipped: 0, Time elapsed: 0.013 sec - in org.apache.commons.lang3.builder.EqualsBuilderTest
Running org.apache.commons.lang3.builder.HashCodeBuilderAndEqualsBuilderTest
Tests run: 4, Failures: 0, Errors: 0, Skipped: 0, Time elapsed: 0.007 sec - in org.apache.commons.lang3.builder.HashCodeBuilderAndEqualsBuilderTest
Running org.apache.commons.lang3.builder.ReflectionToStringBuilderConcurrencyTest
Tests run: 3, Failures: 0, Errors: 0, Skipped: 3, Time elapsed: 0 sec - in org.apache.commons.lang3.builder.ReflectionToStringBuilderConcurrencyTest
Running org.apache.commons.lang3.builder.JsonToStringStyleTest
Tests run: 9, Failures: 0, Errors: 0, Skipped: 0, Time elapsed: 0.008 sec - in org.apache.commons.lang3.builder.JsonToStringStyleTest
Running org.apache.commons.lang3.builder.NoClassNameToStringStyleTest
Tests run: 8, Failures: 0, Errors: 0, Skipped: 0, Time elapsed: 0 sec - in org.apache.commons.lang3.builder.NoClassNameToStringStyleTest
Running org.apache.commons.lang3.builder.DiffBuilderTest
Tests run: 30, Failures: 0, Errors: 0, Skipped: 0, Time elapsed: 0.018 sec - in org.apache.commons.lang3.builder.DiffBuilderTest
Running org.apache.commons.lang3.builder.HashCodeBuilderTest
Tests run: 44, Failures: 0, Errors: 0, Skipped: 0, Time elapsed: 0.016 sec - in org.apache.commons.lang3.builder.HashCodeBuilderTest
Running org.apache.commons.lang3.concurrent.AtomicInitializerTest
Tests run: 3, Failures: 0, Errors: 0, Skipped: 0, Time elapsed: 0.009 sec - in org.apache.commons.lang3.concurrent.AtomicInitializerTest
Running org.apache.commons.lang3.concurrent.CallableBackgroundInitializerTest
Tests run: 4, Failures: 0, Errors: 0, Skipped: 0, Time elapsed: 0.001 sec - in org.apache.commons.lang3.concurrent.CallableBackgroundInitializerTest
Running org.apache.commons.lang3.concurrent.BackgroundInitializerTest
Tests run: 15, Failures: 0, Errors: 0, Skipped: 0, Time elapsed: 0.018 sec - in org.apache.commons.lang3.concurrent.BackgroundInitializerTest
Running org.apache.commons.lang3.concurrent.LazyInitializerTest
Tests run: 3, Failures: 0, Errors: 0, Skipped: 0, Time elapsed: 0.005 sec - in org.apache.commons.lang3.concurrent.LazyInitializerTest
Running org.apache.commons.lang3.concurrent.BasicThreadFactoryTest
Tests run: 15, Failures: 0, Errors: 0, Skipped: 0, Time elapsed: 0.033 sec - in org.apache.commons.lang3.concurrent.BasicThreadFactoryTest
Running org.apache.commons.lang3.concurrent.ConstantInitializerTest
Tests run: 7, Failures: 0, Errors: 0, Skipped: 0, Time elapsed: 0.001 sec - in org.apache.commons.lang3.concurrent.ConstantInitializerTest
Running org.apache.commons.lang3.concurrent.MultiBackgroundInitializerTest
Tests run: 17, Failures: 0, Errors: 0, Skipped: 0, Time elapsed: 0.069 sec - in org.apache.commons.lang3.concurrent.MultiBackgroundInitializerTest
Running org.apache.commons.lang3.concurrent.AtomicSafeInitializerTest
Tests run: 4, Failures: 0, Errors: 0, Skipped: 0, Time elapsed: 0.006 sec - in org.apache.commons.lang3.concurrent.AtomicSafeInitializerTest
Running org.apache.commons.lang3.concurrent.ConcurrentUtilsTest
Tests run: 40, Failures: 0, Errors: 0, Skipped: 0, Time elapsed: 0.011 sec - in org.apache.commons.lang3.concurrent.ConcurrentUtilsTest
Running org.apache.commons.lang3.concurrent.TimedSemaphoreTest
Tests run: 15, Failures: 0, Errors: 0, Skipped: 0, Time elapsed: 1.179 sec - in org.apache.commons.lang3.concurrent.TimedSemaphoreTest
Running org.apache.commons.lang3.StringUtilsSubstringTest
Tests run: 14, Failures: 0, Errors: 0, Skipped: 0, Time elapsed: 0.005 sec - in org.apache.commons.lang3.StringUtilsSubstringTest
Running org.apache.commons.lang3.SystemUtilsTest
Tests run: 12, Failures: 0, Errors: 0, Skipped: 0, Time elapsed: 0.003 sec - in org.apache.commons.lang3.SystemUtilsTest
Running org.apache.commons.lang3.CharRangeTest
Tests run: 16, Failures: 0, Errors: 0, Skipped: 0, Time elapsed: 0.03 sec - in org.apache.commons.lang3.CharRangeTest
Running org.apache.commons.lang3.CharSetTest
Tests run: 14, Failures: 0, Errors: 0, Skipped: 0, Time elapsed: 0.007 sec - in org.apache.commons.lang3.CharSetTest
Running org.apache.commons.lang3.StringUtilsStartsEndsWithTest
Tests run: 6, Failures: 0, Errors: 0, Skipped: 0, Time elapsed: 0.002 sec - in org.apache.commons.lang3.StringUtilsStartsEndsWithTest
Running org.apache.commons.lang3.RandomStringUtilsTest
Tests run: 11, Failures: 0, Errors: 0, Skipped: 0, Time elapsed: 0.033 sec - in org.apache.commons.lang3.RandomStringUtilsTest
Running org.apache.commons.lang3.SerializationUtilsTest
Tests run: 26, Failures: 0, Errors: 0, Skipped: 0, Time elapsed: 0.046 sec - in org.apache.commons.lang3.SerializationUtilsTest
Running org.apache.commons.lang3.time.StopWatchTest
Tests run: 8, Failures: 0, Errors: 0, Skipped: 0, Time elapsed: 4.762 sec - in org.apache.commons.lang3.time.StopWatchTest
Running org.apache.commons.lang3.time.DateUtilsRoundingTest
Tests run: 22, Failures: 0, Errors: 0, Skipped: 0, Time elapsed: 0.151 sec - in org.apache.commons.lang3.time.DateUtilsRoundingTest
Running org.apache.commons.lang3.time.FastDateParserTest
Tests run: 33, Failures: 0, Errors: 0, Skipped: 0, Time elapsed: 2.103 sec - in org.apache.commons.lang3.time.FastDateParserTest
Running org.apache.commons.lang3.time.FastDateFormat_ParserTest
Tests run: 33, Failures: 0, Errors: 0, Skipped: 0, Time elapsed: 0.733 sec - in org.apache.commons.lang3.time.FastDateFormat_ParserTest
Running org.apache.commons.lang3.time.DurationFormatUtilsTest
Tests run: 25, Failures: 0, Errors: 0, Skipped: 0, Time elapsed: 0.79 sec - in org.apache.commons.lang3.time.DurationFormatUtilsTest
Running org.apache.commons.lang3.time.DateFormatUtilsTest
Tests run: 10, Failures: 0, Errors: 0, Skipped: 0, Time elapsed: 0.001 sec - in org.apache.commons.lang3.time.DateFormatUtilsTest
Running org.apache.commons.lang3.time.DateUtilsFragmentTest
Tests run: 57, Failures: 0, Errors: 0, Skipped: 0, Time elapsed: 0.01 sec - in org.apache.commons.lang3.time.DateUtilsFragmentTest
Running org.apache.commons.lang3.time.FastDatePrinterTimeZonesTest
Tests run: 617, Failures: 0, Errors: 0, Skipped: 0, Time elapsed: 0.209 sec - in org.apache.commons.lang3.time.FastDatePrinterTimeZonesTest
Running org.apache.commons.lang3.time.FastDateFormatTest
>>FastDateFormatTest: FastDateParser:35211  SimpleDateFormat:4062
Tests run: 14, Failures: 0, Errors: 0, Skipped: 0, Time elapsed: 4.167 sec - in org.apache.commons.lang3.time.FastDateFormatTest
Running org.apache.commons.lang3.time.FastDateFormat_PrinterTest
Tests run: 17, Failures: 0, Errors: 0, Skipped: 0, Time elapsed: 0.007 sec - in org.apache.commons.lang3.time.FastDateFormat_PrinterTest
Running org.apache.commons.lang3.time.FastDatePrinterTest
Tests run: 17, Failures: 0, Errors: 0, Skipped: 0, Time elapsed: 0.004 sec - in org.apache.commons.lang3.time.FastDatePrinterTest
Running org.apache.commons.lang3.time.FastDateParserSDFTest
Tests run: 276, Failures: 0, Errors: 0, Skipped: 92, Time elapsed: 0.058 sec - in org.apache.commons.lang3.time.FastDateParserSDFTest
Running org.apache.commons.lang3.time.DateUtilsTest
DateUtilsTest: Default Locale=en_US
Tests run: 38, Failures: 0, Errors: 0, Skipped: 0, Time elapsed: 0.016 sec - in org.apache.commons.lang3.time.DateUtilsTest
Running org.apache.commons.lang3.reflect.InheritanceUtilsTest
Tests run: 9, Failures: 0, Errors: 0, Skipped: 0, Time elapsed: 0.002 sec - in org.apache.commons.lang3.reflect.InheritanceUtilsTest
Running org.apache.commons.lang3.reflect.MethodUtilsTest
Tests run: 23, Failures: 0, Errors: 2, Skipped: 0, Time elapsed: 0.023 sec <<< FAILURE! - in org.apache.commons.lang3.reflect.MethodUtilsTest
testGetOverrideHierarchyIncludingInterfaces(org.apache.commons.lang3.reflect.MethodUtilsTest)  Time elapsed: 0.002 sec  <<< ERROR!
java.lang.NullPointerException: The validated object is null
	at org.apache.commons.lang3.Validate.notNull(Validate.java:37)
	at org.apache.commons.lang3.Validate.notNull(Validate.java:36)
	at org.apache.commons.lang3.reflect.MethodUtils.getOverrideHierarchy(MethodUtils.java:563)
	at org.apache.commons.lang3.reflect.MethodUtilsTest.testGetOverrideHierarchyIncludingInterfaces(MethodUtilsTest.java:403)

testGetOverrideHierarchyExcludingInterfaces(org.apache.commons.lang3.reflect.MethodUtilsTest)  Time elapsed: 0 sec  <<< ERROR!
java.lang.NullPointerException: The validated object is null
	at org.apache.commons.lang3.Validate.notNull(Validate.java:37)
	at org.apache.commons.lang3.Validate.notNull(Validate.java:36)
	at org.apache.commons.lang3.reflect.MethodUtils.getOverrideHierarchy(MethodUtils.java:563)
	at org.apache.commons.lang3.reflect.MethodUtilsTest.testGetOverrideHierarchyExcludingInterfaces(MethodUtilsTest.java:423)

Running org.apache.commons.lang3.reflect.ConstructorUtilsTest
Tests run: 7, Failures: 0, Errors: 6, Skipped: 0, Time elapsed: 0.003 sec <<< FAILURE! - in org.apache.commons.lang3.reflect.ConstructorUtilsTest
testInvokeConstructor(org.apache.commons.lang3.reflect.ConstructorUtilsTest)  Time elapsed: 0 sec  <<< ERROR!
java.lang.NullPointerException: class cannot be null
	at org.apache.commons.lang3.Validate.notNull(Validate.java:37)
	at org.apache.commons.lang3.reflect.ConstructorUtils.getMatchingAccessibleConstructor(ConstructorUtils.java:243)
	at org.apache.commons.lang3.reflect.ConstructorUtils.invokeConstructor(ConstructorUtils.java:113)
	at org.apache.commons.lang3.reflect.ConstructorUtils.invokeConstructor(ConstructorUtils.java:85)
	at org.apache.commons.lang3.reflect.ConstructorUtilsTest.testInvokeConstructor(ConstructorUtilsTest.java:102)

testGetAccessibleConstructorFromDescription(org.apache.commons.lang3.reflect.ConstructorUtilsTest)  Time elapsed: 0.001 sec  <<< ERROR!
java.lang.NullPointerException: class cannot be null
	at org.apache.commons.lang3.Validate.notNull(Validate.java:37)
	at org.apache.commons.lang3.reflect.ConstructorUtils.getAccessibleConstructor(ConstructorUtils.java:198)
	at org.apache.commons.lang3.reflect.ConstructorUtilsTest.testGetAccessibleConstructorFromDescription(ConstructorUtilsTest.java:170)

testInvokeExactConstructor(org.apache.commons.lang3.reflect.ConstructorUtilsTest)  Time elapsed: 0 sec  <<< ERROR!
java.lang.NullPointerException: class cannot be null
	at org.apache.commons.lang3.Validate.notNull(Validate.java:37)
	at org.apache.commons.lang3.reflect.ConstructorUtils.getAccessibleConstructor(ConstructorUtils.java:198)
	at org.apache.commons.lang3.reflect.ConstructorUtils.invokeExactConstructor(ConstructorUtils.java:173)
	at org.apache.commons.lang3.reflect.ConstructorUtils.invokeExactConstructor(ConstructorUtils.java:145)
	at org.apache.commons.lang3.reflect.ConstructorUtilsTest.testInvokeExactConstructor(ConstructorUtilsTest.java:125)

testNullArgument(org.apache.commons.lang3.reflect.ConstructorUtilsTest)  Time elapsed: 0.001 sec  <<< ERROR!
java.lang.NullPointerException: class cannot be null
	at org.apache.commons.lang3.Validate.notNull(Validate.java:37)
	at org.apache.commons.lang3.reflect.ConstructorUtils.getMatchingAccessibleConstructor(ConstructorUtils.java:243)
	at org.apache.commons.lang3.reflect.ConstructorUtilsTest.expectMatchingAccessibleConstructorParameterTypes(ConstructorUtilsTest.java:226)
	at org.apache.commons.lang3.reflect.ConstructorUtilsTest.testNullArgument(ConstructorUtilsTest.java:220)

testGetAccessibleConstructor(org.apache.commons.lang3.reflect.ConstructorUtilsTest)  Time elapsed: 0 sec  <<< ERROR!
java.lang.NullPointerException: constructor cannot be null
	at org.apache.commons.lang3.Validate.notNull(Validate.java:37)
	at org.apache.commons.lang3.reflect.ConstructorUtils.getAccessibleConstructor(ConstructorUtils.java:218)
	at org.apache.commons.lang3.reflect.ConstructorUtilsTest.testGetAccessibleConstructor(ConstructorUtilsTest.java:161)

testGetMatchingAccessibleMethod(org.apache.commons.lang3.reflect.ConstructorUtilsTest)  Time elapsed: 0.001 sec  <<< ERROR!
java.lang.NullPointerException: class cannot be null
	at org.apache.commons.lang3.Validate.notNull(Validate.java:37)
	at org.apache.commons.lang3.reflect.ConstructorUtils.getMatchingAccessibleConstructor(ConstructorUtils.java:243)
	at org.apache.commons.lang3.reflect.ConstructorUtilsTest.expectMatchingAccessibleConstructorParameterTypes(ConstructorUtilsTest.java:226)
	at org.apache.commons.lang3.reflect.ConstructorUtilsTest.testGetMatchingAccessibleMethod(ConstructorUtilsTest.java:178)

Running org.apache.commons.lang3.reflect.FieldUtilsTest
Tests run: 64, Failures: 0, Errors: 0, Skipped: 0, Time elapsed: 0.022 sec - in org.apache.commons.lang3.reflect.FieldUtilsTest
Running org.apache.commons.lang3.reflect.TypeLiteralTest
Tests run: 4, Failures: 0, Errors: 3, Skipped: 0, Time elapsed: 0 sec <<< FAILURE! - in org.apache.commons.lang3.reflect.TypeLiteralTest
testBasic(org.apache.commons.lang3.reflect.TypeLiteralTest)  Time elapsed: 0 sec  <<< ERROR!
java.lang.NullPointerException: var is null
	at org.apache.commons.lang3.Validate.notNull(Validate.java:37)
	at org.apache.commons.lang3.reflect.TypeUtils.toLongString(TypeUtils.java:1686)
	at org.apache.commons.lang3.reflect.TypeLiteral.<init>(TypeLiteral.java:91)
	at org.apache.commons.lang3.reflect.TypeLiteralTest$1.<init>(TypeLiteralTest.java:31)
	at org.apache.commons.lang3.reflect.TypeLiteralTest.testBasic(TypeLiteralTest.java:31)

testTyped(org.apache.commons.lang3.reflect.TypeLiteralTest)  Time elapsed: 0 sec  <<< ERROR!
java.lang.NullPointerException: var is null
	at org.apache.commons.lang3.Validate.notNull(Validate.java:37)
	at org.apache.commons.lang3.reflect.TypeUtils.toLongString(TypeUtils.java:1686)
	at org.apache.commons.lang3.reflect.TypeLiteral.<init>(TypeLiteral.java:91)
	at org.apache.commons.lang3.reflect.TypeLiteralTest$3.<init>(TypeLiteralTest.java:38)
	at org.apache.commons.lang3.reflect.TypeLiteralTest.testTyped(TypeLiteralTest.java:38)

testEquals(org.apache.commons.lang3.reflect.TypeLiteralTest)  Time elapsed: 0 sec  <<< ERROR!
java.lang.NullPointerException: var is null
	at org.apache.commons.lang3.Validate.notNull(Validate.java:37)
	at org.apache.commons.lang3.reflect.TypeUtils.toLongString(TypeUtils.java:1686)
	at org.apache.commons.lang3.reflect.TypeLiteral.<init>(TypeLiteral.java:91)
	at org.apache.commons.lang3.reflect.TypeLiteralTest$5.<init>(TypeLiteralTest.java:46)
	at org.apache.commons.lang3.reflect.TypeLiteralTest.testEquals(TypeLiteralTest.java:46)

Running org.apache.commons.lang3.reflect.TypeUtilsTest
Tests run: 19, Failures: 0, Errors: 11, Skipped: 0, Time elapsed: 0.017 sec <<< FAILURE! - in org.apache.commons.lang3.reflect.TypeUtilsTest
testToLongString(org.apache.commons.lang3.reflect.TypeUtilsTest)  Time elapsed: 0 sec  <<< ERROR!
java.lang.NullPointerException: var is null
	at org.apache.commons.lang3.Validate.notNull(Validate.java:37)
	at org.apache.commons.lang3.reflect.TypeUtils.toLongString(TypeUtils.java:1686)
	at org.apache.commons.lang3.reflect.TypeUtilsTest.testToLongString(TypeUtilsTest.java:737)

testWildcardType(org.apache.commons.lang3.reflect.TypeUtilsTest)  Time elapsed: 0 sec  <<< ERROR!
java.lang.NullPointerException: The validated object is null
	at org.apache.commons.lang3.Validate.notNull(Validate.java:37)
	at org.apache.commons.lang3.Validate.notNull(Validate.java:36)
	at org.apache.commons.lang3.reflect.TypeUtils.toString(TypeUtils.java:1659)
	at org.apache.commons.lang3.reflect.TypeUtilsTest.testWildcardType(TypeUtilsTest.java:699)

testParameterize(org.apache.commons.lang3.reflect.TypeUtilsTest)  Time elapsed: 0 sec  <<< ERROR!
java.lang.NullPointerException: raw class is null
	at org.apache.commons.lang3.Validate.notNull(Validate.java:37)
	at org.apache.commons.lang3.reflect.TypeUtils.parameterizeWithOwner(TypeUtils.java:1489)
	at org.apache.commons.lang3.reflect.TypeUtils.parameterize(TypeUtils.java:1459)
	at org.apache.commons.lang3.reflect.TypeUtilsTest.testParameterize(TypeUtilsTest.java:680)

testLang820(org.apache.commons.lang3.reflect.TypeUtilsTest)  Time elapsed: 0 sec  <<< ERROR!
java.lang.NullPointerException: null value specified for bounds array
	at org.apache.commons.lang3.Validate.notNull(Validate.java:37)
	at org.apache.commons.lang3.reflect.TypeUtils.normalizeUpperBounds(TypeUtils.java:1126)
	at org.apache.commons.lang3.reflect.TypeUtilsTest.testLang820(TypeUtilsTest.java:675)

testParameterizeWithOwner(org.apache.commons.lang3.reflect.TypeUtilsTest)  Time elapsed: 0 sec  <<< ERROR!
java.lang.NullPointerException: raw class is null
	at org.apache.commons.lang3.Validate.notNull(Validate.java:37)
	at org.apache.commons.lang3.reflect.TypeUtils.parameterizeWithOwner(TypeUtils.java:1489)
	at org.apache.commons.lang3.reflect.TypeUtils.parameterize(TypeUtils.java:1459)
	at org.apache.commons.lang3.reflect.TypeUtilsTest.testParameterizeWithOwner(TypeUtilsTest.java:688)

testIsAssignable(org.apache.commons.lang3.reflect.TypeUtilsTest)  Time elapsed: 0.009 sec  <<< ERROR!
java.lang.NullPointerException: wildcardType is null
	at org.apache.commons.lang3.Validate.notNull(Validate.java:37)
	at org.apache.commons.lang3.reflect.TypeUtils.getImplicitUpperBounds(TypeUtils.java:1179)
	at org.apache.commons.lang3.reflect.TypeUtils.isAssignable(TypeUtils.java:605)
	at org.apache.commons.lang3.reflect.TypeUtils.isAssignable(TypeUtils.java:339)
	at org.apache.commons.lang3.reflect.TypeUtils.isAssignable(TypeUtils.java:471)
	at org.apache.commons.lang3.reflect.TypeUtils.isAssignable(TypeUtils.java:331)
	at org.apache.commons.lang3.reflect.TypeUtils.isAssignable(TypeUtils.java:312)
	at org.apache.commons.lang3.reflect.TypeUtilsTest.delegateBooleanAssertion(TypeUtilsTest.java:450)
	at org.apache.commons.lang3.reflect.TypeUtilsTest.testIsAssignable(TypeUtilsTest.java:161)

testTypesSatisfyVariables(org.apache.commons.lang3.reflect.TypeUtilsTest)  Time elapsed: 0.001 sec  <<< ERROR!
java.lang.NullPointerException: typeVarAssigns is null
	at org.apache.commons.lang3.Validate.notNull(Validate.java:37)
	at org.apache.commons.lang3.reflect.TypeUtils.typesSatisfyVariables(TypeUtils.java:1215)
	at org.apache.commons.lang3.reflect.TypeUtilsTest.testTypesSatisfyVariables(TypeUtilsTest.java:529)

testUnboundedWildcardType(org.apache.commons.lang3.reflect.TypeUtilsTest)  Time elapsed: 0.001 sec  <<< ERROR!
java.lang.NullPointerException: wildcardType is null
	at org.apache.commons.lang3.Validate.notNull(Validate.java:37)
	at org.apache.commons.lang3.reflect.TypeUtils.getImplicitLowerBounds(TypeUtils.java:1195)
	at org.apache.commons.lang3.reflect.TypeUtils.equals(TypeUtils.java:1626)
	at org.apache.commons.lang3.reflect.TypeUtils.access$300(TypeUtils.java:47)
	at org.apache.commons.lang3.reflect.TypeUtils$WildcardTypeImpl.equals(TypeUtils.java:268)
	at org.apache.commons.lang3.ObjectUtils.equals(ObjectUtils.java:163)
	at org.apache.commons.lang3.reflect.TypeUtils.equals(TypeUtils.java:1572)
	at org.apache.commons.lang3.reflect.TypeUtilsTest.testUnboundedWildcardType(TypeUtilsTest.java:706)

testLowerBoundedWildcardType(org.apache.commons.lang3.reflect.TypeUtilsTest)  Time elapsed: 0.001 sec  <<< ERROR!
java.lang.NullPointerException: The validated object is null
	at org.apache.commons.lang3.Validate.notNull(Validate.java:37)
	at org.apache.commons.lang3.Validate.notNull(Validate.java:36)
	at org.apache.commons.lang3.reflect.TypeUtils.toString(TypeUtils.java:1659)
	at org.apache.commons.lang3.reflect.TypeUtilsTest.testLowerBoundedWildcardType(TypeUtilsTest.java:716)

testDetermineTypeVariableAssignments(org.apache.commons.lang3.reflect.TypeUtilsTest)  Time elapsed: 0.001 sec  <<< ERROR!
java.lang.NullPointerException: cls is null
	at org.apache.commons.lang3.Validate.notNull(Validate.java:37)
	at org.apache.commons.lang3.reflect.TypeUtils.determineTypeArguments(TypeUtils.java:959)
	at org.apache.commons.lang3.reflect.TypeUtilsTest.testDetermineTypeVariableAssignments(TypeUtilsTest.java:543)

testGenericArrayType(org.apache.commons.lang3.reflect.TypeUtilsTest)  Time elapsed: 0 sec  <<< ERROR!
java.lang.NullPointerException: raw class is null
	at org.apache.commons.lang3.Validate.notNull(Validate.java:37)
	at org.apache.commons.lang3.reflect.TypeUtils.parameterizeWithOwner(TypeUtils.java:1489)
	at org.apache.commons.lang3.reflect.TypeUtils.parameterize(TypeUtils.java:1459)
	at org.apache.commons.lang3.reflect.TypeUtilsTest.testGenericArrayType(TypeUtilsTest.java:728)

Running org.apache.commons.lang3.mutable.MutableByteTest
Tests run: 17, Failures: 0, Errors: 0, Skipped: 0, Time elapsed: 0.001 sec - in org.apache.commons.lang3.mutable.MutableByteTest
Running org.apache.commons.lang3.mutable.MutableShortTest
Tests run: 14, Failures: 0, Errors: 0, Skipped: 0, Time elapsed: 0.002 sec - in org.apache.commons.lang3.mutable.MutableShortTest
Running org.apache.commons.lang3.mutable.MutableIntTest
Tests run: 17, Failures: 0, Errors: 0, Skipped: 0, Time elapsed: 0.003 sec - in org.apache.commons.lang3.mutable.MutableIntTest
Running org.apache.commons.lang3.mutable.MutableDoubleTest
Tests run: 18, Failures: 0, Errors: 0, Skipped: 0, Time elapsed: 0.003 sec - in org.apache.commons.lang3.mutable.MutableDoubleTest
Running org.apache.commons.lang3.mutable.MutableFloatTest
Tests run: 18, Failures: 0, Errors: 0, Skipped: 0, Time elapsed: 0.003 sec - in org.apache.commons.lang3.mutable.MutableFloatTest
Running org.apache.commons.lang3.mutable.MutableLongTest
Tests run: 17, Failures: 0, Errors: 0, Skipped: 0, Time elapsed: 0.003 sec - in org.apache.commons.lang3.mutable.MutableLongTest
Running org.apache.commons.lang3.mutable.MutableBooleanTest
Tests run: 9, Failures: 0, Errors: 0, Skipped: 0, Time elapsed: 0.003 sec - in org.apache.commons.lang3.mutable.MutableBooleanTest
Running org.apache.commons.lang3.mutable.MutableObjectTest
Tests run: 5, Failures: 0, Errors: 0, Skipped: 0, Time elapsed: 0.001 sec - in org.apache.commons.lang3.mutable.MutableObjectTest
Running org.apache.commons.lang3.text.translate.UnicodeEscaperTest
Tests run: 3, Failures: 0, Errors: 0, Skipped: 0, Time elapsed: 0.001 sec - in org.apache.commons.lang3.text.translate.UnicodeEscaperTest
Running org.apache.commons.lang3.text.translate.EntityArraysTest
Tests run: 3, Failures: 0, Errors: 0, Skipped: 0, Time elapsed: 0 sec - in org.apache.commons.lang3.text.translate.EntityArraysTest
Running org.apache.commons.lang3.text.translate.UnicodeUnpairedSurrogateRemoverTest
Tests run: 2, Failures: 0, Errors: 0, Skipped: 0, Time elapsed: 0 sec - in org.apache.commons.lang3.text.translate.UnicodeUnpairedSurrogateRemoverTest
Running org.apache.commons.lang3.text.translate.NumericEntityUnescaperTest
Tests run: 3, Failures: 0, Errors: 0, Skipped: 0, Time elapsed: 0.001 sec - in org.apache.commons.lang3.text.translate.NumericEntityUnescaperTest
Running org.apache.commons.lang3.text.translate.NumericEntityEscaperTest
Tests run: 4, Failures: 0, Errors: 0, Skipped: 0, Time elapsed: 0 sec - in org.apache.commons.lang3.text.translate.NumericEntityEscaperTest
Running org.apache.commons.lang3.text.translate.LookupTranslatorTest
Tests run: 2, Failures: 0, Errors: 0, Skipped: 0, Time elapsed: 0.001 sec - in org.apache.commons.lang3.text.translate.LookupTranslatorTest
Running org.apache.commons.lang3.text.translate.UnicodeUnescaperTest
Tests run: 3, Failures: 0, Errors: 0, Skipped: 0, Time elapsed: 0 sec - in org.apache.commons.lang3.text.translate.UnicodeUnescaperTest
Running org.apache.commons.lang3.text.translate.OctalUnescaperTest
Tests run: 1, Failures: 0, Errors: 0, Skipped: 0, Time elapsed: 0 sec - in org.apache.commons.lang3.text.translate.OctalUnescaperTest
Running org.apache.commons.lang3.text.StrMatcherTest
Tests run: 14, Failures: 0, Errors: 0, Skipped: 0, Time elapsed: 0.001 sec - in org.apache.commons.lang3.text.StrMatcherTest
Running org.apache.commons.lang3.text.StrTokenizerTest
Tests run: 55, Failures: 0, Errors: 0, Skipped: 0, Time elapsed: 0.014 sec - in org.apache.commons.lang3.text.StrTokenizerTest
Running org.apache.commons.lang3.text.FormattableUtilsTest
Tests run: 5, Failures: 0, Errors: 0, Skipped: 0, Time elapsed: 0 sec - in org.apache.commons.lang3.text.FormattableUtilsTest
Running org.apache.commons.lang3.text.CompositeFormatTest
Tests run: 2, Failures: 0, Errors: 0, Skipped: 0, Time elapsed: 0.001 sec - in org.apache.commons.lang3.text.CompositeFormatTest
Running org.apache.commons.lang3.text.WordUtilsTest
Tests run: 12, Failures: 0, Errors: 0, Skipped: 0, Time elapsed: 0.003 sec - in org.apache.commons.lang3.text.WordUtilsTest
Running org.apache.commons.lang3.text.StrLookupTest
Tests run: 5, Failures: 0, Errors: 0, Skipped: 0, Time elapsed: 0.003 sec - in org.apache.commons.lang3.text.StrLookupTest
Running org.apache.commons.lang3.text.StrBuilderAppendInsertTest
Tests run: 51, Failures: 0, Errors: 0, Skipped: 0, Time elapsed: 0.012 sec - in org.apache.commons.lang3.text.StrBuilderAppendInsertTest
Running org.apache.commons.lang3.text.ExtendedMessageFormatTest
Tests run: 10, Failures: 0, Errors: 0, Skipped: 0, Time elapsed: 0.755 sec - in org.apache.commons.lang3.text.ExtendedMessageFormatTest
Running org.apache.commons.lang3.text.StrSubstitutorTest
Tests run: 40, Failures: 0, Errors: 0, Skipped: 0, Time elapsed: 0.03 sec - in org.apache.commons.lang3.text.StrSubstitutorTest
Running org.apache.commons.lang3.text.StrBuilderTest
Tests run: 90, Failures: 0, Errors: 0, Skipped: 0, Time elapsed: 0.044 sec - in org.apache.commons.lang3.text.StrBuilderTest
Running org.apache.commons.lang3.StringEscapeUtilsTest
Tests run: 28, Failures: 0, Errors: 0, Skipped: 0, Time elapsed: 0.378 sec - in org.apache.commons.lang3.StringEscapeUtilsTest
Running org.apache.commons.lang3.AnnotationUtilsTest
Tests run: 10, Failures: 0, Errors: 3, Skipped: 0, Time elapsed: 0.02 sec <<< FAILURE! - in org.apache.commons.lang3.AnnotationUtilsTest
testEquivalence(org.apache.commons.lang3.AnnotationUtilsTest)  Time elapsed: 0.002 sec  <<< ERROR!
java.lang.NullPointerException: Annotation @org.apache.commons.lang3.AnnotationUtilsTest$TestAnnotation(booleanValue=false, booleanValues=[false], byteValue=0, byteValues=[0], charValue= , charValues=[ ], doubleValue=0.0, doubleValues=[0.0], floatValue=0.0, floatValues=[0.0], intValue=0, intValues=[0], longValue=0, longValues=[0], nest=@org.apache.commons.lang3.AnnotationUtilsTest$NestAnnotation(booleanValue=false, booleanValues=[false], byteValue=0, byteValues=[0], charValue= , charValues=[ ], doubleValue=0.0, doubleValues=[0.0], floatValue=0.0, floatValues=[0.0], intValue=0, intValues=[0], longValue=0, longValues=[0], shortValue=0, shortValues=[0], stooge=CURLY, stooges=[MOE, LARRY, SHEMP], string=, strings=[], type=class java.lang.Object, types=[class java.lang.Object]), nests=[@org.apache.commons.lang3.AnnotationUtilsTest$NestAnnotation(booleanValue=false, booleanValues=[false], byteValue=0, byteValues=[0], charValue= , charValues=[ ], doubleValue=0.0, doubleValues=[0.0], floatValue=0.0, floatValues=[0.0], intValue=0, intValues=[0], longValue=0, longValues=[0], shortValue=0, shortValues=[0], stooge=CURLY, stooges=[MOE, LARRY, SHEMP], string=, strings=[], type=class [Ljava.lang.Object;, types=[class [Ljava.lang.Object;])], shortValue=0, shortValues=[0], stooge=SHEMP, stooges=[MOE, LARRY, CURLY], string=, strings=[], type=class java.lang.Object, types=[class java.lang.Object]) with null annotationType()
	at org.apache.commons.lang3.Validate.notNull(Validate.java:37)
	at org.apache.commons.lang3.AnnotationUtils.equals(AnnotationUtils.java:131)
	at org.apache.commons.lang3.AnnotationUtilsTest.testEquivalence(AnnotationUtilsTest.java:399)

testGeneratedAnnotationEquivalentToRealAnnotation(org.apache.commons.lang3.AnnotationUtilsTest)  Time elapsed: 0.004 sec  <<< ERROR!
java.lang.NullPointerException: Annotation Test proxy with null annotationType()
	at org.apache.commons.lang3.Validate.notNull(Validate.java:37)
	at org.apache.commons.lang3.AnnotationUtils.equals(AnnotationUtils.java:131)
	at org.apache.commons.lang3.AnnotationUtilsTest.testGeneratedAnnotationEquivalentToRealAnnotation(AnnotationUtilsTest.java:474)

testNonEquivalentAnnotationsOfSameType(org.apache.commons.lang3.AnnotationUtilsTest)  Time elapsed: 0.004 sec  <<< ERROR!
java.lang.NullPointerException: Annotation @org.apache.commons.lang3.AnnotationUtilsTest$TestAnnotation(booleanValue=false, booleanValues=[false], byteValue=0, byteValues=[0], charValue= , charValues=[ ], doubleValue=0.0, doubleValues=[0.0], floatValue=0.0, floatValues=[0.0], intValue=0, intValues=[0], longValue=0, longValues=[0], nest=@org.apache.commons.lang3.AnnotationUtilsTest$NestAnnotation(booleanValue=false, booleanValues=[false], byteValue=0, byteValues=[0], charValue= , charValues=[ ], doubleValue=0.0, doubleValues=[0.0], floatValue=0.0, floatValues=[0.0], intValue=0, intValues=[0], longValue=0, longValues=[0], shortValue=0, shortValues=[0], stooge=CURLY, stooges=[MOE, LARRY, SHEMP], string=, strings=[], type=class java.lang.Object, types=[class java.lang.Object]), nests=[@org.apache.commons.lang3.AnnotationUtilsTest$NestAnnotation(booleanValue=false, booleanValues=[false], byteValue=0, byteValues=[0], charValue= , charValues=[ ], doubleValue=0.0, doubleValues=[0.0], floatValue=0.0, floatValues=[0.0], intValue=0, intValues=[0], longValue=0, longValues=[0], shortValue=0, shortValues=[0], stooge=CURLY, stooges=[MOE, LARRY, SHEMP], string=, strings=[], type=class [Ljava.lang.Object;, types=[class [Ljava.lang.Object;])], shortValue=0, shortValues=[0], stooge=SHEMP, stooges=[MOE, LARRY, CURLY], string=, strings=[], type=class java.lang.Object, types=[class java.lang.Object]) with null annotationType()
	at org.apache.commons.lang3.Validate.notNull(Validate.java:37)
	at org.apache.commons.lang3.AnnotationUtils.equals(AnnotationUtils.java:131)
	at org.apache.commons.lang3.AnnotationUtilsTest.testNonEquivalentAnnotationsOfSameType(AnnotationUtilsTest.java:410)

Running org.apache.commons.lang3.ConversionTest
Tests run: 42, Failures: 0, Errors: 0, Skipped: 0, Time elapsed: 0.012 sec - in org.apache.commons.lang3.ConversionTest
Running org.apache.commons.lang3.StringUtilsTrimEmptyTest
Tests run: 15, Failures: 0, Errors: 0, Skipped: 0, Time elapsed: 0.01 sec - in org.apache.commons.lang3.StringUtilsTrimEmptyTest
Running org.apache.commons.lang3.EnumUtilsTest
Tests run: 34, Failures: 0, Errors: 17, Skipped: 0, Time elapsed: 0.016 sec <<< FAILURE! - in org.apache.commons.lang3.EnumUtilsTest
test_generateBitVector_nullElement(org.apache.commons.lang3.EnumUtilsTest)  Time elapsed: 0.001 sec  <<< ERROR!
java.lang.Exception: Unexpected exception, expected<java.lang.IllegalArgumentException> but was<java.lang.NullPointerException>
	at org.apache.commons.lang3.Validate.notNull(Validate.java:37)
	at org.apache.commons.lang3.EnumUtils.asEnum(EnumUtils.java:307)
	at org.apache.commons.lang3.EnumUtils.checkBitVectorable(EnumUtils.java:290)
	at org.apache.commons.lang3.EnumUtils.generateBitVector(EnumUtils.java:143)
	at org.apache.commons.lang3.EnumUtilsTest.test_generateBitVector_nullElement(EnumUtilsTest.java:119)

test_generateBitVector_longClass(org.apache.commons.lang3.EnumUtilsTest)  Time elapsed: 0.002 sec  <<< ERROR!
java.lang.Exception: Unexpected exception, expected<java.lang.IllegalArgumentException> but was<java.lang.NullPointerException>
	at org.apache.commons.lang3.Validate.notNull(Validate.java:37)
	at org.apache.commons.lang3.EnumUtils.asEnum(EnumUtils.java:307)
	at org.apache.commons.lang3.EnumUtils.checkBitVectorable(EnumUtils.java:290)
	at org.apache.commons.lang3.EnumUtils.generateBitVector(EnumUtils.java:143)
	at org.apache.commons.lang3.EnumUtilsTest.test_generateBitVector_longClass(EnumUtilsTest.java:159)

test_generateBitVector(org.apache.commons.lang3.EnumUtilsTest)  Time elapsed: 0 sec  <<< ERROR!
java.lang.NullPointerException: EnumClass must be defined.
	at org.apache.commons.lang3.Validate.notNull(Validate.java:37)
	at org.apache.commons.lang3.EnumUtils.asEnum(EnumUtils.java:307)
	at org.apache.commons.lang3.EnumUtils.checkBitVectorable(EnumUtils.java:290)
	at org.apache.commons.lang3.EnumUtils.generateBitVector(EnumUtils.java:143)
	at org.apache.commons.lang3.EnumUtilsTest.test_generateBitVector(EnumUtilsTest.java:211)

test_generateBitVectors_nullArrayElement(org.apache.commons.lang3.EnumUtilsTest)  Time elapsed: 0.001 sec  <<< ERROR!
java.lang.Exception: Unexpected exception, expected<java.lang.IllegalArgumentException> but was<java.lang.NullPointerException>
	at org.apache.commons.lang3.Validate.notNull(Validate.java:37)
	at org.apache.commons.lang3.EnumUtils.asEnum(EnumUtils.java:307)
	at org.apache.commons.lang3.EnumUtils.generateBitVectors(EnumUtils.java:224)
	at org.apache.commons.lang3.EnumUtilsTest.test_generateBitVectors_nullArrayElement(EnumUtilsTest.java:154)

test_generateBitVectorFromArray(org.apache.commons.lang3.EnumUtilsTest)  Time elapsed: 0 sec  <<< ERROR!
java.lang.NullPointerException: The validated object is null
	at org.apache.commons.lang3.Validate.notNull(Validate.java:37)
	at org.apache.commons.lang3.Validate.notNull(Validate.java:36)
	at org.apache.commons.lang3.Validate.noNullElements(Validate.java:59)
	at org.apache.commons.lang3.Validate.noNullElements(Validate.java:65)
	at org.apache.commons.lang3.EnumUtils.generateBitVector(EnumUtils.java:203)
	at org.apache.commons.lang3.EnumUtilsTest.test_generateBitVectorFromArray(EnumUtilsTest.java:235)

test_generateBitVectors_nonEnumClass(org.apache.commons.lang3.EnumUtilsTest)  Time elapsed: 0.001 sec  <<< ERROR!
java.lang.Exception: Unexpected exception, expected<java.lang.IllegalArgumentException> but was<java.lang.NullPointerException>
	at org.apache.commons.lang3.Validate.notNull(Validate.java:37)
	at org.apache.commons.lang3.EnumUtils.asEnum(EnumUtils.java:307)
	at org.apache.commons.lang3.EnumUtils.generateBitVectors(EnumUtils.java:170)
	at org.apache.commons.lang3.EnumUtilsTest.test_generateBitVectors_nonEnumClass(EnumUtilsTest.java:188)

test_processBitVectors(org.apache.commons.lang3.EnumUtilsTest)  Time elapsed: 0 sec  <<< ERROR!
java.lang.NullPointerException: EnumClass must be defined.
	at org.apache.commons.lang3.Validate.notNull(Validate.java:37)
	at org.apache.commons.lang3.EnumUtils.asEnum(EnumUtils.java:307)
	at org.apache.commons.lang3.EnumUtils.processBitVectors(EnumUtils.java:268)
	at org.apache.commons.lang3.EnumUtilsTest.test_processBitVectors(EnumUtilsTest.java:291)

test_generateBitVector_longClassWithArray(org.apache.commons.lang3.EnumUtilsTest)  Time elapsed: 0 sec  <<< ERROR!
java.lang.Exception: Unexpected exception, expected<java.lang.IllegalArgumentException> but was<java.lang.NullPointerException>
	at org.apache.commons.lang3.Validate.notNull(Validate.java:37)
	at org.apache.commons.lang3.Validate.notNull(Validate.java:36)
	at org.apache.commons.lang3.Validate.noNullElements(Validate.java:59)
	at org.apache.commons.lang3.Validate.noNullElements(Validate.java:65)
	at org.apache.commons.lang3.EnumUtils.generateBitVector(EnumUtils.java:203)
	at org.apache.commons.lang3.EnumUtilsTest.test_generateBitVector_longClassWithArray(EnumUtilsTest.java:164)

test_generateBitVector_nonEnumClass(org.apache.commons.lang3.EnumUtilsTest)  Time elapsed: 0 sec  <<< ERROR!
java.lang.Exception: Unexpected exception, expected<java.lang.IllegalArgumentException> but was<java.lang.NullPointerException>
	at org.apache.commons.lang3.Validate.notNull(Validate.java:37)
	at org.apache.commons.lang3.EnumUtils.asEnum(EnumUtils.java:307)
	at org.apache.commons.lang3.EnumUtils.checkBitVectorable(EnumUtils.java:290)
	at org.apache.commons.lang3.EnumUtils.generateBitVector(EnumUtils.java:143)
	at org.apache.commons.lang3.EnumUtilsTest.test_generateBitVector_nonEnumClass(EnumUtilsTest.java:176)

test_generateBitVectors_nullElement(org.apache.commons.lang3.EnumUtilsTest)  Time elapsed: 0 sec  <<< ERROR!
java.lang.Exception: Unexpected exception, expected<java.lang.IllegalArgumentException> but was<java.lang.NullPointerException>
	at org.apache.commons.lang3.Validate.notNull(Validate.java:37)
	at org.apache.commons.lang3.EnumUtils.asEnum(EnumUtils.java:307)
	at org.apache.commons.lang3.EnumUtils.generateBitVectors(EnumUtils.java:170)
	at org.apache.commons.lang3.EnumUtilsTest.test_generateBitVectors_nullElement(EnumUtilsTest.java:124)

test_generateBitVectorsFromArray(org.apache.commons.lang3.EnumUtilsTest)  Time elapsed: 0.001 sec  <<< ERROR!
java.lang.NullPointerException: EnumClass must be defined.
	at org.apache.commons.lang3.Validate.notNull(Validate.java:37)
	at org.apache.commons.lang3.EnumUtils.asEnum(EnumUtils.java:307)
	at org.apache.commons.lang3.EnumUtils.generateBitVectors(EnumUtils.java:224)
	at org.apache.commons.lang3.EnumUtilsTest.test_generateBitVectorsFromArray(EnumUtilsTest.java:249)

test_processBitVector_longClass(org.apache.commons.lang3.EnumUtilsTest)  Time elapsed: 0 sec  <<< ERROR!
java.lang.Exception: Unexpected exception, expected<java.lang.IllegalArgumentException> but was<java.lang.NullPointerException>
	at org.apache.commons.lang3.Validate.notNull(Validate.java:37)
	at org.apache.commons.lang3.EnumUtils.asEnum(EnumUtils.java:307)
	at org.apache.commons.lang3.EnumUtils.checkBitVectorable(EnumUtils.java:290)
	at org.apache.commons.lang3.EnumUtils.processBitVector(EnumUtils.java:250)
	at org.apache.commons.lang3.EnumUtilsTest.test_processBitVector_longClass(EnumUtilsTest.java:322)

test_generateBitVectors_nonEnumClassWithArray(org.apache.commons.lang3.EnumUtilsTest)  Time elapsed: 0.001 sec  <<< ERROR!
java.lang.Exception: Unexpected exception, expected<java.lang.IllegalArgumentException> but was<java.lang.NullPointerException>
	at org.apache.commons.lang3.Validate.notNull(Validate.java:37)
	at org.apache.commons.lang3.EnumUtils.asEnum(EnumUtils.java:307)
	at org.apache.commons.lang3.EnumUtils.generateBitVectors(EnumUtils.java:224)
	at org.apache.commons.lang3.EnumUtilsTest.test_generateBitVectors_nonEnumClassWithArray(EnumUtilsTest.java:206)

test_generateBitVector_nonEnumClassWithArray(org.apache.commons.lang3.EnumUtilsTest)  Time elapsed: 0 sec  <<< ERROR!
java.lang.Exception: Unexpected exception, expected<java.lang.IllegalArgumentException> but was<java.lang.NullPointerException>
	at org.apache.commons.lang3.Validate.notNull(Validate.java:37)
	at org.apache.commons.lang3.Validate.notNull(Validate.java:36)
	at org.apache.commons.lang3.Validate.noNullElements(Validate.java:59)
	at org.apache.commons.lang3.Validate.noNullElements(Validate.java:65)
	at org.apache.commons.lang3.EnumUtils.generateBitVector(EnumUtils.java:203)
	at org.apache.commons.lang3.EnumUtilsTest.test_generateBitVector_nonEnumClassWithArray(EnumUtilsTest.java:197)

test_processBitVector(org.apache.commons.lang3.EnumUtilsTest)  Time elapsed: 0 sec  <<< ERROR!
java.lang.NullPointerException: EnumClass must be defined.
	at org.apache.commons.lang3.Validate.notNull(Validate.java:37)
	at org.apache.commons.lang3.EnumUtils.asEnum(EnumUtils.java:307)
	at org.apache.commons.lang3.EnumUtils.checkBitVectorable(EnumUtils.java:290)
	at org.apache.commons.lang3.EnumUtils.processBitVector(EnumUtils.java:250)
	at org.apache.commons.lang3.EnumUtilsTest.test_processBitVector(EnumUtilsTest.java:279)

test_generateBitVector_nullArrayElement(org.apache.commons.lang3.EnumUtilsTest)  Time elapsed: 0 sec  <<< ERROR!
java.lang.Exception: Unexpected exception, expected<java.lang.IllegalArgumentException> but was<java.lang.NullPointerException>
	at org.apache.commons.lang3.Validate.notNull(Validate.java:37)
	at org.apache.commons.lang3.Validate.notNull(Validate.java:36)
	at org.apache.commons.lang3.Validate.noNullElements(Validate.java:59)
	at org.apache.commons.lang3.Validate.noNullElements(Validate.java:65)
	at org.apache.commons.lang3.EnumUtils.generateBitVector(EnumUtils.java:203)
	at org.apache.commons.lang3.EnumUtilsTest.test_generateBitVector_nullArrayElement(EnumUtilsTest.java:149)

test_generateBitVectors(org.apache.commons.lang3.EnumUtilsTest)  Time elapsed: 0 sec  <<< ERROR!
java.lang.NullPointerException: EnumClass must be defined.
	at org.apache.commons.lang3.Validate.notNull(Validate.java:37)
	at org.apache.commons.lang3.EnumUtils.asEnum(EnumUtils.java:307)
	at org.apache.commons.lang3.EnumUtils.generateBitVectors(EnumUtils.java:170)
	at org.apache.commons.lang3.EnumUtilsTest.test_generateBitVectors(EnumUtilsTest.java:223)

Running org.apache.commons.lang3.exception.ExceptionUtilsTest
Tests run: 28, Failures: 0, Errors: 0, Skipped: 0, Time elapsed: 0.034 sec - in org.apache.commons.lang3.exception.ExceptionUtilsTest
Running org.apache.commons.lang3.exception.DefaultExceptionContextTest
Tests run: 8, Failures: 0, Errors: 0, Skipped: 0, Time elapsed: 0.007 sec - in org.apache.commons.lang3.exception.DefaultExceptionContextTest
Running org.apache.commons.lang3.exception.ContextedExceptionTest
Tests run: 14, Failures: 0, Errors: 0, Skipped: 0, Time elapsed: 0.008 sec - in org.apache.commons.lang3.exception.ContextedExceptionTest
Running org.apache.commons.lang3.exception.ContextedRuntimeExceptionTest
Tests run: 14, Failures: 0, Errors: 0, Skipped: 0, Time elapsed: 0.009 sec - in org.apache.commons.lang3.exception.ContextedRuntimeExceptionTest
Running org.apache.commons.lang3.BitFieldTest
Tests run: 15, Failures: 0, Errors: 0, Skipped: 0, Time elapsed: 0.002 sec - in org.apache.commons.lang3.BitFieldTest
Running org.apache.commons.lang3.ArrayUtilsRemoveMultipleTest
Tests run: 55, Failures: 0, Errors: 0, Skipped: 0, Time elapsed: 0.012 sec - in org.apache.commons.lang3.ArrayUtilsRemoveMultipleTest
Running org.apache.commons.lang3.HashSetvBitSetTest
Ratio=10% array=100 count=1 extract=11854941 bitset=1192546
Ratio=7% array=100 count=10 extract=16064542 bitset=1204256
Ratio=4% array=100 count=50 extract=23971786 bitset=1107233
Ratio=4% array=100 count=100 extract=10322506 bitset=464445
Ratio=77% array=1000 count=10 extract=6267388 bitset=4869155
Ratio=19% array=1000 count=100 extract=23570687 bitset=4651929
Ratio=7% array=1000 count=500 extract=41716094 bitset=3094096
Ratio=1% array=1000 count=1000 extract=71595421 bitset=743865
Ratio=97% count=0 hash=2546992 bits=2477256
Ratio=96% count=5 hash=3117928 bits=3007259
Ratio=33% count=10 hash=918302 bits=310640
Ratio=23% count=200 hash=17882490 bits=4144015
Ratio=17% count=50 hash=5779366 bits=1006937
Ratio=25% count=100 hash=8783849 bits=2259768
Ratio=22% count=1000 hash=72605064 bits=16119381
Ratio=26% count=2000 hash=143796088 bits=38661835
Tests run: 2, Failures: 0, Errors: 0, Skipped: 0, Time elapsed: 0.637 sec - in org.apache.commons.lang3.HashSetvBitSetTest
Running org.apache.commons.lang3.StringUtilsTest
Tests run: 124, Failures: 0, Errors: 0, Skipped: 0, Time elapsed: 0.117 sec - in org.apache.commons.lang3.StringUtilsTest
Running org.apache.commons.lang3.ArrayUtilsRemoveTest
Tests run: 19, Failures: 0, Errors: 0, Skipped: 0, Time elapsed: 0.001 sec - in org.apache.commons.lang3.ArrayUtilsRemoveTest
Running org.apache.commons.lang3.ObjectUtilsTest
Tests run: 36, Failures: 0, Errors: 2, Skipped: 0, Time elapsed: 0.011 sec <<< FAILURE! - in org.apache.commons.lang3.ObjectUtilsTest
testComparatorMedian(org.apache.commons.lang3.ObjectUtilsTest)  Time elapsed: 0.001 sec  <<< ERROR!
java.lang.NullPointerException: The validated object is null
	at org.apache.commons.lang3.Validate.notNull(Validate.java:37)
	at org.apache.commons.lang3.Validate.notNull(Validate.java:36)
	at org.apache.commons.lang3.ObjectUtilsTest$NonComparableCharSequence.<init>(ObjectUtilsTest.java:649)
	at org.apache.commons.lang3.ObjectUtilsTest.testComparatorMedian(ObjectUtilsTest.java:411)

testMedian(org.apache.commons.lang3.ObjectUtilsTest)  Time elapsed: 0.001 sec  <<< ERROR!
java.lang.NullPointerException: The validated object is null
	at org.apache.commons.lang3.Validate.notNull(Validate.java:37)
	at org.apache.commons.lang3.Validate.notNull(Validate.java:36)
	at org.apache.commons.lang3.Validate.noNullElements(Validate.java:59)
	at org.apache.commons.lang3.Validate.noNullElements(Validate.java:65)
	at org.apache.commons.lang3.ObjectUtils.median(ObjectUtils.java:523)
	at org.apache.commons.lang3.ObjectUtilsTest.testMedian(ObjectUtilsTest.java:383)

Running org.apache.commons.lang3.ClassPathUtilsTest
Tests run: 13, Failures: 0, Errors: 4, Skipped: 0, Time elapsed: 0.003 sec <<< FAILURE! - in org.apache.commons.lang3.ClassPathUtilsTest
testToFullyQualifiedPathClass(org.apache.commons.lang3.ClassPathUtilsTest)  Time elapsed: 0 sec  <<< ERROR!
java.lang.NullPointerException: Parameter 'context' must not be null!
	at org.apache.commons.lang3.Validate.notNull(Validate.java:37)
	at org.apache.commons.lang3.ClassPathUtils.toFullyQualifiedPath(ClassPathUtils.java:107)
	at org.apache.commons.lang3.ClassPathUtilsTest.testToFullyQualifiedPathClass(ClassPathUtilsTest.java:93)

testToFullyQualifiedPathPackage(org.apache.commons.lang3.ClassPathUtilsTest)  Time elapsed: 0 sec  <<< ERROR!
java.lang.NullPointerException: Parameter 'context' must not be null!
	at org.apache.commons.lang3.Validate.notNull(Validate.java:37)
	at org.apache.commons.lang3.ClassPathUtils.toFullyQualifiedPath(ClassPathUtils.java:130)
	at org.apache.commons.lang3.ClassPathUtilsTest.testToFullyQualifiedPathPackage(ClassPathUtilsTest.java:111)

testToFullyQualifiedNamePackageString(org.apache.commons.lang3.ClassPathUtilsTest)  Time elapsed: 0 sec  <<< ERROR!
java.lang.NullPointerException: Parameter 'context' must not be null!
	at org.apache.commons.lang3.Validate.notNull(Validate.java:37)
	at org.apache.commons.lang3.ClassPathUtils.toFullyQualifiedName(ClassPathUtils.java:81)
	at org.apache.commons.lang3.ClassPathUtilsTest.testToFullyQualifiedNamePackageString(ClassPathUtilsTest.java:75)

testToFullyQualifiedNameClassString(org.apache.commons.lang3.ClassPathUtilsTest)  Time elapsed: 0 sec  <<< ERROR!
java.lang.NullPointerException: Parameter 'context' must not be null!
	at org.apache.commons.lang3.Validate.notNull(Validate.java:37)
	at org.apache.commons.lang3.ClassPathUtils.toFullyQualifiedName(ClassPathUtils.java:59)
	at org.apache.commons.lang3.ClassPathUtilsTest.testToFullyQualifiedNameClassString(ClassPathUtilsTest.java:57)

Running org.apache.commons.lang3.math.NumberUtilsTest
Tests run: 91, Failures: 0, Errors: 0, Skipped: 0, Time elapsed: 0.029 sec - in org.apache.commons.lang3.math.NumberUtilsTest
Running org.apache.commons.lang3.math.IEEE754rUtilsTest
Tests run: 3, Failures: 0, Errors: 0, Skipped: 0, Time elapsed: 0 sec - in org.apache.commons.lang3.math.IEEE754rUtilsTest
Running org.apache.commons.lang3.math.FractionTest
Tests run: 25, Failures: 0, Errors: 0, Skipped: 0, Time elapsed: 0.136 sec - in org.apache.commons.lang3.math.FractionTest
Running org.apache.commons.lang3.BooleanUtilsTest
Tests run: 72, Failures: 0, Errors: 0, Skipped: 0, Time elapsed: 0.019 sec - in org.apache.commons.lang3.BooleanUtilsTest
Running org.apache.commons.lang3.CharSequenceUtilsTest
Tests run: 2, Failures: 0, Errors: 0, Skipped: 0, Time elapsed: 0 sec - in org.apache.commons.lang3.CharSequenceUtilsTest
Running org.apache.commons.lang3.CharSetUtilsTest
Tests run: 11, Failures: 0, Errors: 0, Skipped: 0, Time elapsed: 0.001 sec - in org.apache.commons.lang3.CharSetUtilsTest
Running org.apache.commons.lang3.ArrayUtilsAddTest
Tests run: 13, Failures: 0, Errors: 0, Skipped: 0, Time elapsed: 0.002 sec - in org.apache.commons.lang3.ArrayUtilsAddTest
Running org.apache.commons.lang3.CharEncodingTest
Tests run: 6, Failures: 0, Errors: 0, Skipped: 0, Time elapsed: 0.034 sec - in org.apache.commons.lang3.CharEncodingTest
Running org.apache.commons.lang3.ClassUtilsTest
Tests run: 57, Failures: 0, Errors: 0, Skipped: 0, Time elapsed: 0.038 sec - in org.apache.commons.lang3.ClassUtilsTest
Running org.apache.commons.lang3.RangeTest
Tests run: 24, Failures: 0, Errors: 0, Skipped: 0, Time elapsed: 0.01 sec - in org.apache.commons.lang3.RangeTest
Running org.apache.commons.lang3.event.EventUtilsTest
Tests run: 8, Failures: 0, Errors: 6, Skipped: 0, Time elapsed: 0.007 sec <<< FAILURE! - in org.apache.commons.lang3.event.EventUtilsTest
testAddEventListenerWithNoAddMethod(org.apache.commons.lang3.event.EventUtilsTest)  Time elapsed: 0 sec  <<< ERROR!
java.lang.NullPointerException: Listener interface cannot be null.
	at org.apache.commons.lang3.Validate.notNull(Validate.java:37)
	at org.apache.commons.lang3.event.EventListenerSupport.<init>(EventListenerSupport.java:144)
	at org.apache.commons.lang3.event.EventListenerSupport.<init>(EventListenerSupport.java:126)
	at org.apache.commons.lang3.event.EventListenerSupport.create(EventListenerSupport.java:110)
	at org.apache.commons.lang3.event.EventUtilsTest$PropertyChangeSource.<init>(EventUtilsTest.java:255)
	at org.apache.commons.lang3.event.EventUtilsTest.testAddEventListenerWithNoAddMethod(EventUtilsTest.java:74)

testAddEventListener(org.apache.commons.lang3.event.EventUtilsTest)  Time elapsed: 0 sec  <<< ERROR!
java.lang.NullPointerException: Listener interface cannot be null.
	at org.apache.commons.lang3.Validate.notNull(Validate.java:37)
	at org.apache.commons.lang3.event.EventListenerSupport.<init>(EventListenerSupport.java:144)
	at org.apache.commons.lang3.event.EventListenerSupport.<init>(EventListenerSupport.java:126)
	at org.apache.commons.lang3.event.EventListenerSupport.create(EventListenerSupport.java:110)
	at org.apache.commons.lang3.event.EventUtilsTest$PropertyChangeSource.<init>(EventUtilsTest.java:255)
	at org.apache.commons.lang3.event.EventUtilsTest.testAddEventListener(EventUtilsTest.java:61)

testBindEventsToMethod(org.apache.commons.lang3.event.EventUtilsTest)  Time elapsed: 0.001 sec  <<< ERROR!
java.lang.NullPointerException: Listener interface cannot be null.
	at org.apache.commons.lang3.Validate.notNull(Validate.java:37)
	at org.apache.commons.lang3.event.EventListenerSupport.<init>(EventListenerSupport.java:144)
	at org.apache.commons.lang3.event.EventListenerSupport.<init>(EventListenerSupport.java:126)
	at org.apache.commons.lang3.event.EventListenerSupport.create(EventListenerSupport.java:110)
	at org.apache.commons.lang3.event.EventUtilsTest$PropertyChangeSource.<init>(EventUtilsTest.java:255)
	at org.apache.commons.lang3.event.EventUtilsTest.testBindEventsToMethod(EventUtilsTest.java:130)

testAddEventListenerWithPrivateAddMethod(org.apache.commons.lang3.event.EventUtilsTest)  Time elapsed: 0 sec  <<< ERROR!
java.lang.NullPointerException: Listener interface cannot be null.
	at org.apache.commons.lang3.Validate.notNull(Validate.java:37)
	at org.apache.commons.lang3.event.EventListenerSupport.<init>(EventListenerSupport.java:144)
	at org.apache.commons.lang3.event.EventListenerSupport.<init>(EventListenerSupport.java:126)
	at org.apache.commons.lang3.event.EventListenerSupport.create(EventListenerSupport.java:110)
	at org.apache.commons.lang3.event.EventUtilsTest$PropertyChangeSource.<init>(EventUtilsTest.java:255)
	at org.apache.commons.lang3.event.EventUtilsTest.testAddEventListenerWithPrivateAddMethod(EventUtilsTest.java:113)

testBindFilteredEventsToMethod(org.apache.commons.lang3.event.EventUtilsTest)  Time elapsed: 0.002 sec  <<< ERROR!
java.lang.NullPointerException: Listener interface cannot be null.
	at org.apache.commons.lang3.Validate.notNull(Validate.java:37)
	at org.apache.commons.lang3.event.EventListenerSupport.<init>(EventListenerSupport.java:144)
	at org.apache.commons.lang3.event.EventListenerSupport.<init>(EventListenerSupport.java:126)
	at org.apache.commons.lang3.event.EventListenerSupport.create(EventListenerSupport.java:110)
	at org.apache.commons.lang3.event.EventUtilsTest$MultipleEventSource.<init>(EventUtilsTest.java:237)
	at org.apache.commons.lang3.event.EventUtilsTest.testBindFilteredEventsToMethod(EventUtilsTest.java:154)

testBindEventsToMethodWithEvent(org.apache.commons.lang3.event.EventUtilsTest)  Time elapsed: 0 sec  <<< ERROR!
java.lang.NullPointerException: Listener interface cannot be null.
	at org.apache.commons.lang3.Validate.notNull(Validate.java:37)
	at org.apache.commons.lang3.event.EventListenerSupport.<init>(EventListenerSupport.java:144)
	at org.apache.commons.lang3.event.EventListenerSupport.<init>(EventListenerSupport.java:126)
	at org.apache.commons.lang3.event.EventListenerSupport.create(EventListenerSupport.java:110)
	at org.apache.commons.lang3.event.EventUtilsTest$PropertyChangeSource.<init>(EventUtilsTest.java:255)
	at org.apache.commons.lang3.event.EventUtilsTest.testBindEventsToMethodWithEvent(EventUtilsTest.java:142)

Running org.apache.commons.lang3.event.EventListenerSupportTest
Tests run: 9, Failures: 0, Errors: 6, Skipped: 0, Time elapsed: 0.001 sec <<< FAILURE! - in org.apache.commons.lang3.event.EventListenerSupportTest
testRemoveListenerDuringEvent(org.apache.commons.lang3.event.EventListenerSupportTest)  Time elapsed: 0 sec  <<< ERROR!
java.lang.NullPointerException: Listener interface cannot be null.
	at org.apache.commons.lang3.Validate.notNull(Validate.java:37)
	at org.apache.commons.lang3.event.EventListenerSupport.<init>(EventListenerSupport.java:144)
	at org.apache.commons.lang3.event.EventListenerSupport.<init>(EventListenerSupport.java:126)
	at org.apache.commons.lang3.event.EventListenerSupport.create(EventListenerSupport.java:110)
	at org.apache.commons.lang3.event.EventListenerSupportTest.testRemoveListenerDuringEvent(EventListenerSupportTest.java:90)

testSerialization(org.apache.commons.lang3.event.EventListenerSupportTest)  Time elapsed: 0 sec  <<< ERROR!
java.lang.NullPointerException: Listener interface cannot be null.
	at org.apache.commons.lang3.Validate.notNull(Validate.java:37)
	at org.apache.commons.lang3.event.EventListenerSupport.<init>(EventListenerSupport.java:144)
	at org.apache.commons.lang3.event.EventListenerSupport.<init>(EventListenerSupport.java:126)
	at org.apache.commons.lang3.event.EventListenerSupport.create(EventListenerSupport.java:110)
	at org.apache.commons.lang3.event.EventListenerSupportTest.testSerialization(EventListenerSupportTest.java:125)

testGetListeners(org.apache.commons.lang3.event.EventListenerSupportTest)  Time elapsed: 0 sec  <<< ERROR!
java.lang.NullPointerException: Listener interface cannot be null.
	at org.apache.commons.lang3.Validate.notNull(Validate.java:37)
	at org.apache.commons.lang3.event.EventListenerSupport.<init>(EventListenerSupport.java:144)
	at org.apache.commons.lang3.event.EventListenerSupport.<init>(EventListenerSupport.java:126)
	at org.apache.commons.lang3.event.EventListenerSupport.create(EventListenerSupport.java:110)
	at org.apache.commons.lang3.event.EventListenerSupportTest.testGetListeners(EventListenerSupportTest.java:102)

testCreateWithNonInterfaceParameter(org.apache.commons.lang3.event.EventListenerSupportTest)  Time elapsed: 0 sec  <<< ERROR!
java.lang.Exception: Unexpected exception, expected<java.lang.IllegalArgumentException> but was<java.lang.NullPointerException>
	at org.apache.commons.lang3.Validate.notNull(Validate.java:37)
	at org.apache.commons.lang3.event.EventListenerSupport.<init>(EventListenerSupport.java:144)
	at org.apache.commons.lang3.event.EventListenerSupport.<init>(EventListenerSupport.java:126)
	at org.apache.commons.lang3.event.EventListenerSupport.create(EventListenerSupport.java:110)
	at org.apache.commons.lang3.event.EventListenerSupportTest.testCreateWithNonInterfaceParameter(EventListenerSupportTest.java:78)

testEventDispatchOrder(org.apache.commons.lang3.event.EventListenerSupportTest)  Time elapsed: 0 sec  <<< ERROR!
java.lang.NullPointerException: Listener interface cannot be null.
	at org.apache.commons.lang3.Validate.notNull(Validate.java:37)
	at org.apache.commons.lang3.event.EventListenerSupport.<init>(EventListenerSupport.java:144)
	at org.apache.commons.lang3.event.EventListenerSupport.<init>(EventListenerSupport.java:126)
	at org.apache.commons.lang3.event.EventListenerSupport.create(EventListenerSupport.java:110)
	at org.apache.commons.lang3.event.EventListenerSupportTest.testEventDispatchOrder(EventListenerSupportTest.java:62)

testSubclassInvocationHandling(org.apache.commons.lang3.event.EventListenerSupportTest)  Time elapsed: 0 sec  <<< ERROR!
java.lang.NullPointerException: Listener interface cannot be null.
	at org.apache.commons.lang3.Validate.notNull(Validate.java:37)
	at org.apache.commons.lang3.event.EventListenerSupport.<init>(EventListenerSupport.java:144)
	at org.apache.commons.lang3.event.EventListenerSupport.<init>(EventListenerSupport.java:126)
	at org.apache.commons.lang3.event.EventListenerSupportTest$2.<init>(EventListenerSupportTest.java:170)
	at org.apache.commons.lang3.event.EventListenerSupportTest.testSubclassInvocationHandling(EventListenerSupportTest.java:169)

Running org.apache.commons.lang3.ArrayUtilsTest
Tests run: 205, Failures: 0, Errors: 0, Skipped: 0, Time elapsed: 0.065 sec - in org.apache.commons.lang3.ArrayUtilsTest
Running org.apache.commons.lang3.CharUtilsTest
Tests run: 24, Failures: 0, Errors: 0, Skipped: 0, Time elapsed: 0.01 sec - in org.apache.commons.lang3.CharUtilsTest
Running org.apache.commons.lang3.NotImplementedExceptionTest
Tests run: 1, Failures: 0, Errors: 0, Skipped: 0, Time elapsed: 0.002 sec - in org.apache.commons.lang3.NotImplementedExceptionTest
Running org.apache.commons.lang3.StringUtilsEqualsIndexOfTest
Tests run: 50, Failures: 0, Errors: 0, Skipped: 0, Time elapsed: 0.018 sec - in org.apache.commons.lang3.StringUtilsEqualsIndexOfTest
Running org.apache.commons.lang3.RandomUtilsTest
Tests run: 23, Failures: 0, Errors: 0, Skipped: 0, Time elapsed: 0.014 sec - in org.apache.commons.lang3.RandomUtilsTest

Results :


Tests in error: 
  AnnotationUtilsTest.testEquivalence:399 » NullPointer Annotation @org.apache.c...
  AnnotationUtilsTest.testGeneratedAnnotationEquivalentToRealAnnotation:474 » NullPointer
  AnnotationUtilsTest.testNonEquivalentAnnotationsOfSameType:410 » NullPointer A...
  ClassPathUtilsTest.testToFullyQualifiedNameClassString:57 » NullPointer Parame...
  ClassPathUtilsTest.testToFullyQualifiedNamePackageString:75 » NullPointer Para...
  ClassPathUtilsTest.testToFullyQualifiedPathClass:93 » NullPointer Parameter 'c...
  ClassPathUtilsTest.testToFullyQualifiedPathPackage:111 » NullPointer Parameter...
  EnumUtilsTest.test_generateBitVector:211 » NullPointer EnumClass must be defin...
  EnumUtilsTest.test_generateBitVectorFromArray:235 » NullPointer The validated ...
  EnumUtilsTest.test_generateBitVector_longClass »  Unexpected exception, expect...
  EnumUtilsTest.test_generateBitVector_longClassWithArray »  Unexpected exceptio...
  EnumUtilsTest.test_generateBitVector_nonEnumClass »  Unexpected exception, exp...
  EnumUtilsTest.test_generateBitVector_nonEnumClassWithArray »  Unexpected excep...
  EnumUtilsTest.test_generateBitVector_nullArrayElement »  Unexpected exception,...
  EnumUtilsTest.test_generateBitVector_nullElement »  Unexpected exception, expe...
  EnumUtilsTest.test_generateBitVectors:223 » NullPointer EnumClass must be defi...
  EnumUtilsTest.test_generateBitVectorsFromArray:249 » NullPointer EnumClass mus...
  EnumUtilsTest.test_generateBitVectors_nonEnumClass »  Unexpected exception, ex...
  EnumUtilsTest.test_generateBitVectors_nonEnumClassWithArray »  Unexpected exce...
  EnumUtilsTest.test_generateBitVectors_nullArrayElement »  Unexpected exception...
  EnumUtilsTest.test_generateBitVectors_nullElement »  Unexpected exception, exp...
  EnumUtilsTest.test_processBitVector:279 » NullPointer EnumClass must be define...
  EnumUtilsTest.test_processBitVector_longClass »  Unexpected exception, expecte...
  EnumUtilsTest.test_processBitVectors:291 » NullPointer EnumClass must be defin...
  ObjectUtilsTest.testComparatorMedian:411 » NullPointer The validated object is...
  ObjectUtilsTest.testMedian:383 » NullPointer The validated object is null
  ValidateTest.testNoNullElementsArray1:547 » NullPointer The validated object i...
  ValidateTest.testNoNullElementsArray2:571 » NullPointer The validated object i...
  ValidateTest.testNoNullElementsCollection1:598 » NullPointer The validated obj...
  ValidateTest.testNoNullElementsCollection2:624 » NullPointer The validated obj...
  ValidateTest.testNotNull1:112 » NullPointer The validated object is null
  ValidateTest.testNotNull2:129 » NullPointer MSG
  ValidateTest.testValidIndex_array:684 » NullPointer The validated object is nu...
  ValidateTest.testValidIndex_charSequence:784 » NullPointer The validated objec...
  ValidateTest.testValidIndex_collection:736 » NullPointer The validated object ...
  ValidateTest.testValidIndex_withMessage_array:661 » NullPointer The validated ...
  ValidateTest.testValidIndex_withMessage_charSequence:761 » NullPointer The val...
  ValidateTest.testValidIndex_withMessage_collection:711 » NullPointer The valid...
  EventListenerSupportTest.testCreateWithNonInterfaceParameter »  Unexpected exc...
  EventListenerSupportTest.testEventDispatchOrder:62 » NullPointer Listener inte...
  EventListenerSupportTest.testGetListeners:102 » NullPointer Listener interface...
  EventListenerSupportTest.testRemoveListenerDuringEvent:90 » NullPointer Listen...
  EventListenerSupportTest.testSerialization:125 » NullPointer Listener interfac...
  EventListenerSupportTest.testSubclassInvocationHandling:169 » NullPointer List...
  EventUtilsTest.testAddEventListener:61 » NullPointer Listener interface cannot...
  EventUtilsTest.testAddEventListenerWithNoAddMethod:74 » NullPointer Listener i...
  EventUtilsTest.testAddEventListenerWithPrivateAddMethod:113 » NullPointer List...
  EventUtilsTest.testBindEventsToMethod:130 » NullPointer Listener interface can...
  EventUtilsTest.testBindEventsToMethodWithEvent:142 » NullPointer Listener inte...
  EventUtilsTest.testBindFilteredEventsToMethod:154 » NullPointer Listener inter...
  ConstructorUtilsTest.testGetAccessibleConstructor:161 » NullPointer constructo...
  ConstructorUtilsTest.testGetAccessibleConstructorFromDescription:170 » NullPointer
  ConstructorUtilsTest.testGetMatchingAccessibleMethod:178->expectMatchingAccessibleConstructorParameterTypes:226 » NullPointer
  ConstructorUtilsTest.testInvokeConstructor:102 » NullPointer class cannot be n...
  ConstructorUtilsTest.testInvokeExactConstructor:125 » NullPointer class cannot...
  ConstructorUtilsTest.testNullArgument:220->expectMatchingAccessibleConstructorParameterTypes:226 » NullPointer
  MethodUtilsTest.testGetOverrideHierarchyExcludingInterfaces:423 » NullPointer ...
  MethodUtilsTest.testGetOverrideHierarchyIncludingInterfaces:403 » NullPointer ...
  TypeLiteralTest.testBasic:31 » NullPointer var is null
  TypeLiteralTest.testEquals:46 » NullPointer var is null
  TypeLiteralTest.testTyped:38 » NullPointer var is null
  TypeUtilsTest.testDetermineTypeVariableAssignments:543 » NullPointer cls is nu...
  TypeUtilsTest.testGenericArrayType:728 » NullPointer raw class is null
  TypeUtilsTest.testIsAssignable:161->delegateBooleanAssertion:450 » NullPointer
  TypeUtilsTest.testLang820:675 » NullPointer null value specified for bounds ar...
  TypeUtilsTest.testLowerBoundedWildcardType:716 » NullPointer The validated obj...
  TypeUtilsTest.testParameterize:680 » NullPointer raw class is null
  TypeUtilsTest.testParameterizeWithOwner:688 » NullPointer raw class is null
  TypeUtilsTest.testToLongString:737 » NullPointer var is null
  TypeUtilsTest.testTypesSatisfyVariables:529 » NullPointer typeVarAssigns is nu...
  TypeUtilsTest.testUnboundedWildcardType:706 » NullPointer wildcardType is null
  TypeUtilsTest.testWildcardType:699 » NullPointer The validated object is null


Tests run: 3526, Failures: 0, Errors: 72, Skipped: 97

[INFO] ------------------------------------------------------------------------
[INFO] BUILD FAILURE
[INFO] ------------------------------------------------------------------------
[INFO] Total time: 33.852s
[INFO] Finished at: Tue Aug 04 03:09:05 BST 2015
[INFO] Final Memory: 23M/413M
[INFO] ------------------------------------------------------------------------
[ERROR] Failed to execute goal org.apache.maven.plugins:maven-surefire-plugin:2.18:test (default-test) on project commons-lang3: There are test failures.
[ERROR] 
[ERROR] Please refer to /home/perham/Study/LittleDarwin/Cases/commons-lang3-3.4-src/target/surefire-reports for the individual test results.
[ERROR] -> [Help 1]
[ERROR] 
[ERROR] To see the full stack trace of the errors, re-run Maven with the -e switch.
[ERROR] Re-run Maven using the -X switch to enable full debug logging.
[ERROR] 
[ERROR] For more information about the errors and possible solutions, please read the following articles:
[ERROR] [Help 1] http://cwiki.apache.org/confluence/display/MAVEN/MojoFailureException
