[INFO] Scanning for projects...
[INFO]                                                                         
[INFO] ------------------------------------------------------------------------
[INFO] Building Apache Commons Lang 3.4
[INFO] ------------------------------------------------------------------------
[INFO] 
[INFO] --- maven-enforcer-plugin:1.3.1:enforce (enforce-maven-3) @ commons-lang3 ---
[INFO] 
[INFO] --- build-helper-maven-plugin:1.8:parse-version (parse-version) @ commons-lang3 ---
[INFO] 
[INFO] --- maven-antrun-plugin:1.8:run (javadoc.resources) @ commons-lang3 ---
[INFO] Executing tasks

main:
[INFO] Executed tasks
[INFO] 
[INFO] --- maven-remote-resources-plugin:1.5:process (default) @ commons-lang3 ---
[INFO] 
[INFO] --- buildnumber-maven-plugin:1.3:create (default) @ commons-lang3 ---
[INFO] Executing: /bin/sh -c cd /home/perham/Study/LittleDarwin/Cases/commons-lang3-3.4-src && svn --non-interactive info
[INFO] Working directory: /home/perham/Study/LittleDarwin/Cases/commons-lang3-3.4-src
[INFO] Storing buildNumber: ?????? at timestamp: 1438653105142
[INFO] Executing: /bin/sh -c cd /home/perham/Study/LittleDarwin/Cases/commons-lang3-3.4-src && svn --non-interactive info
[INFO] Working directory: /home/perham/Study/LittleDarwin/Cases/commons-lang3-3.4-src
[INFO] Storing buildScmBranch: UNKNOWN_BRANCH
[INFO] 
[INFO] --- maven-resources-plugin:2.7:resources (default-resources) @ commons-lang3 ---
[INFO] Using 'ISO-8859-1' encoding to copy filtered resources.
[INFO] Copying 0 resource
[INFO] Copying 2 resources to META-INF
[INFO] 
[INFO] --- maven-compiler-plugin:3.2:compile (default-compile) @ commons-lang3 ---
[INFO] Changes detected - recompiling the module!
[INFO] Compiling 133 source files to /home/perham/Study/LittleDarwin/Cases/commons-lang3-3.4-src/target/classes
[INFO] /home/perham/Study/LittleDarwin/Cases/commons-lang3-3.4-src/src/main/java/org/apache/commons/lang3/SerializationUtils.java: /home/perham/Study/LittleDarwin/Cases/commons-lang3-3.4-src/src/main/java/org/apache/commons/lang3/SerializationUtils.java uses unchecked or unsafe operations.
[INFO] /home/perham/Study/LittleDarwin/Cases/commons-lang3-3.4-src/src/main/java/org/apache/commons/lang3/SerializationUtils.java: Recompile with -Xlint:unchecked for details.
[INFO] 
[INFO] --- maven-bundle-plugin:2.5.3:manifest (bundle-manifest) @ commons-lang3 ---
[INFO] 
[INFO] --- animal-sniffer-maven-plugin:1.13:check (checkAPIcompatibility) @ commons-lang3 ---
[INFO] Checking unresolved references to org.codehaus.mojo.signature:java16:1.0
[INFO] 
[INFO] --- maven-resources-plugin:2.7:testResources (default-testResources) @ commons-lang3 ---
[INFO] Using 'ISO-8859-1' encoding to copy filtered resources.
[INFO] Copying 2 resources
[INFO] Copying 2 resources to META-INF
[INFO] 
[INFO] --- maven-compiler-plugin:3.2:testCompile (default-testCompile) @ commons-lang3 ---
[INFO] Nothing to compile - all classes are up to date
[INFO] 
[INFO] --- maven-surefire-plugin:2.18:test (default-test) @ commons-lang3 ---
[INFO] Surefire report directory: /home/perham/Study/LittleDarwin/Cases/commons-lang3-3.4-src/target/surefire-reports

-------------------------------------------------------
 T E S T S
-------------------------------------------------------
Running org.apache.commons.lang3.ValidateTest
Tests run: 63, Failures: 0, Errors: 1, Skipped: 0, Time elapsed: 0.038 sec <<< FAILURE! - in org.apache.commons.lang3.ValidateTest
testInclusiveBetweenLong_withMessage(org.apache.commons.lang3.ValidateTest)  Time elapsed: 0.007 sec  <<< ERROR!
java.lang.IllegalArgumentException: Error
	at org.apache.commons.lang3.Validate.inclusiveBetween(Validate.java:93)
	at org.apache.commons.lang3.ValidateTest.testInclusiveBetweenLong_withMessage(ValidateTest.java:876)

Running org.apache.commons.lang3.LocaleUtilsTest
Tests run: 15, Failures: 0, Errors: 0, Skipped: 0, Time elapsed: 0.018 sec - in org.apache.commons.lang3.LocaleUtilsTest
Running org.apache.commons.lang3.tuple.MutableTripleTest
Tests run: 8, Failures: 0, Errors: 0, Skipped: 0, Time elapsed: 0.009 sec - in org.apache.commons.lang3.tuple.MutableTripleTest
Running org.apache.commons.lang3.tuple.TripleTest
Tests run: 10, Failures: 0, Errors: 0, Skipped: 0, Time elapsed: 0.001 sec - in org.apache.commons.lang3.tuple.TripleTest
Running org.apache.commons.lang3.tuple.ImmutablePairTest
Tests run: 6, Failures: 0, Errors: 0, Skipped: 0, Time elapsed: 0 sec - in org.apache.commons.lang3.tuple.ImmutablePairTest
Running org.apache.commons.lang3.tuple.MutablePairTest
Tests run: 8, Failures: 0, Errors: 0, Skipped: 0, Time elapsed: 0 sec - in org.apache.commons.lang3.tuple.MutablePairTest
Running org.apache.commons.lang3.tuple.ImmutableTripleTest
Tests run: 6, Failures: 0, Errors: 0, Skipped: 0, Time elapsed: 0.001 sec - in org.apache.commons.lang3.tuple.ImmutableTripleTest
Running org.apache.commons.lang3.tuple.PairTest
Tests run: 9, Failures: 0, Errors: 0, Skipped: 0, Time elapsed: 0.001 sec - in org.apache.commons.lang3.tuple.PairTest
Running org.apache.commons.lang3.StringUtilsIsTest
Tests run: 8, Failures: 0, Errors: 0, Skipped: 0, Time elapsed: 0.004 sec - in org.apache.commons.lang3.StringUtilsIsTest
Running org.apache.commons.lang3.JavaVersionTest
Tests run: 3, Failures: 0, Errors: 0, Skipped: 0, Time elapsed: 0.001 sec - in org.apache.commons.lang3.JavaVersionTest
Running org.apache.commons.lang3.builder.NoFieldNamesToStringStyleTest
Tests run: 8, Failures: 0, Errors: 0, Skipped: 0, Time elapsed: 0.004 sec - in org.apache.commons.lang3.builder.NoFieldNamesToStringStyleTest
Running org.apache.commons.lang3.builder.ShortPrefixToStringStyleTest
Tests run: 8, Failures: 0, Errors: 0, Skipped: 0, Time elapsed: 0.003 sec - in org.apache.commons.lang3.builder.ShortPrefixToStringStyleTest
Running org.apache.commons.lang3.builder.DiffResultTest
Tests run: 9, Failures: 0, Errors: 0, Skipped: 0, Time elapsed: 0.007 sec - in org.apache.commons.lang3.builder.DiffResultTest
Running org.apache.commons.lang3.builder.CompareToBuilderTest
Tests run: 48, Failures: 0, Errors: 0, Skipped: 0, Time elapsed: 0.016 sec - in org.apache.commons.lang3.builder.CompareToBuilderTest
Running org.apache.commons.lang3.builder.MultilineRecursiveToStringStyleTest
Tests run: 10, Failures: 0, Errors: 0, Skipped: 0, Time elapsed: 0.004 sec - in org.apache.commons.lang3.builder.MultilineRecursiveToStringStyleTest
Running org.apache.commons.lang3.builder.RecursiveToStringStyleTest
Tests run: 8, Failures: 0, Errors: 0, Skipped: 0, Time elapsed: 0.004 sec - in org.apache.commons.lang3.builder.RecursiveToStringStyleTest
Running org.apache.commons.lang3.builder.DefaultToStringStyleTest
Tests run: 8, Failures: 0, Errors: 0, Skipped: 0, Time elapsed: 0.003 sec - in org.apache.commons.lang3.builder.DefaultToStringStyleTest
Running org.apache.commons.lang3.builder.ReflectionToStringBuilderExcludeTest
Tests run: 11, Failures: 0, Errors: 0, Skipped: 0, Time elapsed: 0.003 sec - in org.apache.commons.lang3.builder.ReflectionToStringBuilderExcludeTest
Running org.apache.commons.lang3.builder.StandardToStringStyleTest
Tests run: 8, Failures: 0, Errors: 0, Skipped: 0, Time elapsed: 0.001 sec - in org.apache.commons.lang3.builder.StandardToStringStyleTest
Running org.apache.commons.lang3.builder.ToStringStyleTest
Tests run: 12, Failures: 0, Errors: 0, Skipped: 0, Time elapsed: 0.001 sec - in org.apache.commons.lang3.builder.ToStringStyleTest
Running org.apache.commons.lang3.builder.DiffTest
Tests run: 4, Failures: 0, Errors: 0, Skipped: 0, Time elapsed: 0 sec - in org.apache.commons.lang3.builder.DiffTest
Running org.apache.commons.lang3.builder.SimpleToStringStyleTest
Tests run: 8, Failures: 0, Errors: 0, Skipped: 0, Time elapsed: 0.001 sec - in org.apache.commons.lang3.builder.SimpleToStringStyleTest
Running org.apache.commons.lang3.builder.MultiLineToStringStyleTest
Tests run: 8, Failures: 0, Errors: 0, Skipped: 0, Time elapsed: 0.004 sec - in org.apache.commons.lang3.builder.MultiLineToStringStyleTest
Running org.apache.commons.lang3.builder.ToStringStyleConcurrencyTest
Tests run: 3, Failures: 0, Errors: 0, Skipped: 0, Time elapsed: 4.581 sec - in org.apache.commons.lang3.builder.ToStringStyleConcurrencyTest
Running org.apache.commons.lang3.builder.ReflectionToStringBuilderMutateInspectConcurrencyTest
Tests run: 1, Failures: 0, Errors: 0, Skipped: 1, Time elapsed: 0 sec - in org.apache.commons.lang3.builder.ReflectionToStringBuilderMutateInspectConcurrencyTest
Running org.apache.commons.lang3.builder.ToStringBuilderTest
Tests run: 74, Failures: 0, Errors: 0, Skipped: 1, Time elapsed: 0.047 sec - in org.apache.commons.lang3.builder.ToStringBuilderTest
Running org.apache.commons.lang3.builder.EqualsBuilderTest
Tests run: 48, Failures: 0, Errors: 0, Skipped: 0, Time elapsed: 0.029 sec - in org.apache.commons.lang3.builder.EqualsBuilderTest
Running org.apache.commons.lang3.builder.HashCodeBuilderAndEqualsBuilderTest
Tests run: 4, Failures: 0, Errors: 0, Skipped: 0, Time elapsed: 0.005 sec - in org.apache.commons.lang3.builder.HashCodeBuilderAndEqualsBuilderTest
Running org.apache.commons.lang3.builder.ReflectionToStringBuilderConcurrencyTest
Tests run: 3, Failures: 0, Errors: 0, Skipped: 3, Time elapsed: 0 sec - in org.apache.commons.lang3.builder.ReflectionToStringBuilderConcurrencyTest
Running org.apache.commons.lang3.builder.JsonToStringStyleTest
Tests run: 9, Failures: 0, Errors: 0, Skipped: 0, Time elapsed: 0.002 sec - in org.apache.commons.lang3.builder.JsonToStringStyleTest
Running org.apache.commons.lang3.builder.NoClassNameToStringStyleTest
Tests run: 8, Failures: 0, Errors: 0, Skipped: 0, Time elapsed: 0.001 sec - in org.apache.commons.lang3.builder.NoClassNameToStringStyleTest
Running org.apache.commons.lang3.builder.DiffBuilderTest
Tests run: 30, Failures: 0, Errors: 0, Skipped: 0, Time elapsed: 0.022 sec - in org.apache.commons.lang3.builder.DiffBuilderTest
Running org.apache.commons.lang3.builder.HashCodeBuilderTest
Tests run: 44, Failures: 0, Errors: 0, Skipped: 0, Time elapsed: 0.014 sec - in org.apache.commons.lang3.builder.HashCodeBuilderTest
Running org.apache.commons.lang3.concurrent.AtomicInitializerTest
Tests run: 3, Failures: 0, Errors: 0, Skipped: 0, Time elapsed: 0.006 sec - in org.apache.commons.lang3.concurrent.AtomicInitializerTest
Running org.apache.commons.lang3.concurrent.CallableBackgroundInitializerTest
Tests run: 4, Failures: 0, Errors: 0, Skipped: 0, Time elapsed: 0.002 sec - in org.apache.commons.lang3.concurrent.CallableBackgroundInitializerTest
Running org.apache.commons.lang3.concurrent.BackgroundInitializerTest
Tests run: 15, Failures: 0, Errors: 0, Skipped: 0, Time elapsed: 0.017 sec - in org.apache.commons.lang3.concurrent.BackgroundInitializerTest
Running org.apache.commons.lang3.concurrent.LazyInitializerTest
Tests run: 3, Failures: 0, Errors: 0, Skipped: 0, Time elapsed: 0.005 sec - in org.apache.commons.lang3.concurrent.LazyInitializerTest
Running org.apache.commons.lang3.concurrent.BasicThreadFactoryTest
Tests run: 15, Failures: 0, Errors: 0, Skipped: 0, Time elapsed: 0.041 sec - in org.apache.commons.lang3.concurrent.BasicThreadFactoryTest
Running org.apache.commons.lang3.concurrent.ConstantInitializerTest
Tests run: 7, Failures: 0, Errors: 0, Skipped: 0, Time elapsed: 0.001 sec - in org.apache.commons.lang3.concurrent.ConstantInitializerTest
Running org.apache.commons.lang3.concurrent.MultiBackgroundInitializerTest
Tests run: 17, Failures: 0, Errors: 0, Skipped: 0, Time elapsed: 0.065 sec - in org.apache.commons.lang3.concurrent.MultiBackgroundInitializerTest
Running org.apache.commons.lang3.concurrent.AtomicSafeInitializerTest
Tests run: 4, Failures: 0, Errors: 0, Skipped: 0, Time elapsed: 0.011 sec - in org.apache.commons.lang3.concurrent.AtomicSafeInitializerTest
Running org.apache.commons.lang3.concurrent.ConcurrentUtilsTest
Tests run: 40, Failures: 0, Errors: 0, Skipped: 0, Time elapsed: 0.011 sec - in org.apache.commons.lang3.concurrent.ConcurrentUtilsTest
Running org.apache.commons.lang3.concurrent.TimedSemaphoreTest
Tests run: 15, Failures: 0, Errors: 14, Skipped: 0, Time elapsed: 0.013 sec <<< FAILURE! - in org.apache.commons.lang3.concurrent.TimedSemaphoreTest
testPassAfterShutdown(org.apache.commons.lang3.concurrent.TimedSemaphoreTest)  Time elapsed: 0 sec  <<< ERROR!
java.lang.Exception: Unexpected exception, expected<java.lang.IllegalStateException> but was<java.lang.IllegalArgumentException>
	at org.apache.commons.lang3.Validate.inclusiveBetween(Validate.java:93)
	at org.apache.commons.lang3.concurrent.TimedSemaphore.<init>(TimedSemaphore.java:206)
	at org.apache.commons.lang3.concurrent.TimedSemaphore.<init>(TimedSemaphore.java:189)
	at org.apache.commons.lang3.concurrent.TimedSemaphoreTest.testPassAfterShutdown(TimedSemaphoreTest.java:311)

testAcquireMultipleThreads(org.apache.commons.lang3.concurrent.TimedSemaphoreTest)  Time elapsed: 0.007 sec  <<< ERROR!
java.lang.IllegalArgumentException: Time period must be greater than 0!
	at org.apache.commons.lang3.Validate.inclusiveBetween(Validate.java:93)
	at org.apache.commons.lang3.concurrent.TimedSemaphore.<init>(TimedSemaphore.java:206)
	at org.apache.commons.lang3.concurrent.TimedSemaphoreTest$TimedSemaphoreTestImpl.<init>(TimedSemaphoreTest.java:410)
	at org.apache.commons.lang3.concurrent.TimedSemaphoreTest.testAcquireMultipleThreads(TimedSemaphoreTest.java:257)

testAcquireMultiplePeriods(org.apache.commons.lang3.concurrent.TimedSemaphoreTest)  Time elapsed: 0 sec  <<< ERROR!
java.lang.IllegalArgumentException: Time period must be greater than 0!
	at org.apache.commons.lang3.Validate.inclusiveBetween(Validate.java:93)
	at org.apache.commons.lang3.concurrent.TimedSemaphore.<init>(TimedSemaphore.java:206)
	at org.apache.commons.lang3.concurrent.TimedSemaphore.<init>(TimedSemaphore.java:189)
	at org.apache.commons.lang3.concurrent.TimedSemaphoreTest$TimedSemaphoreTestImpl.<init>(TimedSemaphoreTest.java:405)
	at org.apache.commons.lang3.concurrent.TimedSemaphoreTest.testAcquireMultiplePeriods(TimedSemaphoreTest.java:327)

testGetAverageCallsPerPeriod(org.apache.commons.lang3.concurrent.TimedSemaphoreTest)  Time elapsed: 0.001 sec  <<< ERROR!
java.lang.IllegalArgumentException: Time period must be greater than 0!
	at org.apache.commons.lang3.Validate.inclusiveBetween(Validate.java:93)
	at org.apache.commons.lang3.concurrent.TimedSemaphore.<init>(TimedSemaphore.java:206)
	at org.apache.commons.lang3.concurrent.TimedSemaphoreTest.testGetAverageCallsPerPeriod(TimedSemaphoreTest.java:350)

testInit(org.apache.commons.lang3.concurrent.TimedSemaphoreTest)  Time elapsed: 0 sec  <<< ERROR!
java.lang.IllegalArgumentException: Time period must be greater than 0!
	at org.apache.commons.lang3.Validate.inclusiveBetween(Validate.java:93)
	at org.apache.commons.lang3.concurrent.TimedSemaphore.<init>(TimedSemaphore.java:206)
	at org.apache.commons.lang3.concurrent.TimedSemaphoreTest.testInit(TimedSemaphoreTest.java:57)

testInitDefaultService(org.apache.commons.lang3.concurrent.TimedSemaphoreTest)  Time elapsed: 0.001 sec  <<< ERROR!
java.lang.IllegalArgumentException: Time period must be greater than 0!
	at org.apache.commons.lang3.Validate.inclusiveBetween(Validate.java:93)
	at org.apache.commons.lang3.concurrent.TimedSemaphore.<init>(TimedSemaphore.java:206)
	at org.apache.commons.lang3.concurrent.TimedSemaphore.<init>(TimedSemaphore.java:189)
	at org.apache.commons.lang3.concurrent.TimedSemaphoreTest.testInitDefaultService(TimedSemaphoreTest.java:86)

testShutdownOwnExecutor(org.apache.commons.lang3.concurrent.TimedSemaphoreTest)  Time elapsed: 0 sec  <<< ERROR!
java.lang.IllegalArgumentException: Time period must be greater than 0!
	at org.apache.commons.lang3.Validate.inclusiveBetween(Validate.java:93)
	at org.apache.commons.lang3.concurrent.TimedSemaphore.<init>(TimedSemaphore.java:206)
	at org.apache.commons.lang3.concurrent.TimedSemaphore.<init>(TimedSemaphore.java:189)
	at org.apache.commons.lang3.concurrent.TimedSemaphoreTest.testShutdownOwnExecutor(TimedSemaphoreTest.java:126)

testShutdownSharedExecutorTask(org.apache.commons.lang3.concurrent.TimedSemaphoreTest)  Time elapsed: 0.001 sec  <<< ERROR!
java.lang.IllegalArgumentException: Time period must be greater than 0!
	at org.apache.commons.lang3.Validate.inclusiveBetween(Validate.java:93)
	at org.apache.commons.lang3.concurrent.TimedSemaphore.<init>(TimedSemaphore.java:206)
	at org.apache.commons.lang3.concurrent.TimedSemaphoreTest$TimedSemaphoreTestImpl.<init>(TimedSemaphoreTest.java:410)
	at org.apache.commons.lang3.concurrent.TimedSemaphoreTest.testShutdownSharedExecutorTask(TimedSemaphoreTest.java:176)

testShutdownMultipleTimes(org.apache.commons.lang3.concurrent.TimedSemaphoreTest)  Time elapsed: 0 sec  <<< ERROR!
java.lang.IllegalArgumentException: Time period must be greater than 0!
	at org.apache.commons.lang3.Validate.inclusiveBetween(Validate.java:93)
	at org.apache.commons.lang3.concurrent.TimedSemaphore.<init>(TimedSemaphore.java:206)
	at org.apache.commons.lang3.concurrent.TimedSemaphoreTest$TimedSemaphoreTestImpl.<init>(TimedSemaphoreTest.java:410)
	at org.apache.commons.lang3.concurrent.TimedSemaphoreTest.testShutdownMultipleTimes(TimedSemaphoreTest.java:197)

testAcquireNoLimit(org.apache.commons.lang3.concurrent.TimedSemaphoreTest)  Time elapsed: 0.001 sec  <<< ERROR!
java.lang.IllegalArgumentException: Time period must be greater than 0!
	at org.apache.commons.lang3.Validate.inclusiveBetween(Validate.java:93)
	at org.apache.commons.lang3.concurrent.TimedSemaphore.<init>(TimedSemaphore.java:206)
	at org.apache.commons.lang3.concurrent.TimedSemaphoreTest$TimedSemaphoreTestImpl.<init>(TimedSemaphoreTest.java:410)
	at org.apache.commons.lang3.concurrent.TimedSemaphoreTest.testAcquireNoLimit(TimedSemaphoreTest.java:294)

testShutdownSharedExecutorNoTask(org.apache.commons.lang3.concurrent.TimedSemaphoreTest)  Time elapsed: 0 sec  <<< ERROR!
java.lang.IllegalArgumentException: Time period must be greater than 0!
	at org.apache.commons.lang3.Validate.inclusiveBetween(Validate.java:93)
	at org.apache.commons.lang3.concurrent.TimedSemaphore.<init>(TimedSemaphore.java:206)
	at org.apache.commons.lang3.concurrent.TimedSemaphoreTest.testShutdownSharedExecutorNoTask(TimedSemaphoreTest.java:142)

testAcquireLimit(org.apache.commons.lang3.concurrent.TimedSemaphoreTest)  Time elapsed: 0.001 sec  <<< ERROR!
java.lang.IllegalArgumentException: Time period must be greater than 0!
	at org.apache.commons.lang3.Validate.inclusiveBetween(Validate.java:93)
	at org.apache.commons.lang3.concurrent.TimedSemaphore.<init>(TimedSemaphore.java:206)
	at org.apache.commons.lang3.concurrent.TimedSemaphoreTest.testAcquireLimit(TimedSemaphoreTest.java:220)

testStartTimer(org.apache.commons.lang3.concurrent.TimedSemaphoreTest)  Time elapsed: 0 sec  <<< ERROR!
java.lang.IllegalArgumentException: Time period must be greater than 0!
	at org.apache.commons.lang3.Validate.inclusiveBetween(Validate.java:93)
	at org.apache.commons.lang3.concurrent.TimedSemaphore.<init>(TimedSemaphore.java:206)
	at org.apache.commons.lang3.concurrent.TimedSemaphore.<init>(TimedSemaphore.java:189)
	at org.apache.commons.lang3.concurrent.TimedSemaphoreTest$TimedSemaphoreTestImpl.<init>(TimedSemaphoreTest.java:405)
	at org.apache.commons.lang3.concurrent.TimedSemaphoreTest.testStartTimer(TimedSemaphoreTest.java:104)

testGetAvailablePermits(org.apache.commons.lang3.concurrent.TimedSemaphoreTest)  Time elapsed: 0.001 sec  <<< ERROR!
java.lang.IllegalArgumentException: Time period must be greater than 0!
	at org.apache.commons.lang3.Validate.inclusiveBetween(Validate.java:93)
	at org.apache.commons.lang3.concurrent.TimedSemaphore.<init>(TimedSemaphore.java:206)
	at org.apache.commons.lang3.concurrent.TimedSemaphoreTest.testGetAvailablePermits(TimedSemaphoreTest.java:376)

Running org.apache.commons.lang3.StringUtilsSubstringTest
Tests run: 14, Failures: 0, Errors: 0, Skipped: 0, Time elapsed: 0.001 sec - in org.apache.commons.lang3.StringUtilsSubstringTest
Running org.apache.commons.lang3.SystemUtilsTest
Tests run: 12, Failures: 0, Errors: 0, Skipped: 0, Time elapsed: 0.002 sec - in org.apache.commons.lang3.SystemUtilsTest
Running org.apache.commons.lang3.CharRangeTest
Tests run: 16, Failures: 0, Errors: 0, Skipped: 0, Time elapsed: 0.087 sec - in org.apache.commons.lang3.CharRangeTest
Running org.apache.commons.lang3.CharSetTest
Tests run: 14, Failures: 0, Errors: 0, Skipped: 0, Time elapsed: 0.001 sec - in org.apache.commons.lang3.CharSetTest
Running org.apache.commons.lang3.StringUtilsStartsEndsWithTest
Tests run: 6, Failures: 0, Errors: 0, Skipped: 0, Time elapsed: 0.002 sec - in org.apache.commons.lang3.StringUtilsStartsEndsWithTest
Running org.apache.commons.lang3.RandomStringUtilsTest
Tests run: 11, Failures: 0, Errors: 0, Skipped: 0, Time elapsed: 0.034 sec - in org.apache.commons.lang3.RandomStringUtilsTest
Running org.apache.commons.lang3.SerializationUtilsTest
Tests run: 26, Failures: 0, Errors: 0, Skipped: 0, Time elapsed: 0.046 sec - in org.apache.commons.lang3.SerializationUtilsTest
Running org.apache.commons.lang3.time.StopWatchTest
Tests run: 8, Failures: 0, Errors: 2, Skipped: 0, Time elapsed: 3.163 sec <<< FAILURE! - in org.apache.commons.lang3.time.StopWatchTest
testStopWatchSimpleGet(org.apache.commons.lang3.time.StopWatchTest)  Time elapsed: 0.004 sec  <<< ERROR!
java.lang.IllegalArgumentException: durationMillis must not be negative
	at org.apache.commons.lang3.Validate.inclusiveBetween(Validate.java:93)
	at org.apache.commons.lang3.time.DurationFormatUtils.formatDuration(DurationFormatUtils.java:131)
	at org.apache.commons.lang3.time.DurationFormatUtils.formatDuration(DurationFormatUtils.java:114)
	at org.apache.commons.lang3.time.DurationFormatUtils.formatDurationHMS(DurationFormatUtils.java:83)
	at org.apache.commons.lang3.time.StopWatch.toString(StopWatch.java:417)
	at org.apache.commons.lang3.time.StopWatchTest.testStopWatchSimpleGet(StopWatchTest.java:55)

testStopWatchSplit(org.apache.commons.lang3.time.StopWatchTest)  Time elapsed: 0.552 sec  <<< ERROR!
java.lang.IllegalArgumentException: durationMillis must not be negative
	at org.apache.commons.lang3.Validate.inclusiveBetween(Validate.java:93)
	at org.apache.commons.lang3.time.DurationFormatUtils.formatDuration(DurationFormatUtils.java:131)
	at org.apache.commons.lang3.time.DurationFormatUtils.formatDuration(DurationFormatUtils.java:114)
	at org.apache.commons.lang3.time.DurationFormatUtils.formatDurationHMS(DurationFormatUtils.java:83)
	at org.apache.commons.lang3.time.StopWatch.toSplitString(StopWatch.java:433)
	at org.apache.commons.lang3.time.StopWatchTest.testStopWatchSplit(StopWatchTest.java:69)

Running org.apache.commons.lang3.time.DateUtilsRoundingTest
Tests run: 22, Failures: 0, Errors: 0, Skipped: 0, Time elapsed: 0.159 sec - in org.apache.commons.lang3.time.DateUtilsRoundingTest
Running org.apache.commons.lang3.time.FastDateParserTest
Tests run: 33, Failures: 0, Errors: 0, Skipped: 0, Time elapsed: 2.004 sec - in org.apache.commons.lang3.time.FastDateParserTest
Running org.apache.commons.lang3.time.FastDateFormat_ParserTest
Tests run: 33, Failures: 0, Errors: 0, Skipped: 0, Time elapsed: 0.57 sec - in org.apache.commons.lang3.time.FastDateFormat_ParserTest
Running org.apache.commons.lang3.time.DurationFormatUtilsTest
Tests run: 25, Failures: 0, Errors: 7, Skipped: 0, Time elapsed: 0.521 sec <<< FAILURE! - in org.apache.commons.lang3.time.DurationFormatUtilsTest
testLANG982(org.apache.commons.lang3.time.DurationFormatUtilsTest)  Time elapsed: 0 sec  <<< ERROR!
java.lang.IllegalArgumentException: durationMillis must not be negative
	at org.apache.commons.lang3.Validate.inclusiveBetween(Validate.java:93)
	at org.apache.commons.lang3.time.DurationFormatUtils.formatDuration(DurationFormatUtils.java:131)
	at org.apache.commons.lang3.time.DurationFormatUtils.formatDuration(DurationFormatUtils.java:114)
	at org.apache.commons.lang3.time.DurationFormatUtilsTest.testLANG982(DurationFormatUtilsTest.java:556)

testLANG984(org.apache.commons.lang3.time.DurationFormatUtilsTest)  Time elapsed: 0 sec  <<< ERROR!
java.lang.IllegalArgumentException: durationMillis must not be negative
	at org.apache.commons.lang3.Validate.inclusiveBetween(Validate.java:93)
	at org.apache.commons.lang3.time.DurationFormatUtils.formatDuration(DurationFormatUtils.java:131)
	at org.apache.commons.lang3.time.DurationFormatUtils.formatDuration(DurationFormatUtils.java:114)
	at org.apache.commons.lang3.time.DurationFormatUtilsTest.testLANG984(DurationFormatUtilsTest.java:546)

testFormatDurationHMS(org.apache.commons.lang3.time.DurationFormatUtilsTest)  Time elapsed: 0 sec  <<< ERROR!
java.lang.IllegalArgumentException: durationMillis must not be negative
	at org.apache.commons.lang3.Validate.inclusiveBetween(Validate.java:93)
	at org.apache.commons.lang3.time.DurationFormatUtils.formatDuration(DurationFormatUtils.java:131)
	at org.apache.commons.lang3.time.DurationFormatUtils.formatDuration(DurationFormatUtils.java:114)
	at org.apache.commons.lang3.time.DurationFormatUtils.formatDurationHMS(DurationFormatUtils.java:83)
	at org.apache.commons.lang3.time.DurationFormatUtilsTest.testFormatDurationHMS(DurationFormatUtilsTest.java:168)

testFormatDurationISO(org.apache.commons.lang3.time.DurationFormatUtilsTest)  Time elapsed: 0 sec  <<< ERROR!
java.lang.IllegalArgumentException: durationMillis must not be negative
	at org.apache.commons.lang3.Validate.inclusiveBetween(Validate.java:93)
	at org.apache.commons.lang3.time.DurationFormatUtils.formatDuration(DurationFormatUtils.java:131)
	at org.apache.commons.lang3.time.DurationFormatUtils.formatDurationISO(DurationFormatUtils.java:99)
	at org.apache.commons.lang3.time.DurationFormatUtilsTest.testFormatDurationISO(DurationFormatUtilsTest.java:202)

testFormatDurationPluralWords(org.apache.commons.lang3.time.DurationFormatUtilsTest)  Time elapsed: 0 sec  <<< ERROR!
java.lang.IllegalArgumentException: durationMillis must not be negative
	at org.apache.commons.lang3.Validate.inclusiveBetween(Validate.java:93)
	at org.apache.commons.lang3.time.DurationFormatUtils.formatDuration(DurationFormatUtils.java:131)
	at org.apache.commons.lang3.time.DurationFormatUtils.formatDuration(DurationFormatUtils.java:114)
	at org.apache.commons.lang3.time.DurationFormatUtils.formatDurationWords(DurationFormatUtils.java:181)
	at org.apache.commons.lang3.time.DurationFormatUtilsTest.testFormatDurationPluralWords(DurationFormatUtilsTest.java:125)

testFormatDuration(org.apache.commons.lang3.time.DurationFormatUtilsTest)  Time elapsed: 0 sec  <<< ERROR!
java.lang.IllegalArgumentException: durationMillis must not be negative
	at org.apache.commons.lang3.Validate.inclusiveBetween(Validate.java:93)
	at org.apache.commons.lang3.time.DurationFormatUtils.formatDuration(DurationFormatUtils.java:131)
	at org.apache.commons.lang3.time.DurationFormatUtils.formatDuration(DurationFormatUtils.java:114)
	at org.apache.commons.lang3.time.DurationFormatUtilsTest.testFormatDuration(DurationFormatUtilsTest.java:217)

testFormatDurationWords(org.apache.commons.lang3.time.DurationFormatUtilsTest)  Time elapsed: 0 sec  <<< ERROR!
java.lang.IllegalArgumentException: durationMillis must not be negative
	at org.apache.commons.lang3.Validate.inclusiveBetween(Validate.java:93)
	at org.apache.commons.lang3.time.DurationFormatUtils.formatDuration(DurationFormatUtils.java:131)
	at org.apache.commons.lang3.time.DurationFormatUtils.formatDuration(DurationFormatUtils.java:114)
	at org.apache.commons.lang3.time.DurationFormatUtils.formatDurationWords(DurationFormatUtils.java:181)
	at org.apache.commons.lang3.time.DurationFormatUtilsTest.testFormatDurationWords(DurationFormatUtilsTest.java:55)

Running org.apache.commons.lang3.time.DateFormatUtilsTest
Tests run: 10, Failures: 0, Errors: 0, Skipped: 0, Time elapsed: 0.002 sec - in org.apache.commons.lang3.time.DateFormatUtilsTest
Running org.apache.commons.lang3.time.DateUtilsFragmentTest
Tests run: 57, Failures: 0, Errors: 0, Skipped: 0, Time elapsed: 0.009 sec - in org.apache.commons.lang3.time.DateUtilsFragmentTest
Running org.apache.commons.lang3.time.FastDatePrinterTimeZonesTest
Tests run: 617, Failures: 0, Errors: 0, Skipped: 0, Time elapsed: 0.2 sec - in org.apache.commons.lang3.time.FastDatePrinterTimeZonesTest
Running org.apache.commons.lang3.time.FastDateFormatTest
>>FastDateFormatTest: FastDateParser:31008  SimpleDateFormat:3695
Tests run: 14, Failures: 0, Errors: 0, Skipped: 0, Time elapsed: 3.765 sec - in org.apache.commons.lang3.time.FastDateFormatTest
Running org.apache.commons.lang3.time.FastDateFormat_PrinterTest
Tests run: 17, Failures: 0, Errors: 0, Skipped: 0, Time elapsed: 0.007 sec - in org.apache.commons.lang3.time.FastDateFormat_PrinterTest
Running org.apache.commons.lang3.time.FastDatePrinterTest
Tests run: 17, Failures: 0, Errors: 0, Skipped: 0, Time elapsed: 0.003 sec - in org.apache.commons.lang3.time.FastDatePrinterTest
Running org.apache.commons.lang3.time.FastDateParserSDFTest
Tests run: 276, Failures: 0, Errors: 0, Skipped: 92, Time elapsed: 0.063 sec - in org.apache.commons.lang3.time.FastDateParserSDFTest
Running org.apache.commons.lang3.time.DateUtilsTest
DateUtilsTest: Default Locale=en_US
Tests run: 38, Failures: 0, Errors: 0, Skipped: 0, Time elapsed: 0.018 sec - in org.apache.commons.lang3.time.DateUtilsTest
Running org.apache.commons.lang3.reflect.InheritanceUtilsTest
Tests run: 9, Failures: 0, Errors: 0, Skipped: 0, Time elapsed: 0.001 sec - in org.apache.commons.lang3.reflect.InheritanceUtilsTest
Running org.apache.commons.lang3.reflect.MethodUtilsTest
Tests run: 23, Failures: 0, Errors: 0, Skipped: 0, Time elapsed: 0.028 sec - in org.apache.commons.lang3.reflect.MethodUtilsTest
Running org.apache.commons.lang3.reflect.ConstructorUtilsTest
Tests run: 7, Failures: 0, Errors: 0, Skipped: 0, Time elapsed: 0.003 sec - in org.apache.commons.lang3.reflect.ConstructorUtilsTest
Running org.apache.commons.lang3.reflect.FieldUtilsTest
Tests run: 64, Failures: 0, Errors: 0, Skipped: 0, Time elapsed: 0.021 sec - in org.apache.commons.lang3.reflect.FieldUtilsTest
Running org.apache.commons.lang3.reflect.TypeLiteralTest
Tests run: 4, Failures: 0, Errors: 0, Skipped: 0, Time elapsed: 0.005 sec - in org.apache.commons.lang3.reflect.TypeLiteralTest
Running org.apache.commons.lang3.reflect.TypeUtilsTest
Tests run: 19, Failures: 0, Errors: 0, Skipped: 0, Time elapsed: 0.036 sec - in org.apache.commons.lang3.reflect.TypeUtilsTest
Running org.apache.commons.lang3.mutable.MutableByteTest
Tests run: 17, Failures: 0, Errors: 0, Skipped: 0, Time elapsed: 0.004 sec - in org.apache.commons.lang3.mutable.MutableByteTest
Running org.apache.commons.lang3.mutable.MutableShortTest
Tests run: 14, Failures: 0, Errors: 0, Skipped: 0, Time elapsed: 0.002 sec - in org.apache.commons.lang3.mutable.MutableShortTest
Running org.apache.commons.lang3.mutable.MutableIntTest
Tests run: 17, Failures: 0, Errors: 0, Skipped: 0, Time elapsed: 0.004 sec - in org.apache.commons.lang3.mutable.MutableIntTest
Running org.apache.commons.lang3.mutable.MutableDoubleTest
Tests run: 18, Failures: 0, Errors: 0, Skipped: 0, Time elapsed: 0.003 sec - in org.apache.commons.lang3.mutable.MutableDoubleTest
Running org.apache.commons.lang3.mutable.MutableFloatTest
Tests run: 18, Failures: 0, Errors: 0, Skipped: 0, Time elapsed: 0.004 sec - in org.apache.commons.lang3.mutable.MutableFloatTest
Running org.apache.commons.lang3.mutable.MutableLongTest
Tests run: 17, Failures: 0, Errors: 0, Skipped: 0, Time elapsed: 0.003 sec - in org.apache.commons.lang3.mutable.MutableLongTest
Running org.apache.commons.lang3.mutable.MutableBooleanTest
Tests run: 9, Failures: 0, Errors: 0, Skipped: 0, Time elapsed: 0.002 sec - in org.apache.commons.lang3.mutable.MutableBooleanTest
Running org.apache.commons.lang3.mutable.MutableObjectTest
Tests run: 5, Failures: 0, Errors: 0, Skipped: 0, Time elapsed: 0.001 sec - in org.apache.commons.lang3.mutable.MutableObjectTest
Running org.apache.commons.lang3.text.translate.UnicodeEscaperTest
Tests run: 3, Failures: 0, Errors: 0, Skipped: 0, Time elapsed: 0 sec - in org.apache.commons.lang3.text.translate.UnicodeEscaperTest
Running org.apache.commons.lang3.text.translate.EntityArraysTest
Tests run: 3, Failures: 0, Errors: 0, Skipped: 0, Time elapsed: 0.001 sec - in org.apache.commons.lang3.text.translate.EntityArraysTest
Running org.apache.commons.lang3.text.translate.UnicodeUnpairedSurrogateRemoverTest
Tests run: 2, Failures: 0, Errors: 0, Skipped: 0, Time elapsed: 0 sec - in org.apache.commons.lang3.text.translate.UnicodeUnpairedSurrogateRemoverTest
Running org.apache.commons.lang3.text.translate.NumericEntityUnescaperTest
Tests run: 3, Failures: 0, Errors: 0, Skipped: 0, Time elapsed: 0 sec - in org.apache.commons.lang3.text.translate.NumericEntityUnescaperTest
Running org.apache.commons.lang3.text.translate.NumericEntityEscaperTest
Tests run: 4, Failures: 0, Errors: 0, Skipped: 0, Time elapsed: 0.001 sec - in org.apache.commons.lang3.text.translate.NumericEntityEscaperTest
Running org.apache.commons.lang3.text.translate.LookupTranslatorTest
Tests run: 2, Failures: 0, Errors: 0, Skipped: 0, Time elapsed: 0 sec - in org.apache.commons.lang3.text.translate.LookupTranslatorTest
Running org.apache.commons.lang3.text.translate.UnicodeUnescaperTest
Tests run: 3, Failures: 0, Errors: 0, Skipped: 0, Time elapsed: 0 sec - in org.apache.commons.lang3.text.translate.UnicodeUnescaperTest
Running org.apache.commons.lang3.text.translate.OctalUnescaperTest
Tests run: 1, Failures: 0, Errors: 0, Skipped: 0, Time elapsed: 0 sec - in org.apache.commons.lang3.text.translate.OctalUnescaperTest
Running org.apache.commons.lang3.text.StrMatcherTest
Tests run: 14, Failures: 0, Errors: 0, Skipped: 0, Time elapsed: 0.005 sec - in org.apache.commons.lang3.text.StrMatcherTest
Running org.apache.commons.lang3.text.StrTokenizerTest
Tests run: 55, Failures: 0, Errors: 0, Skipped: 0, Time elapsed: 0.013 sec - in org.apache.commons.lang3.text.StrTokenizerTest
Running org.apache.commons.lang3.text.FormattableUtilsTest
Tests run: 5, Failures: 0, Errors: 0, Skipped: 0, Time elapsed: 0 sec - in org.apache.commons.lang3.text.FormattableUtilsTest
Running org.apache.commons.lang3.text.CompositeFormatTest
Tests run: 2, Failures: 0, Errors: 0, Skipped: 0, Time elapsed: 0.001 sec - in org.apache.commons.lang3.text.CompositeFormatTest
Running org.apache.commons.lang3.text.WordUtilsTest
Tests run: 12, Failures: 0, Errors: 0, Skipped: 0, Time elapsed: 0.003 sec - in org.apache.commons.lang3.text.WordUtilsTest
Running org.apache.commons.lang3.text.StrLookupTest
Tests run: 5, Failures: 0, Errors: 0, Skipped: 0, Time elapsed: 0.002 sec - in org.apache.commons.lang3.text.StrLookupTest
Running org.apache.commons.lang3.text.StrBuilderAppendInsertTest
Tests run: 51, Failures: 0, Errors: 0, Skipped: 0, Time elapsed: 0.013 sec - in org.apache.commons.lang3.text.StrBuilderAppendInsertTest
Running org.apache.commons.lang3.text.ExtendedMessageFormatTest
Tests run: 10, Failures: 0, Errors: 0, Skipped: 0, Time elapsed: 0.689 sec - in org.apache.commons.lang3.text.ExtendedMessageFormatTest
Running org.apache.commons.lang3.text.StrSubstitutorTest
Tests run: 40, Failures: 0, Errors: 0, Skipped: 0, Time elapsed: 0.035 sec - in org.apache.commons.lang3.text.StrSubstitutorTest
Running org.apache.commons.lang3.text.StrBuilderTest
Tests run: 90, Failures: 0, Errors: 0, Skipped: 0, Time elapsed: 0.045 sec - in org.apache.commons.lang3.text.StrBuilderTest
Running org.apache.commons.lang3.StringEscapeUtilsTest
Tests run: 28, Failures: 0, Errors: 0, Skipped: 0, Time elapsed: 0.378 sec - in org.apache.commons.lang3.StringEscapeUtilsTest
Running org.apache.commons.lang3.AnnotationUtilsTest
Tests run: 10, Failures: 0, Errors: 0, Skipped: 0, Time elapsed: 0.024 sec - in org.apache.commons.lang3.AnnotationUtilsTest
Running org.apache.commons.lang3.ConversionTest
Tests run: 42, Failures: 0, Errors: 0, Skipped: 0, Time elapsed: 0.011 sec - in org.apache.commons.lang3.ConversionTest
Running org.apache.commons.lang3.StringUtilsTrimEmptyTest
Tests run: 15, Failures: 0, Errors: 0, Skipped: 0, Time elapsed: 0.006 sec - in org.apache.commons.lang3.StringUtilsTrimEmptyTest
Running org.apache.commons.lang3.EnumUtilsTest
Tests run: 34, Failures: 0, Errors: 0, Skipped: 0, Time elapsed: 0.007 sec - in org.apache.commons.lang3.EnumUtilsTest
Running org.apache.commons.lang3.exception.ExceptionUtilsTest
Tests run: 28, Failures: 0, Errors: 0, Skipped: 0, Time elapsed: 0.022 sec - in org.apache.commons.lang3.exception.ExceptionUtilsTest
Running org.apache.commons.lang3.exception.DefaultExceptionContextTest
Tests run: 8, Failures: 0, Errors: 0, Skipped: 0, Time elapsed: 0.003 sec - in org.apache.commons.lang3.exception.DefaultExceptionContextTest
Running org.apache.commons.lang3.exception.ContextedExceptionTest
Tests run: 14, Failures: 0, Errors: 0, Skipped: 0, Time elapsed: 0.009 sec - in org.apache.commons.lang3.exception.ContextedExceptionTest
Running org.apache.commons.lang3.exception.ContextedRuntimeExceptionTest
Tests run: 14, Failures: 0, Errors: 0, Skipped: 0, Time elapsed: 0.01 sec - in org.apache.commons.lang3.exception.ContextedRuntimeExceptionTest
Running org.apache.commons.lang3.BitFieldTest
Tests run: 15, Failures: 0, Errors: 0, Skipped: 0, Time elapsed: 0.002 sec - in org.apache.commons.lang3.BitFieldTest
Running org.apache.commons.lang3.ArrayUtilsRemoveMultipleTest
Tests run: 55, Failures: 0, Errors: 0, Skipped: 0, Time elapsed: 0.013 sec - in org.apache.commons.lang3.ArrayUtilsRemoveMultipleTest
Running org.apache.commons.lang3.HashSetvBitSetTest
Ratio=9% array=100 count=1 extract=22229337 bitset=2061993
Ratio=10% array=100 count=10 extract=18676963 bitset=1936333
Ratio=12% array=100 count=50 extract=6880238 bitset=886918
Ratio=4% array=100 count=100 extract=9770707 bitset=419675
Ratio=82% array=1000 count=10 extract=6083088 bitset=5027756
Ratio=34% array=1000 count=100 extract=14785443 bitset=5105241
Ratio=7% array=1000 count=500 extract=42066543 bitset=3184694
Ratio=1% array=1000 count=1000 extract=70309670 bitset=717483
Ratio=812% count=0 hash=169867 bits=1379799
Ratio=34% count=5 hash=579545 bits=202325
Ratio=30% count=10 hash=897671 bits=270225
Ratio=22% count=200 hash=18382107 bits=4108461
Ratio=12% count=50 hash=11022427 bits=1360297
Ratio=28% count=100 hash=11527635 bits=3290272
Ratio=21% count=1000 hash=74004541 bits=16029738
Ratio=22% count=2000 hash=143475225 bits=31625006
Tests run: 2, Failures: 0, Errors: 0, Skipped: 0, Time elapsed: 0.631 sec - in org.apache.commons.lang3.HashSetvBitSetTest
Running org.apache.commons.lang3.StringUtilsTest
Tests run: 124, Failures: 0, Errors: 0, Skipped: 0, Time elapsed: 0.085 sec - in org.apache.commons.lang3.StringUtilsTest
Running org.apache.commons.lang3.ArrayUtilsRemoveTest
Tests run: 19, Failures: 0, Errors: 0, Skipped: 0, Time elapsed: 0 sec - in org.apache.commons.lang3.ArrayUtilsRemoveTest
Running org.apache.commons.lang3.ObjectUtilsTest
Tests run: 36, Failures: 0, Errors: 0, Skipped: 0, Time elapsed: 0.017 sec - in org.apache.commons.lang3.ObjectUtilsTest
Running org.apache.commons.lang3.ClassPathUtilsTest
Tests run: 13, Failures: 0, Errors: 0, Skipped: 0, Time elapsed: 0 sec - in org.apache.commons.lang3.ClassPathUtilsTest
Running org.apache.commons.lang3.math.NumberUtilsTest
Tests run: 91, Failures: 0, Errors: 0, Skipped: 0, Time elapsed: 0.025 sec - in org.apache.commons.lang3.math.NumberUtilsTest
Running org.apache.commons.lang3.math.IEEE754rUtilsTest
Tests run: 3, Failures: 0, Errors: 0, Skipped: 0, Time elapsed: 0 sec - in org.apache.commons.lang3.math.IEEE754rUtilsTest
Running org.apache.commons.lang3.math.FractionTest
Tests run: 25, Failures: 0, Errors: 0, Skipped: 0, Time elapsed: 0.103 sec - in org.apache.commons.lang3.math.FractionTest
Running org.apache.commons.lang3.BooleanUtilsTest
Tests run: 72, Failures: 0, Errors: 0, Skipped: 0, Time elapsed: 0.025 sec - in org.apache.commons.lang3.BooleanUtilsTest
Running org.apache.commons.lang3.CharSequenceUtilsTest
Tests run: 2, Failures: 0, Errors: 0, Skipped: 0, Time elapsed: 0 sec - in org.apache.commons.lang3.CharSequenceUtilsTest
Running org.apache.commons.lang3.CharSetUtilsTest
Tests run: 11, Failures: 0, Errors: 0, Skipped: 0, Time elapsed: 0 sec - in org.apache.commons.lang3.CharSetUtilsTest
Running org.apache.commons.lang3.ArrayUtilsAddTest
Tests run: 13, Failures: 0, Errors: 0, Skipped: 0, Time elapsed: 0.001 sec - in org.apache.commons.lang3.ArrayUtilsAddTest
Running org.apache.commons.lang3.CharEncodingTest
Tests run: 6, Failures: 0, Errors: 0, Skipped: 0, Time elapsed: 0.031 sec - in org.apache.commons.lang3.CharEncodingTest
Running org.apache.commons.lang3.ClassUtilsTest
Tests run: 57, Failures: 0, Errors: 0, Skipped: 0, Time elapsed: 0.02 sec - in org.apache.commons.lang3.ClassUtilsTest
Running org.apache.commons.lang3.RangeTest
Tests run: 24, Failures: 0, Errors: 0, Skipped: 0, Time elapsed: 0.009 sec - in org.apache.commons.lang3.RangeTest
Running org.apache.commons.lang3.event.EventUtilsTest
Tests run: 8, Failures: 0, Errors: 0, Skipped: 0, Time elapsed: 0.015 sec - in org.apache.commons.lang3.event.EventUtilsTest
Running org.apache.commons.lang3.event.EventListenerSupportTest
Tests run: 9, Failures: 0, Errors: 0, Skipped: 0, Time elapsed: 0.017 sec - in org.apache.commons.lang3.event.EventListenerSupportTest
Running org.apache.commons.lang3.ArrayUtilsTest
Tests run: 205, Failures: 0, Errors: 0, Skipped: 0, Time elapsed: 0.034 sec - in org.apache.commons.lang3.ArrayUtilsTest
Running org.apache.commons.lang3.CharUtilsTest
Tests run: 24, Failures: 0, Errors: 0, Skipped: 0, Time elapsed: 0.001 sec - in org.apache.commons.lang3.CharUtilsTest
Running org.apache.commons.lang3.NotImplementedExceptionTest
Tests run: 1, Failures: 0, Errors: 0, Skipped: 0, Time elapsed: 0 sec - in org.apache.commons.lang3.NotImplementedExceptionTest
Running org.apache.commons.lang3.StringUtilsEqualsIndexOfTest
Tests run: 50, Failures: 0, Errors: 0, Skipped: 0, Time elapsed: 0.001 sec - in org.apache.commons.lang3.StringUtilsEqualsIndexOfTest
Running org.apache.commons.lang3.RandomUtilsTest
Tests run: 23, Failures: 0, Errors: 0, Skipped: 0, Time elapsed: 0.001 sec - in org.apache.commons.lang3.RandomUtilsTest

Results :


Tests in error: 
  ValidateTest.testInclusiveBetweenLong_withMessage:876 » IllegalArgument Error
  TimedSemaphoreTest.testAcquireLimit:220 » IllegalArgument Time period must be ...
  TimedSemaphoreTest.testAcquireMultiplePeriods:327 » IllegalArgument Time perio...
  TimedSemaphoreTest.testAcquireMultipleThreads:257 » IllegalArgument Time perio...
  TimedSemaphoreTest.testAcquireNoLimit:294 » IllegalArgument Time period must b...
  TimedSemaphoreTest.testGetAvailablePermits:376 » IllegalArgument Time period m...
  TimedSemaphoreTest.testGetAverageCallsPerPeriod:350 » IllegalArgument Time per...
  TimedSemaphoreTest.testInit:57 » IllegalArgument Time period must be greater t...
  TimedSemaphoreTest.testInitDefaultService:86 » IllegalArgument Time period mus...
  TimedSemaphoreTest.testPassAfterShutdown »  Unexpected exception, expected<jav...
  TimedSemaphoreTest.testShutdownMultipleTimes:197 » IllegalArgument Time period...
  TimedSemaphoreTest.testShutdownOwnExecutor:126 » IllegalArgument Time period m...
  TimedSemaphoreTest.testShutdownSharedExecutorNoTask:142 » IllegalArgument Time...
  TimedSemaphoreTest.testShutdownSharedExecutorTask:176 » IllegalArgument Time p...
  TimedSemaphoreTest.testStartTimer:104 » IllegalArgument Time period must be gr...
  DurationFormatUtilsTest.testFormatDuration:217 » IllegalArgument durationMilli...
  DurationFormatUtilsTest.testFormatDurationHMS:168 » IllegalArgument durationMi...
  DurationFormatUtilsTest.testFormatDurationISO:202 » IllegalArgument durationMi...
  DurationFormatUtilsTest.testFormatDurationPluralWords:125 » IllegalArgument du...
  DurationFormatUtilsTest.testFormatDurationWords:55 » IllegalArgument durationM...
  DurationFormatUtilsTest.testLANG982:556 » IllegalArgument durationMillis must ...
  DurationFormatUtilsTest.testLANG984:546 » IllegalArgument durationMillis must ...
  StopWatchTest.testStopWatchSimpleGet:55 » IllegalArgument durationMillis must ...
  StopWatchTest.testStopWatchSplit:69 » IllegalArgument durationMillis must not ...


Tests run: 3526, Failures: 0, Errors: 24, Skipped: 97

[INFO] ------------------------------------------------------------------------
[INFO] BUILD FAILURE
[INFO] ------------------------------------------------------------------------
[INFO] Total time: 31.019s
[INFO] Finished at: Tue Aug 04 02:52:13 BST 2015
[INFO] Final Memory: 23M/412M
[INFO] ------------------------------------------------------------------------
[ERROR] Failed to execute goal org.apache.maven.plugins:maven-surefire-plugin:2.18:test (default-test) on project commons-lang3: There are test failures.
[ERROR] 
[ERROR] Please refer to /home/perham/Study/LittleDarwin/Cases/commons-lang3-3.4-src/target/surefire-reports for the individual test results.
[ERROR] -> [Help 1]
[ERROR] 
[ERROR] To see the full stack trace of the errors, re-run Maven with the -e switch.
[ERROR] Re-run Maven using the -X switch to enable full debug logging.
[ERROR] 
[ERROR] For more information about the errors and possible solutions, please read the following articles:
[ERROR] [Help 1] http://cwiki.apache.org/confluence/display/MAVEN/MojoFailureException
