[INFO] Scanning for projects...
[INFO]                                                                         
[INFO] ------------------------------------------------------------------------
[INFO] Building Apache Commons Lang 3.4
[INFO] ------------------------------------------------------------------------
[INFO] 
[INFO] --- maven-enforcer-plugin:1.3.1:enforce (enforce-maven-3) @ commons-lang3 ---
[INFO] 
[INFO] --- build-helper-maven-plugin:1.8:parse-version (parse-version) @ commons-lang3 ---
[INFO] 
[INFO] --- maven-antrun-plugin:1.8:run (javadoc.resources) @ commons-lang3 ---
[INFO] Executing tasks

main:
[INFO] Executed tasks
[INFO] 
[INFO] --- maven-remote-resources-plugin:1.5:process (default) @ commons-lang3 ---
[INFO] 
[INFO] --- buildnumber-maven-plugin:1.3:create (default) @ commons-lang3 ---
[INFO] Executing: /bin/sh -c cd /home/perham/Study/LittleDarwin/Cases/commons-lang3-3.4-src && svn --non-interactive info
[INFO] Working directory: /home/perham/Study/LittleDarwin/Cases/commons-lang3-3.4-src
[INFO] Storing buildNumber: ?????? at timestamp: 1438650570102
[INFO] Executing: /bin/sh -c cd /home/perham/Study/LittleDarwin/Cases/commons-lang3-3.4-src && svn --non-interactive info
[INFO] Working directory: /home/perham/Study/LittleDarwin/Cases/commons-lang3-3.4-src
[INFO] Storing buildScmBranch: UNKNOWN_BRANCH
[INFO] 
[INFO] --- maven-resources-plugin:2.7:resources (default-resources) @ commons-lang3 ---
[INFO] Using 'ISO-8859-1' encoding to copy filtered resources.
[INFO] Copying 0 resource
[INFO] Copying 2 resources to META-INF
[INFO] 
[INFO] --- maven-compiler-plugin:3.2:compile (default-compile) @ commons-lang3 ---
[INFO] Changes detected - recompiling the module!
[INFO] Compiling 133 source files to /home/perham/Study/LittleDarwin/Cases/commons-lang3-3.4-src/target/classes
[INFO] /home/perham/Study/LittleDarwin/Cases/commons-lang3-3.4-src/src/main/java/org/apache/commons/lang3/SerializationUtils.java: /home/perham/Study/LittleDarwin/Cases/commons-lang3-3.4-src/src/main/java/org/apache/commons/lang3/SerializationUtils.java uses unchecked or unsafe operations.
[INFO] /home/perham/Study/LittleDarwin/Cases/commons-lang3-3.4-src/src/main/java/org/apache/commons/lang3/SerializationUtils.java: Recompile with -Xlint:unchecked for details.
[INFO] 
[INFO] --- maven-bundle-plugin:2.5.3:manifest (bundle-manifest) @ commons-lang3 ---
[INFO] 
[INFO] --- animal-sniffer-maven-plugin:1.13:check (checkAPIcompatibility) @ commons-lang3 ---
[INFO] Checking unresolved references to org.codehaus.mojo.signature:java16:1.0
[INFO] 
[INFO] --- maven-resources-plugin:2.7:testResources (default-testResources) @ commons-lang3 ---
[INFO] Using 'ISO-8859-1' encoding to copy filtered resources.
[INFO] Copying 2 resources
[INFO] Copying 2 resources to META-INF
[INFO] 
[INFO] --- maven-compiler-plugin:3.2:testCompile (default-testCompile) @ commons-lang3 ---
[INFO] Nothing to compile - all classes are up to date
[INFO] 
[INFO] --- maven-surefire-plugin:2.18:test (default-test) @ commons-lang3 ---
[INFO] Surefire report directory: /home/perham/Study/LittleDarwin/Cases/commons-lang3-3.4-src/target/surefire-reports

-------------------------------------------------------
 T E S T S
-------------------------------------------------------
Running org.apache.commons.lang3.ValidateTest
Tests run: 63, Failures: 0, Errors: 0, Skipped: 0, Time elapsed: 0.041 sec - in org.apache.commons.lang3.ValidateTest
Running org.apache.commons.lang3.LocaleUtilsTest
Tests run: 15, Failures: 0, Errors: 0, Skipped: 0, Time elapsed: 0.015 sec - in org.apache.commons.lang3.LocaleUtilsTest
Running org.apache.commons.lang3.tuple.MutableTripleTest
Tests run: 8, Failures: 0, Errors: 0, Skipped: 0, Time elapsed: 0.007 sec - in org.apache.commons.lang3.tuple.MutableTripleTest
Running org.apache.commons.lang3.tuple.TripleTest
Tests run: 10, Failures: 0, Errors: 0, Skipped: 0, Time elapsed: 0.004 sec - in org.apache.commons.lang3.tuple.TripleTest
Running org.apache.commons.lang3.tuple.ImmutablePairTest
Tests run: 6, Failures: 0, Errors: 0, Skipped: 0, Time elapsed: 0 sec - in org.apache.commons.lang3.tuple.ImmutablePairTest
Running org.apache.commons.lang3.tuple.MutablePairTest
Tests run: 8, Failures: 0, Errors: 0, Skipped: 0, Time elapsed: 0.003 sec - in org.apache.commons.lang3.tuple.MutablePairTest
Running org.apache.commons.lang3.tuple.ImmutableTripleTest
Tests run: 6, Failures: 0, Errors: 0, Skipped: 0, Time elapsed: 0.001 sec - in org.apache.commons.lang3.tuple.ImmutableTripleTest
Running org.apache.commons.lang3.tuple.PairTest
Tests run: 9, Failures: 0, Errors: 0, Skipped: 0, Time elapsed: 0.001 sec - in org.apache.commons.lang3.tuple.PairTest
Running org.apache.commons.lang3.StringUtilsIsTest
Tests run: 8, Failures: 0, Errors: 3, Skipped: 0, Time elapsed: 0.017 sec <<< FAILURE! - in org.apache.commons.lang3.StringUtilsIsTest
testIsNumeric(org.apache.commons.lang3.StringUtilsIsTest)  Time elapsed: 0.003 sec  <<< ERROR!
java.lang.NullPointerException: null
	at org.apache.commons.lang3.StringUtils.isEmpty(StringUtils.java:25)
	at org.apache.commons.lang3.StringUtils.isNumeric(StringUtils.java:864)
	at org.apache.commons.lang3.StringUtilsIsTest.testIsNumeric(StringUtilsIsTest.java:137)

testIsAlphanumeric(org.apache.commons.lang3.StringUtilsIsTest)  Time elapsed: 0 sec  <<< ERROR!
java.lang.NullPointerException: null
	at org.apache.commons.lang3.StringUtils.isEmpty(StringUtils.java:25)
	at org.apache.commons.lang3.StringUtils.isAlphanumeric(StringUtils.java:846)
	at org.apache.commons.lang3.StringUtilsIsTest.testIsAlphanumeric(StringUtilsIsTest.java:50)

testIsAlpha(org.apache.commons.lang3.StringUtilsIsTest)  Time elapsed: 0 sec  <<< ERROR!
java.lang.NullPointerException: null
	at org.apache.commons.lang3.StringUtils.isEmpty(StringUtils.java:25)
	at org.apache.commons.lang3.StringUtils.isAlpha(StringUtils.java:834)
	at org.apache.commons.lang3.StringUtilsIsTest.testIsAlpha(StringUtilsIsTest.java:35)

Running org.apache.commons.lang3.JavaVersionTest
Tests run: 3, Failures: 0, Errors: 0, Skipped: 0, Time elapsed: 0 sec - in org.apache.commons.lang3.JavaVersionTest
Running org.apache.commons.lang3.builder.NoFieldNamesToStringStyleTest
Tests run: 8, Failures: 0, Errors: 0, Skipped: 0, Time elapsed: 0.011 sec - in org.apache.commons.lang3.builder.NoFieldNamesToStringStyleTest
Running org.apache.commons.lang3.builder.ShortPrefixToStringStyleTest
Tests run: 8, Failures: 0, Errors: 0, Skipped: 0, Time elapsed: 0 sec - in org.apache.commons.lang3.builder.ShortPrefixToStringStyleTest
Running org.apache.commons.lang3.builder.DiffResultTest
Tests run: 9, Failures: 0, Errors: 0, Skipped: 0, Time elapsed: 0.004 sec - in org.apache.commons.lang3.builder.DiffResultTest
Running org.apache.commons.lang3.builder.CompareToBuilderTest
Tests run: 48, Failures: 0, Errors: 0, Skipped: 0, Time elapsed: 0.024 sec - in org.apache.commons.lang3.builder.CompareToBuilderTest
Running org.apache.commons.lang3.builder.MultilineRecursiveToStringStyleTest
Tests run: 10, Failures: 0, Errors: 0, Skipped: 0, Time elapsed: 0.003 sec - in org.apache.commons.lang3.builder.MultilineRecursiveToStringStyleTest
Running org.apache.commons.lang3.builder.RecursiveToStringStyleTest
Tests run: 8, Failures: 0, Errors: 0, Skipped: 0, Time elapsed: 0.001 sec - in org.apache.commons.lang3.builder.RecursiveToStringStyleTest
Running org.apache.commons.lang3.builder.DefaultToStringStyleTest
Tests run: 8, Failures: 0, Errors: 0, Skipped: 0, Time elapsed: 0.001 sec - in org.apache.commons.lang3.builder.DefaultToStringStyleTest
Running org.apache.commons.lang3.builder.ReflectionToStringBuilderExcludeTest
Tests run: 11, Failures: 0, Errors: 0, Skipped: 0, Time elapsed: 0.002 sec - in org.apache.commons.lang3.builder.ReflectionToStringBuilderExcludeTest
Running org.apache.commons.lang3.builder.StandardToStringStyleTest
Tests run: 8, Failures: 0, Errors: 0, Skipped: 0, Time elapsed: 0.003 sec - in org.apache.commons.lang3.builder.StandardToStringStyleTest
Running org.apache.commons.lang3.builder.ToStringStyleTest
Tests run: 12, Failures: 0, Errors: 0, Skipped: 0, Time elapsed: 0.003 sec - in org.apache.commons.lang3.builder.ToStringStyleTest
Running org.apache.commons.lang3.builder.DiffTest
Tests run: 4, Failures: 0, Errors: 0, Skipped: 0, Time elapsed: 0.001 sec - in org.apache.commons.lang3.builder.DiffTest
Running org.apache.commons.lang3.builder.SimpleToStringStyleTest
Tests run: 8, Failures: 0, Errors: 0, Skipped: 0, Time elapsed: 0.003 sec - in org.apache.commons.lang3.builder.SimpleToStringStyleTest
Running org.apache.commons.lang3.builder.MultiLineToStringStyleTest
Tests run: 8, Failures: 0, Errors: 0, Skipped: 0, Time elapsed: 0.003 sec - in org.apache.commons.lang3.builder.MultiLineToStringStyleTest
Running org.apache.commons.lang3.builder.ToStringStyleConcurrencyTest
Tests run: 3, Failures: 0, Errors: 0, Skipped: 0, Time elapsed: 4.378 sec - in org.apache.commons.lang3.builder.ToStringStyleConcurrencyTest
Running org.apache.commons.lang3.builder.ReflectionToStringBuilderMutateInspectConcurrencyTest
Tests run: 1, Failures: 0, Errors: 0, Skipped: 1, Time elapsed: 0 sec - in org.apache.commons.lang3.builder.ReflectionToStringBuilderMutateInspectConcurrencyTest
Running org.apache.commons.lang3.builder.ToStringBuilderTest
Tests run: 74, Failures: 0, Errors: 0, Skipped: 1, Time elapsed: 0.063 sec - in org.apache.commons.lang3.builder.ToStringBuilderTest
Running org.apache.commons.lang3.builder.EqualsBuilderTest
Tests run: 48, Failures: 0, Errors: 0, Skipped: 0, Time elapsed: 0.04 sec - in org.apache.commons.lang3.builder.EqualsBuilderTest
Running org.apache.commons.lang3.builder.HashCodeBuilderAndEqualsBuilderTest
Tests run: 4, Failures: 0, Errors: 0, Skipped: 0, Time elapsed: 0.006 sec - in org.apache.commons.lang3.builder.HashCodeBuilderAndEqualsBuilderTest
Running org.apache.commons.lang3.builder.ReflectionToStringBuilderConcurrencyTest
Tests run: 3, Failures: 0, Errors: 0, Skipped: 3, Time elapsed: 0 sec - in org.apache.commons.lang3.builder.ReflectionToStringBuilderConcurrencyTest
Running org.apache.commons.lang3.builder.JsonToStringStyleTest
Tests run: 9, Failures: 0, Errors: 0, Skipped: 0, Time elapsed: 0.002 sec - in org.apache.commons.lang3.builder.JsonToStringStyleTest
Running org.apache.commons.lang3.builder.NoClassNameToStringStyleTest
Tests run: 8, Failures: 0, Errors: 0, Skipped: 0, Time elapsed: 0.002 sec - in org.apache.commons.lang3.builder.NoClassNameToStringStyleTest
Running org.apache.commons.lang3.builder.DiffBuilderTest
Tests run: 30, Failures: 0, Errors: 0, Skipped: 0, Time elapsed: 0.024 sec - in org.apache.commons.lang3.builder.DiffBuilderTest
Running org.apache.commons.lang3.builder.HashCodeBuilderTest
Tests run: 44, Failures: 0, Errors: 0, Skipped: 0, Time elapsed: 0.01 sec - in org.apache.commons.lang3.builder.HashCodeBuilderTest
Running org.apache.commons.lang3.concurrent.AtomicInitializerTest
Tests run: 3, Failures: 0, Errors: 0, Skipped: 0, Time elapsed: 0.002 sec - in org.apache.commons.lang3.concurrent.AtomicInitializerTest
Running org.apache.commons.lang3.concurrent.CallableBackgroundInitializerTest
Tests run: 4, Failures: 0, Errors: 0, Skipped: 0, Time elapsed: 0.003 sec - in org.apache.commons.lang3.concurrent.CallableBackgroundInitializerTest
Running org.apache.commons.lang3.concurrent.BackgroundInitializerTest
Tests run: 15, Failures: 0, Errors: 0, Skipped: 0, Time elapsed: 0.01 sec - in org.apache.commons.lang3.concurrent.BackgroundInitializerTest
Running org.apache.commons.lang3.concurrent.LazyInitializerTest
Tests run: 3, Failures: 0, Errors: 0, Skipped: 0, Time elapsed: 0.004 sec - in org.apache.commons.lang3.concurrent.LazyInitializerTest
Running org.apache.commons.lang3.concurrent.BasicThreadFactoryTest
Tests run: 15, Failures: 0, Errors: 0, Skipped: 0, Time elapsed: 0.038 sec - in org.apache.commons.lang3.concurrent.BasicThreadFactoryTest
Running org.apache.commons.lang3.concurrent.ConstantInitializerTest
Tests run: 7, Failures: 0, Errors: 0, Skipped: 0, Time elapsed: 0 sec - in org.apache.commons.lang3.concurrent.ConstantInitializerTest
Running org.apache.commons.lang3.concurrent.MultiBackgroundInitializerTest
Tests run: 17, Failures: 0, Errors: 0, Skipped: 0, Time elapsed: 0.051 sec - in org.apache.commons.lang3.concurrent.MultiBackgroundInitializerTest
Running org.apache.commons.lang3.concurrent.AtomicSafeInitializerTest
Tests run: 4, Failures: 0, Errors: 0, Skipped: 0, Time elapsed: 0.007 sec - in org.apache.commons.lang3.concurrent.AtomicSafeInitializerTest
Running org.apache.commons.lang3.concurrent.ConcurrentUtilsTest
Tests run: 40, Failures: 0, Errors: 0, Skipped: 0, Time elapsed: 0.015 sec - in org.apache.commons.lang3.concurrent.ConcurrentUtilsTest
Running org.apache.commons.lang3.concurrent.TimedSemaphoreTest
Tests run: 15, Failures: 0, Errors: 0, Skipped: 0, Time elapsed: 1.182 sec - in org.apache.commons.lang3.concurrent.TimedSemaphoreTest
Running org.apache.commons.lang3.StringUtilsSubstringTest
Tests run: 14, Failures: 0, Errors: 7, Skipped: 0, Time elapsed: 0.007 sec <<< FAILURE! - in org.apache.commons.lang3.StringUtilsSubstringTest
testSubstringBefore_StringString(org.apache.commons.lang3.StringUtilsSubstringTest)  Time elapsed: 0 sec  <<< ERROR!
java.lang.NullPointerException: null
	at org.apache.commons.lang3.StringUtils.isEmpty(StringUtils.java:25)
	at org.apache.commons.lang3.StringUtils.substringBefore(StringUtils.java:281)
	at org.apache.commons.lang3.StringUtilsSubstringTest.testSubstringBefore_StringString(StringUtilsSubstringTest.java:137)

testSubstringsBetween_StringStringString(org.apache.commons.lang3.StringUtilsSubstringTest)  Time elapsed: 0.001 sec  <<< ERROR!
java.lang.NullPointerException: null
	at org.apache.commons.lang3.StringUtils.isEmpty(StringUtils.java:25)
	at org.apache.commons.lang3.StringUtils.substringsBetween(StringUtils.java:306)
	at org.apache.commons.lang3.StringUtilsSubstringTest.testSubstringsBetween_StringStringString(StringUtilsSubstringTest.java:291)

testSubstringAfterLast_StringString(org.apache.commons.lang3.StringUtilsSubstringTest)  Time elapsed: 0.001 sec  <<< ERROR!
java.lang.NullPointerException: null
	at org.apache.commons.lang3.StringUtils.isEmpty(StringUtils.java:25)
	at org.apache.commons.lang3.StringUtils.substringAfterLast(StringUtils.java:295)
	at org.apache.commons.lang3.StringUtilsSubstringTest.testSubstringAfterLast_StringString(StringUtilsSubstringTest.java:201)

testCountMatches_String(org.apache.commons.lang3.StringUtilsSubstringTest)  Time elapsed: 0 sec  <<< ERROR!
java.lang.NullPointerException: null
	at org.apache.commons.lang3.StringUtils.isEmpty(StringUtils.java:25)
	at org.apache.commons.lang3.StringUtils.countMatches(StringUtils.java:822)
	at org.apache.commons.lang3.StringUtilsSubstringTest.testCountMatches_String(StringUtilsSubstringTest.java:310)

testCountMatches_char(org.apache.commons.lang3.StringUtilsSubstringTest)  Time elapsed: 0.001 sec  <<< ERROR!
java.lang.NullPointerException: null
	at org.apache.commons.lang3.StringUtils.isEmpty(StringUtils.java:25)
	at org.apache.commons.lang3.StringUtils.countMatches(StringUtils.java:828)
	at org.apache.commons.lang3.StringUtilsSubstringTest.testCountMatches_char(StringUtilsSubstringTest.java:327)

testSubstringBeforeLast_StringString(org.apache.commons.lang3.StringUtilsSubstringTest)  Time elapsed: 0 sec  <<< ERROR!
java.lang.NullPointerException: null
	at org.apache.commons.lang3.StringUtils.isEmpty(StringUtils.java:25)
	at org.apache.commons.lang3.StringUtils.substringBeforeLast(StringUtils.java:291)
	at org.apache.commons.lang3.StringUtilsSubstringTest.testSubstringBeforeLast_StringString(StringUtilsSubstringTest.java:177)

testSubstringAfter_StringString(org.apache.commons.lang3.StringUtilsSubstringTest)  Time elapsed: 0.001 sec  <<< ERROR!
java.lang.NullPointerException: null
	at org.apache.commons.lang3.StringUtils.isEmpty(StringUtils.java:25)
	at org.apache.commons.lang3.StringUtils.substringAfter(StringUtils.java:286)
	at org.apache.commons.lang3.StringUtilsSubstringTest.testSubstringAfter_StringString(StringUtilsSubstringTest.java:157)

Running org.apache.commons.lang3.SystemUtilsTest
Tests run: 12, Failures: 0, Errors: 1, Skipped: 0, Time elapsed: 0.001 sec <<< FAILURE! - in org.apache.commons.lang3.SystemUtilsTest
testOsVersionMatches(org.apache.commons.lang3.SystemUtilsTest)  Time elapsed: 0 sec  <<< ERROR!
java.lang.NullPointerException: null
	at org.apache.commons.lang3.StringUtils.isEmpty(StringUtils.java:25)
	at org.apache.commons.lang3.SystemUtils.isOSVersionMatch(SystemUtils.java:1634)
	at org.apache.commons.lang3.SystemUtilsTest.testOsVersionMatches(SystemUtilsTest.java:408)

Running org.apache.commons.lang3.CharRangeTest
Tests run: 16, Failures: 0, Errors: 0, Skipped: 0, Time elapsed: 0.033 sec - in org.apache.commons.lang3.CharRangeTest
Running org.apache.commons.lang3.CharSetTest
Tests run: 14, Failures: 0, Errors: 0, Skipped: 0, Time elapsed: 0.007 sec - in org.apache.commons.lang3.CharSetTest
Running org.apache.commons.lang3.StringUtilsStartsEndsWithTest
Tests run: 6, Failures: 0, Errors: 2, Skipped: 0, Time elapsed: 0.001 sec <<< FAILURE! - in org.apache.commons.lang3.StringUtilsStartsEndsWithTest
testStartsWithAny(org.apache.commons.lang3.StringUtilsStartsEndsWithTest)  Time elapsed: 0 sec  <<< ERROR!
java.lang.NullPointerException: null
	at org.apache.commons.lang3.StringUtils.isEmpty(StringUtils.java:25)
	at org.apache.commons.lang3.StringUtils.startsWithAny(StringUtils.java:1102)
	at org.apache.commons.lang3.StringUtilsStartsEndsWithTest.testStartsWithAny(StringUtilsStartsEndsWithTest.java:88)

testEndsWithAny(org.apache.commons.lang3.StringUtilsStartsEndsWithTest)  Time elapsed: 0.001 sec  <<< ERROR!
java.lang.NullPointerException: null
	at org.apache.commons.lang3.StringUtils.isEmpty(StringUtils.java:25)
	at org.apache.commons.lang3.StringUtils.endsWithAny(StringUtils.java:1128)
	at org.apache.commons.lang3.StringUtilsStartsEndsWithTest.testEndsWithAny(StringUtilsStartsEndsWithTest.java:170)

Running org.apache.commons.lang3.RandomStringUtilsTest
Tests run: 11, Failures: 0, Errors: 0, Skipped: 0, Time elapsed: 0.034 sec - in org.apache.commons.lang3.RandomStringUtilsTest
Running org.apache.commons.lang3.SerializationUtilsTest
Tests run: 26, Failures: 0, Errors: 0, Skipped: 0, Time elapsed: 0.04 sec - in org.apache.commons.lang3.SerializationUtilsTest
Running org.apache.commons.lang3.time.StopWatchTest
Tests run: 8, Failures: 0, Errors: 0, Skipped: 0, Time elapsed: 4.761 sec - in org.apache.commons.lang3.time.StopWatchTest
Running org.apache.commons.lang3.time.DateUtilsRoundingTest
Tests run: 22, Failures: 0, Errors: 0, Skipped: 0, Time elapsed: 0.169 sec - in org.apache.commons.lang3.time.DateUtilsRoundingTest
Running org.apache.commons.lang3.time.FastDateParserTest
Tests run: 33, Failures: 0, Errors: 0, Skipped: 0, Time elapsed: 2.318 sec - in org.apache.commons.lang3.time.FastDateParserTest
Running org.apache.commons.lang3.time.FastDateFormat_ParserTest
Tests run: 33, Failures: 0, Errors: 0, Skipped: 0, Time elapsed: 0.784 sec - in org.apache.commons.lang3.time.FastDateFormat_ParserTest
Running org.apache.commons.lang3.time.DurationFormatUtilsTest
Tests run: 25, Failures: 0, Errors: 0, Skipped: 0, Time elapsed: 0.625 sec - in org.apache.commons.lang3.time.DurationFormatUtilsTest
Running org.apache.commons.lang3.time.DateFormatUtilsTest
Tests run: 10, Failures: 0, Errors: 0, Skipped: 0, Time elapsed: 0.002 sec - in org.apache.commons.lang3.time.DateFormatUtilsTest
Running org.apache.commons.lang3.time.DateUtilsFragmentTest
Tests run: 57, Failures: 0, Errors: 0, Skipped: 0, Time elapsed: 0.01 sec - in org.apache.commons.lang3.time.DateUtilsFragmentTest
Running org.apache.commons.lang3.time.FastDatePrinterTimeZonesTest
Tests run: 617, Failures: 0, Errors: 0, Skipped: 0, Time elapsed: 0.266 sec - in org.apache.commons.lang3.time.FastDatePrinterTimeZonesTest
Running org.apache.commons.lang3.time.FastDateFormatTest
>>FastDateFormatTest: FastDateParser:29859  SimpleDateFormat:3932
Tests run: 14, Failures: 0, Errors: 0, Skipped: 0, Time elapsed: 3.647 sec - in org.apache.commons.lang3.time.FastDateFormatTest
Running org.apache.commons.lang3.time.FastDateFormat_PrinterTest
Tests run: 17, Failures: 0, Errors: 0, Skipped: 0, Time elapsed: 0.007 sec - in org.apache.commons.lang3.time.FastDateFormat_PrinterTest
Running org.apache.commons.lang3.time.FastDatePrinterTest
Tests run: 17, Failures: 0, Errors: 0, Skipped: 0, Time elapsed: 0.009 sec - in org.apache.commons.lang3.time.FastDatePrinterTest
Running org.apache.commons.lang3.time.FastDateParserSDFTest
Tests run: 276, Failures: 0, Errors: 0, Skipped: 92, Time elapsed: 0.069 sec - in org.apache.commons.lang3.time.FastDateParserSDFTest
Running org.apache.commons.lang3.time.DateUtilsTest
DateUtilsTest: Default Locale=en_US
Tests run: 38, Failures: 0, Errors: 0, Skipped: 0, Time elapsed: 0.002 sec - in org.apache.commons.lang3.time.DateUtilsTest
Running org.apache.commons.lang3.reflect.InheritanceUtilsTest
Tests run: 9, Failures: 0, Errors: 0, Skipped: 0, Time elapsed: 0 sec - in org.apache.commons.lang3.reflect.InheritanceUtilsTest
Running org.apache.commons.lang3.reflect.MethodUtilsTest
Tests run: 23, Failures: 0, Errors: 0, Skipped: 0, Time elapsed: 0.001 sec - in org.apache.commons.lang3.reflect.MethodUtilsTest
Running org.apache.commons.lang3.reflect.ConstructorUtilsTest
Tests run: 7, Failures: 0, Errors: 0, Skipped: 0, Time elapsed: 0 sec - in org.apache.commons.lang3.reflect.ConstructorUtilsTest
Running org.apache.commons.lang3.reflect.FieldUtilsTest
Tests run: 64, Failures: 0, Errors: 0, Skipped: 0, Time elapsed: 0.017 sec - in org.apache.commons.lang3.reflect.FieldUtilsTest
Running org.apache.commons.lang3.reflect.TypeLiteralTest
Tests run: 4, Failures: 0, Errors: 0, Skipped: 0, Time elapsed: 0.001 sec - in org.apache.commons.lang3.reflect.TypeLiteralTest
Running org.apache.commons.lang3.reflect.TypeUtilsTest
Tests run: 19, Failures: 0, Errors: 0, Skipped: 0, Time elapsed: 0.045 sec - in org.apache.commons.lang3.reflect.TypeUtilsTest
Running org.apache.commons.lang3.mutable.MutableByteTest
Tests run: 17, Failures: 0, Errors: 0, Skipped: 0, Time elapsed: 0.003 sec - in org.apache.commons.lang3.mutable.MutableByteTest
Running org.apache.commons.lang3.mutable.MutableShortTest
Tests run: 14, Failures: 0, Errors: 0, Skipped: 0, Time elapsed: 0.001 sec - in org.apache.commons.lang3.mutable.MutableShortTest
Running org.apache.commons.lang3.mutable.MutableIntTest
Tests run: 17, Failures: 0, Errors: 0, Skipped: 0, Time elapsed: 0.004 sec - in org.apache.commons.lang3.mutable.MutableIntTest
Running org.apache.commons.lang3.mutable.MutableDoubleTest
Tests run: 18, Failures: 0, Errors: 0, Skipped: 0, Time elapsed: 0.004 sec - in org.apache.commons.lang3.mutable.MutableDoubleTest
Running org.apache.commons.lang3.mutable.MutableFloatTest
Tests run: 18, Failures: 0, Errors: 0, Skipped: 0, Time elapsed: 0.003 sec - in org.apache.commons.lang3.mutable.MutableFloatTest
Running org.apache.commons.lang3.mutable.MutableLongTest
Tests run: 17, Failures: 0, Errors: 0, Skipped: 0, Time elapsed: 0.003 sec - in org.apache.commons.lang3.mutable.MutableLongTest
Running org.apache.commons.lang3.mutable.MutableBooleanTest
Tests run: 9, Failures: 0, Errors: 0, Skipped: 0, Time elapsed: 0.001 sec - in org.apache.commons.lang3.mutable.MutableBooleanTest
Running org.apache.commons.lang3.mutable.MutableObjectTest
Tests run: 5, Failures: 0, Errors: 0, Skipped: 0, Time elapsed: 0 sec - in org.apache.commons.lang3.mutable.MutableObjectTest
Running org.apache.commons.lang3.text.translate.UnicodeEscaperTest
Tests run: 3, Failures: 0, Errors: 0, Skipped: 0, Time elapsed: 0 sec - in org.apache.commons.lang3.text.translate.UnicodeEscaperTest
Running org.apache.commons.lang3.text.translate.EntityArraysTest
Tests run: 3, Failures: 0, Errors: 0, Skipped: 0, Time elapsed: 0.001 sec - in org.apache.commons.lang3.text.translate.EntityArraysTest
Running org.apache.commons.lang3.text.translate.UnicodeUnpairedSurrogateRemoverTest
Tests run: 2, Failures: 0, Errors: 0, Skipped: 0, Time elapsed: 0 sec - in org.apache.commons.lang3.text.translate.UnicodeUnpairedSurrogateRemoverTest
Running org.apache.commons.lang3.text.translate.NumericEntityUnescaperTest
Tests run: 3, Failures: 0, Errors: 0, Skipped: 0, Time elapsed: 0 sec - in org.apache.commons.lang3.text.translate.NumericEntityUnescaperTest
Running org.apache.commons.lang3.text.translate.NumericEntityEscaperTest
Tests run: 4, Failures: 0, Errors: 0, Skipped: 0, Time elapsed: 0.001 sec - in org.apache.commons.lang3.text.translate.NumericEntityEscaperTest
Running org.apache.commons.lang3.text.translate.LookupTranslatorTest
Tests run: 2, Failures: 0, Errors: 0, Skipped: 0, Time elapsed: 0 sec - in org.apache.commons.lang3.text.translate.LookupTranslatorTest
Running org.apache.commons.lang3.text.translate.UnicodeUnescaperTest
Tests run: 3, Failures: 0, Errors: 0, Skipped: 0, Time elapsed: 0 sec - in org.apache.commons.lang3.text.translate.UnicodeUnescaperTest
Running org.apache.commons.lang3.text.translate.OctalUnescaperTest
Tests run: 1, Failures: 0, Errors: 0, Skipped: 0, Time elapsed: 0 sec - in org.apache.commons.lang3.text.translate.OctalUnescaperTest
Running org.apache.commons.lang3.text.StrMatcherTest
Tests run: 14, Failures: 2, Errors: 0, Skipped: 0, Time elapsed: 0.003 sec <<< FAILURE! - in org.apache.commons.lang3.text.StrMatcherTest
testCharSetMatcher_String(org.apache.commons.lang3.text.StrMatcherTest)  Time elapsed: 0 sec  <<< FAILURE!
java.lang.AssertionError: expected same:<org.apache.commons.lang3.text.StrMatcher$NoMatcher@16a1fa7f> was not:<org.apache.commons.lang3.text.StrMatcher$CharSetMatcher@6444b374>
	at org.junit.Assert.fail(Assert.java:88)
	at org.junit.Assert.failNotSame(Assert.java:828)
	at org.junit.Assert.assertSame(Assert.java:771)
	at org.junit.Assert.assertSame(Assert.java:782)
	at org.apache.commons.lang3.text.StrMatcherTest.testCharSetMatcher_String(StrMatcherTest.java:171)

testStringMatcher_String(org.apache.commons.lang3.text.StrMatcherTest)  Time elapsed: 0 sec  <<< FAILURE!
java.lang.AssertionError: expected same:<org.apache.commons.lang3.text.StrMatcher$NoMatcher@16a1fa7f> was not:<org.apache.commons.lang3.text.StrMatcher$StringMatcher@5a61b819>
	at org.junit.Assert.fail(Assert.java:88)
	at org.junit.Assert.failNotSame(Assert.java:828)
	at org.junit.Assert.assertSame(Assert.java:771)
	at org.junit.Assert.assertSame(Assert.java:782)
	at org.apache.commons.lang3.text.StrMatcherTest.testStringMatcher_String(StrMatcherTest.java:201)

Running org.apache.commons.lang3.text.StrTokenizerTest
Tests run: 55, Failures: 15, Errors: 0, Skipped: 0, Time elapsed: 0.019 sec <<< FAILURE! - in org.apache.commons.lang3.text.StrTokenizerTest
testBasicEmpty2(org.apache.commons.lang3.text.StrTokenizerTest)  Time elapsed: 0 sec  <<< FAILURE!
java.lang.AssertionError: expected:<null> but was:<>
	at org.junit.Assert.fail(Assert.java:88)
	at org.junit.Assert.failNotEquals(Assert.java:834)
	at org.junit.Assert.assertEquals(Assert.java:118)
	at org.junit.Assert.assertEquals(Assert.java:144)
	at org.apache.commons.lang3.text.StrTokenizerTest.testBasicEmpty2(StrTokenizerTest.java:318)

testListArray(org.apache.commons.lang3.text.StrTokenizerTest)  Time elapsed: 0 sec  <<< FAILURE!
java.lang.AssertionError: expected:<3> but was:<4>
	at org.junit.Assert.fail(Assert.java:88)
	at org.junit.Assert.failNotEquals(Assert.java:834)
	at org.junit.Assert.assertEquals(Assert.java:645)
	at org.junit.Assert.assertEquals(Assert.java:631)
	at org.apache.commons.lang3.text.StrTokenizerTest.testListArray(StrTokenizerTest.java:507)

testBasicQuoted2(org.apache.commons.lang3.text.StrTokenizerTest)  Time elapsed: 0 sec  <<< FAILURE!
java.lang.AssertionError: expected:<null> but was:<>
	at org.junit.Assert.fail(Assert.java:88)
	at org.junit.Assert.failNotEquals(Assert.java:834)
	at org.junit.Assert.assertEquals(Assert.java:118)
	at org.junit.Assert.assertEquals(Assert.java:144)
	at org.apache.commons.lang3.text.StrTokenizerTest.testBasicQuoted2(StrTokenizerTest.java:342)

test4(org.apache.commons.lang3.text.StrTokenizerTest)  Time elapsed: 0 sec  <<< FAILURE!
java.lang.AssertionError: {a,b,c,d;"e,f,,,} expected:<5> but was:<8>
	at org.junit.Assert.fail(Assert.java:88)
	at org.junit.Assert.failNotEquals(Assert.java:834)
	at org.junit.Assert.assertEquals(Assert.java:645)
	at org.apache.commons.lang3.text.StrTokenizerTest.test4(StrTokenizerTest.java:123)

test5(org.apache.commons.lang3.text.StrTokenizerTest)  Time elapsed: 0.001 sec  <<< FAILURE!
java.lang.AssertionError: token[5] was '' but was expected to be 'null' expected:<null> but was:<>
	at org.junit.Assert.fail(Assert.java:88)
	at org.junit.Assert.failNotEquals(Assert.java:834)
	at org.junit.Assert.assertEquals(Assert.java:118)
	at org.apache.commons.lang3.text.StrTokenizerTest.test5(StrTokenizerTest.java:147)

test8(org.apache.commons.lang3.text.StrTokenizerTest)  Time elapsed: 0 sec  <<< FAILURE!
java.lang.AssertionError: {a,,,b,c,d e,f,} expected:<5> but was:<8>
	at org.junit.Assert.fail(Assert.java:88)
	at org.junit.Assert.failNotEquals(Assert.java:834)
	at org.junit.Assert.assertEquals(Assert.java:645)
	at org.apache.commons.lang3.text.StrTokenizerTest.test8(StrTokenizerTest.java:223)

testBasicIgnoreTrimmed1(org.apache.commons.lang3.text.StrTokenizerTest)  Time elapsed: 0 sec  <<< FAILURE!
java.lang.AssertionError: expected:<null> but was:<>
	at org.junit.Assert.fail(Assert.java:88)
	at org.junit.Assert.failNotEquals(Assert.java:834)
	at org.junit.Assert.assertEquals(Assert.java:118)
	at org.junit.Assert.assertEquals(Assert.java:144)
	at org.apache.commons.lang3.text.StrTokenizerTest.testBasicIgnoreTrimmed1(StrTokenizerTest.java:453)

testBasicIgnoreTrimmed2(org.apache.commons.lang3.text.StrTokenizerTest)  Time elapsed: 0 sec  <<< FAILURE!
java.lang.AssertionError: expected:<null> but was:<>
	at org.junit.Assert.fail(Assert.java:88)
	at org.junit.Assert.failNotEquals(Assert.java:834)
	at org.junit.Assert.assertEquals(Assert.java:118)
	at org.junit.Assert.assertEquals(Assert.java:144)
	at org.apache.commons.lang3.text.StrTokenizerTest.testBasicIgnoreTrimmed2(StrTokenizerTest.java:467)

testBasicIgnoreTrimmed4(org.apache.commons.lang3.text.StrTokenizerTest)  Time elapsed: 0 sec  <<< FAILURE!
java.lang.AssertionError: expected:<null> but was:<>
	at org.junit.Assert.fail(Assert.java:88)
	at org.junit.Assert.failNotEquals(Assert.java:834)
	at org.junit.Assert.assertEquals(Assert.java:118)
	at org.junit.Assert.assertEquals(Assert.java:144)
	at org.apache.commons.lang3.text.StrTokenizerTest.testBasicIgnoreTrimmed4(StrTokenizerTest.java:494)

testBasicQuotedTrimmed1(org.apache.commons.lang3.text.StrTokenizerTest)  Time elapsed: 0 sec  <<< FAILURE!
java.lang.AssertionError: expected:<null> but was:<>
	at org.junit.Assert.fail(Assert.java:88)
	at org.junit.Assert.failNotEquals(Assert.java:834)
	at org.junit.Assert.assertEquals(Assert.java:118)
	at org.junit.Assert.assertEquals(Assert.java:144)
	at org.apache.commons.lang3.text.StrTokenizerTest.testBasicQuotedTrimmed1(StrTokenizerTest.java:413)

testBasic1(org.apache.commons.lang3.text.StrTokenizerTest)  Time elapsed: 0.001 sec  <<< FAILURE!
org.junit.ComparisonFailure: expected:<[b]> but was:<[]>
	at org.junit.Assert.assertEquals(Assert.java:115)
	at org.junit.Assert.assertEquals(Assert.java:144)
	at org.apache.commons.lang3.text.StrTokenizerTest.testBasic1(StrTokenizerTest.java:236)

testBasic2(org.apache.commons.lang3.text.StrTokenizerTest)  Time elapsed: 0 sec  <<< FAILURE!
org.junit.ComparisonFailure: expected:<[b]> but was:<[]>
	at org.junit.Assert.assertEquals(Assert.java:115)
	at org.junit.Assert.assertEquals(Assert.java:144)
	at org.apache.commons.lang3.text.StrTokenizerTest.testBasic2(StrTokenizerTest.java:246)

testBasic3(org.apache.commons.lang3.text.StrTokenizerTest)  Time elapsed: 0 sec  <<< FAILURE!
org.junit.ComparisonFailure: expected:<[b]> but was:<[]>
	at org.junit.Assert.assertEquals(Assert.java:115)
	at org.junit.Assert.assertEquals(Assert.java:144)
	at org.apache.commons.lang3.text.StrTokenizerTest.testBasic3(StrTokenizerTest.java:256)

testBasicTrimmed1(org.apache.commons.lang3.text.StrTokenizerTest)  Time elapsed: 0 sec  <<< FAILURE!
java.lang.AssertionError: expected:<null> but was:<>
	at org.junit.Assert.fail(Assert.java:88)
	at org.junit.Assert.failNotEquals(Assert.java:834)
	at org.junit.Assert.assertEquals(Assert.java:118)
	at org.junit.Assert.assertEquals(Assert.java:144)
	at org.apache.commons.lang3.text.StrTokenizerTest.testBasicTrimmed1(StrTokenizerTest.java:426)

testBasicTrimmed2(org.apache.commons.lang3.text.StrTokenizerTest)  Time elapsed: 0 sec  <<< FAILURE!
java.lang.AssertionError: expected:<null> but was:<>
	at org.junit.Assert.fail(Assert.java:88)
	at org.junit.Assert.failNotEquals(Assert.java:834)
	at org.junit.Assert.assertEquals(Assert.java:118)
	at org.junit.Assert.assertEquals(Assert.java:144)
	at org.apache.commons.lang3.text.StrTokenizerTest.testBasicTrimmed2(StrTokenizerTest.java:439)

Running org.apache.commons.lang3.text.FormattableUtilsTest
Tests run: 5, Failures: 0, Errors: 0, Skipped: 0, Time elapsed: 0 sec - in org.apache.commons.lang3.text.FormattableUtilsTest
Running org.apache.commons.lang3.text.CompositeFormatTest
Tests run: 2, Failures: 0, Errors: 0, Skipped: 0, Time elapsed: 0.001 sec - in org.apache.commons.lang3.text.CompositeFormatTest
Running org.apache.commons.lang3.text.WordUtilsTest
Tests run: 12, Failures: 0, Errors: 9, Skipped: 0, Time elapsed: 0.005 sec <<< FAILURE! - in org.apache.commons.lang3.text.WordUtilsTest
testCapitalizeWithDelimiters_String(org.apache.commons.lang3.text.WordUtilsTest)  Time elapsed: 0 sec  <<< ERROR!
java.lang.NullPointerException: null
	at org.apache.commons.lang3.StringUtils.isEmpty(StringUtils.java:25)
	at org.apache.commons.lang3.text.WordUtils.capitalize(WordUtils.java:290)
	at org.apache.commons.lang3.text.WordUtilsTest.testCapitalizeWithDelimiters_String(WordUtilsTest.java:176)

testUncapitalize_String(org.apache.commons.lang3.text.WordUtilsTest)  Time elapsed: 0 sec  <<< ERROR!
java.lang.NullPointerException: null
	at org.apache.commons.lang3.StringUtils.isEmpty(StringUtils.java:25)
	at org.apache.commons.lang3.text.WordUtils.uncapitalize(WordUtils.java:415)
	at org.apache.commons.lang3.text.WordUtils.uncapitalize(WordUtils.java:385)
	at org.apache.commons.lang3.text.WordUtilsTest.testUncapitalize_String(WordUtilsTest.java:226)

testCapitalize_String(org.apache.commons.lang3.text.WordUtilsTest)  Time elapsed: 0 sec  <<< ERROR!
java.lang.NullPointerException: null
	at org.apache.commons.lang3.StringUtils.isEmpty(StringUtils.java:25)
	at org.apache.commons.lang3.text.WordUtils.capitalize(WordUtils.java:290)
	at org.apache.commons.lang3.text.WordUtils.capitalize(WordUtils.java:256)
	at org.apache.commons.lang3.text.WordUtilsTest.testCapitalize_String(WordUtilsTest.java:162)

testCapitalizeFully_String(org.apache.commons.lang3.text.WordUtilsTest)  Time elapsed: 0.001 sec  <<< ERROR!
java.lang.NullPointerException: null
	at org.apache.commons.lang3.StringUtils.isEmpty(StringUtils.java:25)
	at org.apache.commons.lang3.text.WordUtils.capitalizeFully(WordUtils.java:359)
	at org.apache.commons.lang3.text.WordUtils.capitalizeFully(WordUtils.java:328)
	at org.apache.commons.lang3.text.WordUtilsTest.testCapitalizeFully_String(WordUtilsTest.java:194)

testInitials_String_charArray(org.apache.commons.lang3.text.WordUtilsTest)  Time elapsed: 0 sec  <<< ERROR!
java.lang.NullPointerException: null
	at org.apache.commons.lang3.StringUtils.isEmpty(StringUtils.java:25)
	at org.apache.commons.lang3.text.WordUtils.initials(WordUtils.java:540)
	at org.apache.commons.lang3.text.WordUtilsTest.testInitials_String_charArray(WordUtilsTest.java:275)

testUncapitalizeWithDelimiters_String(org.apache.commons.lang3.text.WordUtilsTest)  Time elapsed: 0.001 sec  <<< ERROR!
java.lang.NullPointerException: null
	at org.apache.commons.lang3.StringUtils.isEmpty(StringUtils.java:25)
	at org.apache.commons.lang3.text.WordUtils.uncapitalize(WordUtils.java:415)
	at org.apache.commons.lang3.text.WordUtilsTest.testUncapitalizeWithDelimiters_String(WordUtilsTest.java:240)

testInitials_String(org.apache.commons.lang3.text.WordUtilsTest)  Time elapsed: 0 sec  <<< ERROR!
java.lang.NullPointerException: null
	at org.apache.commons.lang3.StringUtils.isEmpty(StringUtils.java:25)
	at org.apache.commons.lang3.text.WordUtils.initials(WordUtils.java:540)
	at org.apache.commons.lang3.text.WordUtils.initials(WordUtils.java:509)
	at org.apache.commons.lang3.text.WordUtilsTest.testInitials_String(WordUtilsTest.java:259)

testCapitalizeFullyWithDelimiters_String(org.apache.commons.lang3.text.WordUtilsTest)  Time elapsed: 0 sec  <<< ERROR!
java.lang.NullPointerException: null
	at org.apache.commons.lang3.StringUtils.isEmpty(StringUtils.java:25)
	at org.apache.commons.lang3.text.WordUtils.capitalizeFully(WordUtils.java:359)
	at org.apache.commons.lang3.text.WordUtilsTest.testCapitalizeFullyWithDelimiters_String(WordUtilsTest.java:208)

testSwapCase_String(org.apache.commons.lang3.text.WordUtilsTest)  Time elapsed: 0.001 sec  <<< ERROR!
java.lang.NullPointerException: null
	at org.apache.commons.lang3.StringUtils.isEmpty(StringUtils.java:25)
	at org.apache.commons.lang3.text.WordUtils.swapCase(WordUtils.java:456)
	at org.apache.commons.lang3.text.WordUtilsTest.testSwapCase_String(WordUtilsTest.java:356)

Running org.apache.commons.lang3.text.StrLookupTest
Tests run: 5, Failures: 0, Errors: 0, Skipped: 0, Time elapsed: 0.002 sec - in org.apache.commons.lang3.text.StrLookupTest
Running org.apache.commons.lang3.text.StrBuilderAppendInsertTest
Tests run: 51, Failures: 0, Errors: 0, Skipped: 0, Time elapsed: 0.012 sec - in org.apache.commons.lang3.text.StrBuilderAppendInsertTest
Running org.apache.commons.lang3.text.ExtendedMessageFormatTest
Tests run: 10, Failures: 0, Errors: 0, Skipped: 0, Time elapsed: 0.699 sec - in org.apache.commons.lang3.text.ExtendedMessageFormatTest
Running org.apache.commons.lang3.text.StrSubstitutorTest
Tests run: 40, Failures: 0, Errors: 1, Skipped: 0, Time elapsed: 0.035 sec <<< FAILURE! - in org.apache.commons.lang3.text.StrSubstitutorTest
testGetSetValueDelimiter(org.apache.commons.lang3.text.StrSubstitutorTest)  Time elapsed: 0.001 sec  <<< ERROR!
java.lang.NullPointerException: null
	at org.apache.commons.lang3.StringUtils.isEmpty(StringUtils.java:25)
	at org.apache.commons.lang3.text.StrSubstitutor.setValueDelimiter(StrSubstitutor.java:1144)
	at org.apache.commons.lang3.text.StrSubstitutorTest.testGetSetValueDelimiter(StrSubstitutorTest.java:545)

Running org.apache.commons.lang3.text.StrBuilderTest
Tests run: 90, Failures: 1, Errors: 0, Skipped: 0, Time elapsed: 0.044 sec <<< FAILURE! - in org.apache.commons.lang3.text.StrBuilderTest
testAsTokenizer(org.apache.commons.lang3.text.StrBuilderTest)  Time elapsed: 0 sec  <<< FAILURE!
java.lang.AssertionError: expected:<2> but was:<3>
	at org.junit.Assert.fail(Assert.java:88)
	at org.junit.Assert.failNotEquals(Assert.java:834)
	at org.junit.Assert.assertEquals(Assert.java:645)
	at org.junit.Assert.assertEquals(Assert.java:631)
	at org.apache.commons.lang3.text.StrBuilderTest.testAsTokenizer(StrBuilderTest.java:1666)

Running org.apache.commons.lang3.StringEscapeUtilsTest
Tests run: 28, Failures: 0, Errors: 0, Skipped: 0, Time elapsed: 0.376 sec - in org.apache.commons.lang3.StringEscapeUtilsTest
Running org.apache.commons.lang3.AnnotationUtilsTest
Tests run: 10, Failures: 0, Errors: 0, Skipped: 0, Time elapsed: 0.019 sec - in org.apache.commons.lang3.AnnotationUtilsTest
Running org.apache.commons.lang3.ConversionTest
Tests run: 42, Failures: 0, Errors: 0, Skipped: 0, Time elapsed: 0.013 sec - in org.apache.commons.lang3.ConversionTest
Running org.apache.commons.lang3.StringUtilsTrimEmptyTest
Tests run: 15, Failures: 1, Errors: 5, Skipped: 0, Time elapsed: 0.007 sec <<< FAILURE! - in org.apache.commons.lang3.StringUtilsTrimEmptyTest
testStripAll(org.apache.commons.lang3.StringUtilsTrimEmptyTest)  Time elapsed: 0 sec  <<< ERROR!
java.lang.NullPointerException: null
	at org.apache.commons.lang3.StringUtils.isEmpty(StringUtils.java:25)
	at org.apache.commons.lang3.StringUtils.strip(StringUtils.java:51)
	at org.apache.commons.lang3.StringUtils.stripAll(StringUtils.java:73)
	at org.apache.commons.lang3.StringUtils.stripAll(StringUtils.java:67)
	at org.apache.commons.lang3.StringUtilsTrimEmptyTest.testStripAll(StringUtilsTrimEmptyTest.java:252)

testIsNotEmpty(org.apache.commons.lang3.StringUtilsTrimEmptyTest)  Time elapsed: 0 sec  <<< ERROR!
java.lang.NullPointerException: null
	at org.apache.commons.lang3.StringUtils.isEmpty(StringUtils.java:25)
	at org.apache.commons.lang3.StringUtils.isNotEmpty(StringUtils.java:26)
	at org.apache.commons.lang3.StringUtilsTrimEmptyTest.testIsNotEmpty(StringUtilsTrimEmptyTest.java:47)

testStrip_StringString(org.apache.commons.lang3.StringUtilsTrimEmptyTest)  Time elapsed: 0 sec  <<< ERROR!
java.lang.NullPointerException: null
	at org.apache.commons.lang3.StringUtils.isEmpty(StringUtils.java:25)
	at org.apache.commons.lang3.StringUtils.strip(StringUtils.java:51)
	at org.apache.commons.lang3.StringUtilsTrimEmptyTest.testStrip_StringString(StringUtilsTrimEmptyTest.java:148)

testTrimToNull(org.apache.commons.lang3.StringUtilsTrimEmptyTest)  Time elapsed: 0 sec  <<< FAILURE!
java.lang.AssertionError: expected:<null> but was:<>
	at org.junit.Assert.fail(Assert.java:88)
	at org.junit.Assert.failNotEquals(Assert.java:834)
	at org.junit.Assert.assertEquals(Assert.java:118)
	at org.junit.Assert.assertEquals(Assert.java:144)
	at org.apache.commons.lang3.StringUtilsTrimEmptyTest.testTrimToNull(StringUtilsTrimEmptyTest.java:92)

testIsEmpty(org.apache.commons.lang3.StringUtilsTrimEmptyTest)  Time elapsed: 0 sec  <<< ERROR!
java.lang.NullPointerException: null
	at org.apache.commons.lang3.StringUtils.isEmpty(StringUtils.java:25)
	at org.apache.commons.lang3.StringUtilsTrimEmptyTest.testIsEmpty(StringUtilsTrimEmptyTest.java:38)

testStrip_String(org.apache.commons.lang3.StringUtilsTrimEmptyTest)  Time elapsed: 0 sec  <<< ERROR!
java.lang.NullPointerException: null
	at org.apache.commons.lang3.StringUtils.isEmpty(StringUtils.java:25)
	at org.apache.commons.lang3.StringUtils.strip(StringUtils.java:51)
	at org.apache.commons.lang3.StringUtils.strip(StringUtils.java:46)
	at org.apache.commons.lang3.StringUtilsTrimEmptyTest.testStrip_String(StringUtilsTrimEmptyTest.java:115)

Running org.apache.commons.lang3.EnumUtilsTest
Tests run: 34, Failures: 0, Errors: 0, Skipped: 0, Time elapsed: 0.007 sec - in org.apache.commons.lang3.EnumUtilsTest
Running org.apache.commons.lang3.exception.ExceptionUtilsTest
Tests run: 28, Failures: 0, Errors: 0, Skipped: 0, Time elapsed: 0.023 sec - in org.apache.commons.lang3.exception.ExceptionUtilsTest
Running org.apache.commons.lang3.exception.DefaultExceptionContextTest
Tests run: 8, Failures: 0, Errors: 0, Skipped: 0, Time elapsed: 0.004 sec - in org.apache.commons.lang3.exception.DefaultExceptionContextTest
Running org.apache.commons.lang3.exception.ContextedExceptionTest
Tests run: 14, Failures: 1, Errors: 0, Skipped: 0, Time elapsed: 0.01 sec <<< FAILURE! - in org.apache.commons.lang3.exception.ContextedExceptionTest
testContextedException(org.apache.commons.lang3.exception.ContextedExceptionTest)  Time elapsed: 0.001 sec  <<< FAILURE!
java.lang.AssertionError: null
	at org.junit.Assert.fail(Assert.java:86)
	at org.junit.Assert.assertTrue(Assert.java:41)
	at org.junit.Assert.assertTrue(Assert.java:52)
	at org.apache.commons.lang3.exception.ContextedExceptionTest.testContextedException(ContextedExceptionTest.java:45)

Running org.apache.commons.lang3.exception.ContextedRuntimeExceptionTest
Tests run: 14, Failures: 1, Errors: 0, Skipped: 0, Time elapsed: 0.01 sec <<< FAILURE! - in org.apache.commons.lang3.exception.ContextedRuntimeExceptionTest
testContextedException(org.apache.commons.lang3.exception.ContextedRuntimeExceptionTest)  Time elapsed: 0.001 sec  <<< FAILURE!
java.lang.AssertionError: null
	at org.junit.Assert.fail(Assert.java:86)
	at org.junit.Assert.assertTrue(Assert.java:41)
	at org.junit.Assert.assertTrue(Assert.java:52)
	at org.apache.commons.lang3.exception.ContextedRuntimeExceptionTest.testContextedException(ContextedRuntimeExceptionTest.java:47)

Running org.apache.commons.lang3.BitFieldTest
Tests run: 15, Failures: 0, Errors: 0, Skipped: 0, Time elapsed: 0.003 sec - in org.apache.commons.lang3.BitFieldTest
Running org.apache.commons.lang3.ArrayUtilsRemoveMultipleTest
Tests run: 55, Failures: 0, Errors: 0, Skipped: 0, Time elapsed: 0.012 sec - in org.apache.commons.lang3.ArrayUtilsRemoveMultipleTest
Running org.apache.commons.lang3.HashSetvBitSetTest
Ratio=11% array=100 count=1 extract=13070226 bitset=1544285
Ratio=7% array=100 count=10 extract=16225382 bitset=1218763
Ratio=5% array=100 count=50 extract=22284952 bitset=1116206
Ratio=4% array=100 count=100 extract=10154226 bitset=470682
Ratio=138% array=1000 count=10 extract=6865306 bitset=9525749
Ratio=47% array=1000 count=100 extract=15826880 bitset=7543741
Ratio=7% array=1000 count=500 extract=42419071 bitset=3194771
Ratio=1% array=1000 count=1000 extract=69255494 bitset=735713
Ratio=98% count=0 hash=2486434 bits=2459420
Ratio=5% count=5 hash=3700098 bits=205168
Ratio=15% count=10 hash=1878164 bits=287265
Ratio=22% count=200 hash=18365447 bits=4186766
Ratio=17% count=50 hash=5775740 bits=1007813
Ratio=27% count=100 hash=8665682 bits=2355606
Ratio=21% count=1000 hash=74077523 bits=16085095
Ratio=20% count=2000 hash=154457262 bits=31932888
Tests run: 2, Failures: 0, Errors: 0, Skipped: 0, Time elapsed: 0.64 sec - in org.apache.commons.lang3.HashSetvBitSetTest
Running org.apache.commons.lang3.StringUtilsTest
Tests run: 124, Failures: 5, Errors: 29, Skipped: 0, Time elapsed: 0.107 sec <<< FAILURE! - in org.apache.commons.lang3.StringUtilsTest
testDeleteWhitespace_String(org.apache.commons.lang3.StringUtilsTest)  Time elapsed: 0 sec  <<< ERROR!
java.lang.NullPointerException: null
	at org.apache.commons.lang3.StringUtils.isEmpty(StringUtils.java:25)
	at org.apache.commons.lang3.StringUtils.deleteWhitespace(StringUtils.java:562)
	at org.apache.commons.lang3.StringUtilsTest.testDeleteWhitespace_String(StringUtilsTest.java:1106)

testRemove_String(org.apache.commons.lang3.StringUtilsTest)  Time elapsed: 0 sec  <<< ERROR!
java.lang.NullPointerException: null
	at org.apache.commons.lang3.StringUtils.isEmpty(StringUtils.java:25)
	at org.apache.commons.lang3.StringUtils.remove(StringUtils.java:583)
	at org.apache.commons.lang3.StringUtilsTest.testRemove_String(StringUtilsTest.java:2186)

testIsAnyEmpty(org.apache.commons.lang3.StringUtilsTest)  Time elapsed: 0 sec  <<< ERROR!
java.lang.NullPointerException: null
	at org.apache.commons.lang3.StringUtils.isEmpty(StringUtils.java:25)
	at org.apache.commons.lang3.StringUtils.isAnyEmpty(StringUtils.java:28)
	at org.apache.commons.lang3.StringUtilsTest.testIsAnyEmpty(StringUtilsTest.java:147)

testNormalizeSpace(org.apache.commons.lang3.StringUtilsTest)  Time elapsed: 0 sec  <<< ERROR!
java.lang.NullPointerException: null
	at org.apache.commons.lang3.StringUtils.isEmpty(StringUtils.java:25)
	at org.apache.commons.lang3.StringUtils.normalizeSpace(StringUtils.java:1111)
	at org.apache.commons.lang3.StringUtilsTest.testNormalizeSpace(StringUtilsTest.java:2275)

testPrependIfMissing(org.apache.commons.lang3.StringUtilsTest)  Time elapsed: 0 sec  <<< ERROR!
java.lang.NullPointerException: null
	at org.apache.commons.lang3.StringUtils.isEmpty(StringUtils.java:25)
	at org.apache.commons.lang3.StringUtils.prependIfMissing(StringUtils.java:1136)
	at org.apache.commons.lang3.StringUtils.prependIfMissing(StringUtils.java:1139)
	at org.apache.commons.lang3.StringUtilsTest.testPrependIfMissing(StringUtilsTest.java:2435)

testIsAllLowerCase(org.apache.commons.lang3.StringUtilsTest)  Time elapsed: 0 sec  <<< FAILURE!
java.lang.AssertionError: null
	at org.junit.Assert.fail(Assert.java:86)
	at org.junit.Assert.assertTrue(Assert.java:41)
	at org.junit.Assert.assertFalse(Assert.java:64)
	at org.junit.Assert.assertFalse(Assert.java:74)
	at org.apache.commons.lang3.StringUtilsTest.testIsAllLowerCase(StringUtilsTest.java:2070)

testChomp(org.apache.commons.lang3.StringUtilsTest)  Time elapsed: 0 sec  <<< ERROR!
java.lang.StringIndexOutOfBoundsException: String index out of range: -1
	at java.lang.String.charAt(String.java:658)
	at org.apache.commons.lang3.StringUtils.chomp(StringUtils.java:695)
	at org.apache.commons.lang3.StringUtilsTest.testChomp(StringUtilsTest.java:1421)

testDefaultIfEmpty_CharBuffers(org.apache.commons.lang3.StringUtilsTest)  Time elapsed: 0 sec  <<< FAILURE!
org.junit.ComparisonFailure: expected:<[NULL]> but was:<[]>
	at org.junit.Assert.assertEquals(Assert.java:115)
	at org.junit.Assert.assertEquals(Assert.java:144)
	at org.apache.commons.lang3.StringUtilsTest.testDefaultIfEmpty_CharBuffers(StringUtilsTest.java:1714)

testRemoveStart(org.apache.commons.lang3.StringUtilsTest)  Time elapsed: 0 sec  <<< ERROR!
java.lang.NullPointerException: null
	at org.apache.commons.lang3.StringUtils.isEmpty(StringUtils.java:25)
	at org.apache.commons.lang3.StringUtils.removeStart(StringUtils.java:571)
	at org.apache.commons.lang3.StringUtilsTest.testRemoveStart(StringUtilsTest.java:2101)

testRemove_char(org.apache.commons.lang3.StringUtilsTest)  Time elapsed: 0 sec  <<< ERROR!
java.lang.NullPointerException: null
	at org.apache.commons.lang3.StringUtils.isEmpty(StringUtils.java:25)
	at org.apache.commons.lang3.StringUtils.remove(StringUtils.java:585)
	at org.apache.commons.lang3.StringUtilsTest.testRemove_char(StringUtilsTest.java:2215)

testAbbreviateMiddle(org.apache.commons.lang3.StringUtilsTest)  Time elapsed: 0 sec  <<< ERROR!
java.lang.NullPointerException: null
	at org.apache.commons.lang3.StringUtils.isEmpty(StringUtils.java:25)
	at org.apache.commons.lang3.StringUtils.abbreviateMiddle(StringUtils.java:915)
	at org.apache.commons.lang3.StringUtilsTest.testAbbreviateMiddle(StringUtilsTest.java:1827)

testIsAllUpperCase(org.apache.commons.lang3.StringUtilsTest)  Time elapsed: 0.001 sec  <<< FAILURE!
java.lang.AssertionError: null
	at org.junit.Assert.fail(Assert.java:86)
	at org.junit.Assert.assertTrue(Assert.java:41)
	at org.junit.Assert.assertFalse(Assert.java:64)
	at org.junit.Assert.assertFalse(Assert.java:74)
	at org.apache.commons.lang3.StringUtilsTest.testIsAllUpperCase(StringUtilsTest.java:2087)

testRemoveEndIgnoreCase(org.apache.commons.lang3.StringUtilsTest)  Time elapsed: 0 sec  <<< ERROR!
java.lang.NullPointerException: null
	at org.apache.commons.lang3.StringUtils.isEmpty(StringUtils.java:25)
	at org.apache.commons.lang3.StringUtils.removeEndIgnoreCase(StringUtils.java:580)
	at org.apache.commons.lang3.StringUtilsTest.testRemoveEndIgnoreCase(StringUtilsTest.java:2162)

testAppendIfMissingIgnoreCase(org.apache.commons.lang3.StringUtilsTest)  Time elapsed: 0 sec  <<< ERROR!
java.lang.NullPointerException: null
	at org.apache.commons.lang3.StringUtils.isEmpty(StringUtils.java:25)
	at org.apache.commons.lang3.StringUtils.appendIfMissing(StringUtils.java:1131)
	at org.apache.commons.lang3.StringUtils.appendIfMissingIgnoreCase(StringUtils.java:1135)
	at org.apache.commons.lang3.StringUtilsTest.testAppendIfMissingIgnoreCase(StringUtilsTest.java:2411)

testWrap_StringString(org.apache.commons.lang3.StringUtilsTest)  Time elapsed: 0 sec  <<< ERROR!
java.lang.NullPointerException: null
	at org.apache.commons.lang3.StringUtils.isEmpty(StringUtils.java:25)
	at org.apache.commons.lang3.StringUtils.wrap(StringUtils.java:1145)
	at org.apache.commons.lang3.StringUtilsTest.testWrap_StringString(StringUtilsTest.java:2518)

testDefaultIfEmpty_StringBuffers(org.apache.commons.lang3.StringUtilsTest)  Time elapsed: 0 sec  <<< FAILURE!
org.junit.ComparisonFailure: expected:<[NULL]> but was:<[]>
	at org.junit.Assert.assertEquals(Assert.java:115)
	at org.junit.Assert.assertEquals(Assert.java:144)
	at org.apache.commons.lang3.StringUtilsTest.testDefaultIfEmpty_StringBuffers(StringUtilsTest.java:1693)

testReplaceChars_StringStringString(org.apache.commons.lang3.StringUtilsTest)  Time elapsed: 0 sec  <<< ERROR!
java.lang.NullPointerException: null
	at org.apache.commons.lang3.StringUtils.isEmpty(StringUtils.java:25)
	at org.apache.commons.lang3.StringUtils.replaceChars(StringUtils.java:664)
	at org.apache.commons.lang3.StringUtilsTest.testReplaceChars_StringStringString(StringUtilsTest.java:1273)

testLeftPad_StringIntString(org.apache.commons.lang3.StringUtilsTest)  Time elapsed: 0 sec  <<< ERROR!
java.lang.NullPointerException: null
	at org.apache.commons.lang3.StringUtils.isEmpty(StringUtils.java:25)
	at org.apache.commons.lang3.StringUtils.leftPad(StringUtils.java:764)
	at org.apache.commons.lang3.StringUtilsTest.testLeftPad_StringIntString(StringUtilsTest.java:1524)

testAppendIfMissing(org.apache.commons.lang3.StringUtilsTest)  Time elapsed: 0 sec  <<< ERROR!
java.lang.NullPointerException: null
	at org.apache.commons.lang3.StringUtils.isEmpty(StringUtils.java:25)
	at org.apache.commons.lang3.StringUtils.appendIfMissing(StringUtils.java:1131)
	at org.apache.commons.lang3.StringUtils.appendIfMissing(StringUtils.java:1134)
	at org.apache.commons.lang3.StringUtilsTest.testAppendIfMissing(StringUtilsTest.java:2387)

testDefaultIfEmpty_StringString(org.apache.commons.lang3.StringUtilsTest)  Time elapsed: 0 sec  <<< ERROR!
java.lang.NullPointerException: null
	at org.apache.commons.lang3.StringUtils.isEmpty(StringUtils.java:25)
	at org.apache.commons.lang3.StringUtils.defaultIfEmpty(StringUtils.java:897)
	at org.apache.commons.lang3.StringUtilsTest.testDefaultIfEmpty_StringString(StringUtilsTest.java:1649)

testIsNotEmpty(org.apache.commons.lang3.StringUtilsTest)  Time elapsed: 0 sec  <<< ERROR!
java.lang.NullPointerException: null
	at org.apache.commons.lang3.StringUtils.isEmpty(StringUtils.java:25)
	at org.apache.commons.lang3.StringUtils.isNotEmpty(StringUtils.java:26)
	at org.apache.commons.lang3.StringUtilsTest.testIsNotEmpty(StringUtilsTest.java:138)

testReplaceOnce_StringStringString(org.apache.commons.lang3.StringUtilsTest)  Time elapsed: 0.001 sec  <<< ERROR!
java.lang.NullPointerException: null
	at org.apache.commons.lang3.StringUtils.isEmpty(StringUtils.java:25)
	at org.apache.commons.lang3.StringUtils.replace(StringUtils.java:596)
	at org.apache.commons.lang3.StringUtils.replaceOnce(StringUtils.java:592)
	at org.apache.commons.lang3.StringUtilsTest.testReplaceOnce_StringStringString(StringUtilsTest.java:1184)

testReplace_StringStringString(org.apache.commons.lang3.StringUtilsTest)  Time elapsed: 0 sec  <<< ERROR!
java.lang.NullPointerException: null
	at org.apache.commons.lang3.StringUtils.isEmpty(StringUtils.java:25)
	at org.apache.commons.lang3.StringUtils.replace(StringUtils.java:596)
	at org.apache.commons.lang3.StringUtils.replace(StringUtils.java:595)
	at org.apache.commons.lang3.StringUtilsTest.testReplace_StringStringString(StringUtilsTest.java:1126)

testIsNoneEmpty(org.apache.commons.lang3.StringUtilsTest)  Time elapsed: 0 sec  <<< ERROR!
java.lang.NullPointerException: null
	at org.apache.commons.lang3.StringUtils.isEmpty(StringUtils.java:25)
	at org.apache.commons.lang3.StringUtils.isAnyEmpty(StringUtils.java:28)
	at org.apache.commons.lang3.StringUtils.isNoneEmpty(StringUtils.java:30)
	at org.apache.commons.lang3.StringUtilsTest.testIsNoneEmpty(StringUtilsTest.java:159)

testDefaultIfEmpty_StringBuilders(org.apache.commons.lang3.StringUtilsTest)  Time elapsed: 0 sec  <<< FAILURE!
org.junit.ComparisonFailure: expected:<[NULL]> but was:<[]>
	at org.junit.Assert.assertEquals(Assert.java:115)
	at org.junit.Assert.assertEquals(Assert.java:144)
	at org.apache.commons.lang3.StringUtilsTest.testDefaultIfEmpty_StringBuilders(StringUtilsTest.java:1672)

testPrependIfMissingIgnoreCase(org.apache.commons.lang3.StringUtilsTest)  Time elapsed: 0 sec  <<< ERROR!
java.lang.NullPointerException: null
	at org.apache.commons.lang3.StringUtils.isEmpty(StringUtils.java:25)
	at org.apache.commons.lang3.StringUtils.prependIfMissing(StringUtils.java:1136)
	at org.apache.commons.lang3.StringUtils.prependIfMissingIgnoreCase(StringUtils.java:1140)
	at org.apache.commons.lang3.StringUtilsTest.testPrependIfMissingIgnoreCase(StringUtilsTest.java:2459)

testRightPad_StringIntString(org.apache.commons.lang3.StringUtilsTest)  Time elapsed: 0 sec  <<< ERROR!
java.lang.NullPointerException: null
	at org.apache.commons.lang3.StringUtils.isEmpty(StringUtils.java:25)
	at org.apache.commons.lang3.StringUtils.rightPad(StringUtils.java:743)
	at org.apache.commons.lang3.StringUtilsTest.testRightPad_StringIntString(StringUtilsTest.java:1488)

testSwapCase_String(org.apache.commons.lang3.StringUtilsTest)  Time elapsed: 0 sec  <<< ERROR!
java.lang.NullPointerException: null
	at org.apache.commons.lang3.StringUtils.isEmpty(StringUtils.java:25)
	at org.apache.commons.lang3.StringUtils.swapCase(StringUtils.java:813)
	at org.apache.commons.lang3.StringUtilsTest.testSwapCase_String(StringUtilsTest.java:274)

testIsEmpty(org.apache.commons.lang3.StringUtilsTest)  Time elapsed: 0 sec  <<< ERROR!
java.lang.NullPointerException: null
	at org.apache.commons.lang3.StringUtils.isEmpty(StringUtils.java:25)
	at org.apache.commons.lang3.StringUtilsTest.testIsEmpty(StringUtilsTest.java:129)

testWrap_StringChar(org.apache.commons.lang3.StringUtilsTest)  Time elapsed: 0 sec  <<< ERROR!
java.lang.NullPointerException: null
	at org.apache.commons.lang3.StringUtils.isEmpty(StringUtils.java:25)
	at org.apache.commons.lang3.StringUtils.wrap(StringUtils.java:1145)
	at org.apache.commons.lang3.StringUtilsTest.testWrap_StringChar(StringUtilsTest.java:2501)

testRemoveStartIgnoreCase(org.apache.commons.lang3.StringUtilsTest)  Time elapsed: 0 sec  <<< ERROR!
java.lang.NullPointerException: null
	at org.apache.commons.lang3.StringUtils.isEmpty(StringUtils.java:25)
	at org.apache.commons.lang3.StringUtils.removeStartIgnoreCase(StringUtils.java:574)
	at org.apache.commons.lang3.StringUtilsTest.testRemoveStartIgnoreCase(StringUtilsTest.java:2120)

testRemoveEnd(org.apache.commons.lang3.StringUtilsTest)  Time elapsed: 0.001 sec  <<< ERROR!
java.lang.NullPointerException: null
	at org.apache.commons.lang3.StringUtils.isEmpty(StringUtils.java:25)
	at org.apache.commons.lang3.StringUtils.removeEnd(StringUtils.java:577)
	at org.apache.commons.lang3.StringUtilsTest.testRemoveEnd(StringUtilsTest.java:2142)

testCenter_StringIntString(org.apache.commons.lang3.StringUtilsTest)  Time elapsed: 0 sec  <<< ERROR!
java.lang.NullPointerException: null
	at org.apache.commons.lang3.StringUtils.isEmpty(StringUtils.java:25)
	at org.apache.commons.lang3.StringUtils.center(StringUtils.java:788)
	at org.apache.commons.lang3.StringUtilsTest.testCenter_StringIntString(StringUtilsTest.java:1611)

testReplace_StringStringStringInt(org.apache.commons.lang3.StringUtilsTest)  Time elapsed: 0 sec  <<< ERROR!
java.lang.NullPointerException: null
	at org.apache.commons.lang3.StringUtils.isEmpty(StringUtils.java:25)
	at org.apache.commons.lang3.StringUtils.replace(StringUtils.java:596)
	at org.apache.commons.lang3.StringUtilsTest.testReplace_StringStringStringInt(StringUtilsTest.java:1158)

Running org.apache.commons.lang3.ArrayUtilsRemoveTest
Tests run: 19, Failures: 0, Errors: 0, Skipped: 0, Time elapsed: 0 sec - in org.apache.commons.lang3.ArrayUtilsRemoveTest
Running org.apache.commons.lang3.ObjectUtilsTest
Tests run: 36, Failures: 0, Errors: 0, Skipped: 0, Time elapsed: 0.004 sec - in org.apache.commons.lang3.ObjectUtilsTest
Running org.apache.commons.lang3.ClassPathUtilsTest
Tests run: 13, Failures: 0, Errors: 0, Skipped: 0, Time elapsed: 0.002 sec - in org.apache.commons.lang3.ClassPathUtilsTest
Running org.apache.commons.lang3.math.NumberUtilsTest
Tests run: 91, Failures: 0, Errors: 3, Skipped: 0, Time elapsed: 0.028 sec <<< FAILURE! - in org.apache.commons.lang3.math.NumberUtilsTest
testIsParsable(org.apache.commons.lang3.math.NumberUtilsTest)  Time elapsed: 0.001 sec  <<< ERROR!
java.lang.NullPointerException: null
	at org.apache.commons.lang3.StringUtils.isEmpty(StringUtils.java:25)
	at org.apache.commons.lang3.StringUtils.replace(StringUtils.java:596)
	at org.apache.commons.lang3.StringUtils.replaceOnce(StringUtils.java:592)
	at org.apache.commons.lang3.math.NumberUtils.isParsable(NumberUtils.java:1522)
	at org.apache.commons.lang3.math.NumberUtilsTest.testIsParsable(NumberUtilsTest.java:1276)

testIsDigits(org.apache.commons.lang3.math.NumberUtilsTest)  Time elapsed: 0 sec  <<< ERROR!
java.lang.NullPointerException: null
	at org.apache.commons.lang3.StringUtils.isEmpty(StringUtils.java:25)
	at org.apache.commons.lang3.math.NumberUtils.isDigits(NumberUtils.java:1352)
	at org.apache.commons.lang3.math.NumberUtilsTest.testIsDigits(NumberUtilsTest.java:1178)

testIsNumber(org.apache.commons.lang3.math.NumberUtilsTest)  Time elapsed: 0 sec  <<< ERROR!
java.lang.NullPointerException: null
	at org.apache.commons.lang3.StringUtils.isEmpty(StringUtils.java:25)
	at org.apache.commons.lang3.math.NumberUtils.isNumber(NumberUtils.java:1383)
	at org.apache.commons.lang3.math.NumberUtilsTest.compareIsNumberWithCreateNumber(NumberUtilsTest.java:1266)
	at org.apache.commons.lang3.math.NumberUtilsTest.testIsNumber(NumberUtilsTest.java:1213)

Running org.apache.commons.lang3.math.IEEE754rUtilsTest
Tests run: 3, Failures: 0, Errors: 0, Skipped: 0, Time elapsed: 0 sec - in org.apache.commons.lang3.math.IEEE754rUtilsTest
Running org.apache.commons.lang3.math.FractionTest
Tests run: 25, Failures: 0, Errors: 0, Skipped: 0, Time elapsed: 0.084 sec - in org.apache.commons.lang3.math.FractionTest
Running org.apache.commons.lang3.BooleanUtilsTest
Tests run: 72, Failures: 0, Errors: 0, Skipped: 0, Time elapsed: 0.016 sec - in org.apache.commons.lang3.BooleanUtilsTest
Running org.apache.commons.lang3.CharSequenceUtilsTest
Tests run: 2, Failures: 0, Errors: 0, Skipped: 0, Time elapsed: 0.001 sec - in org.apache.commons.lang3.CharSequenceUtilsTest
Running org.apache.commons.lang3.CharSetUtilsTest
Tests run: 11, Failures: 0, Errors: 10, Skipped: 0, Time elapsed: 0.002 sec <<< FAILURE! - in org.apache.commons.lang3.CharSetUtilsTest
testSqueeze_StringString(org.apache.commons.lang3.CharSetUtilsTest)  Time elapsed: 0 sec  <<< ERROR!
java.lang.NullPointerException: null
	at org.apache.commons.lang3.StringUtils.isEmpty(StringUtils.java:25)
	at org.apache.commons.lang3.CharSetUtils.squeeze(CharSetUtils.java:65)
	at org.apache.commons.lang3.CharSetUtilsTest.testSqueeze_StringString(CharSetUtilsTest.java:50)

testDelete_StringString(org.apache.commons.lang3.CharSetUtilsTest)  Time elapsed: 0 sec  <<< ERROR!
java.lang.NullPointerException: null
	at org.apache.commons.lang3.StringUtils.isEmpty(StringUtils.java:25)
	at org.apache.commons.lang3.CharSetUtils.delete(CharSetUtils.java:206)
	at org.apache.commons.lang3.CharSetUtilsTest.testDelete_StringString(CharSetUtilsTest.java:214)

testKeep_StringString(org.apache.commons.lang3.CharSetUtilsTest)  Time elapsed: 0 sec  <<< ERROR!
java.lang.NullPointerException: null
	at org.apache.commons.lang3.StringUtils.isEmpty(StringUtils.java:25)
	at org.apache.commons.lang3.StringUtils.isNotEmpty(StringUtils.java:26)
	at org.apache.commons.lang3.CharSetUtils.deepEmpty(CharSetUtils.java:244)
	at org.apache.commons.lang3.CharSetUtils.keep(CharSetUtils.java:179)
	at org.apache.commons.lang3.CharSetUtilsTest.testKeep_StringString(CharSetUtilsTest.java:178)

testDelete_StringStringarray(org.apache.commons.lang3.CharSetUtilsTest)  Time elapsed: 0 sec  <<< ERROR!
java.lang.NullPointerException: null
	at org.apache.commons.lang3.StringUtils.isEmpty(StringUtils.java:25)
	at org.apache.commons.lang3.CharSetUtils.delete(CharSetUtils.java:206)
	at org.apache.commons.lang3.CharSetUtilsTest.testDelete_StringStringarray(CharSetUtilsTest.java:230)

testCount_StringStringarray(org.apache.commons.lang3.CharSetUtilsTest)  Time elapsed: 0 sec  <<< ERROR!
java.lang.NullPointerException: null
	at org.apache.commons.lang3.StringUtils.isEmpty(StringUtils.java:25)
	at org.apache.commons.lang3.CharSetUtils.count(CharSetUtils.java:141)
	at org.apache.commons.lang3.CharSetUtilsTest.testCount_StringStringarray(CharSetUtilsTest.java:146)

testContainsAny_StringString(org.apache.commons.lang3.CharSetUtilsTest)  Time elapsed: 0 sec  <<< ERROR!
java.lang.NullPointerException: null
	at org.apache.commons.lang3.StringUtils.isEmpty(StringUtils.java:25)
	at org.apache.commons.lang3.CharSetUtils.containsAny(CharSetUtils.java:108)
	at org.apache.commons.lang3.CharSetUtilsTest.testContainsAny_StringString(CharSetUtilsTest.java:91)

testKeep_StringStringarray(org.apache.commons.lang3.CharSetUtilsTest)  Time elapsed: 0.001 sec  <<< ERROR!
java.lang.NullPointerException: null
	at org.apache.commons.lang3.StringUtils.isEmpty(StringUtils.java:25)
	at org.apache.commons.lang3.StringUtils.isNotEmpty(StringUtils.java:26)
	at org.apache.commons.lang3.CharSetUtils.deepEmpty(CharSetUtils.java:244)
	at org.apache.commons.lang3.CharSetUtils.keep(CharSetUtils.java:179)
	at org.apache.commons.lang3.CharSetUtilsTest.testKeep_StringStringarray(CharSetUtilsTest.java:200)

testCount_StringString(org.apache.commons.lang3.CharSetUtilsTest)  Time elapsed: 0 sec  <<< ERROR!
java.lang.NullPointerException: null
	at org.apache.commons.lang3.StringUtils.isEmpty(StringUtils.java:25)
	at org.apache.commons.lang3.CharSetUtils.count(CharSetUtils.java:141)
	at org.apache.commons.lang3.CharSetUtilsTest.testCount_StringString(CharSetUtilsTest.java:131)

testContainsAny_StringStringarray(org.apache.commons.lang3.CharSetUtilsTest)  Time elapsed: 0 sec  <<< ERROR!
java.lang.NullPointerException: null
	at org.apache.commons.lang3.StringUtils.isEmpty(StringUtils.java:25)
	at org.apache.commons.lang3.CharSetUtils.containsAny(CharSetUtils.java:108)
	at org.apache.commons.lang3.CharSetUtilsTest.testContainsAny_StringStringarray(CharSetUtilsTest.java:106)

testSqueeze_StringStringarray(org.apache.commons.lang3.CharSetUtilsTest)  Time elapsed: 0.001 sec  <<< ERROR!
java.lang.NullPointerException: null
	at org.apache.commons.lang3.StringUtils.isEmpty(StringUtils.java:25)
	at org.apache.commons.lang3.CharSetUtils.squeeze(CharSetUtils.java:65)
	at org.apache.commons.lang3.CharSetUtilsTest.testSqueeze_StringStringarray(CharSetUtilsTest.java:67)

Running org.apache.commons.lang3.ArrayUtilsAddTest
Tests run: 13, Failures: 0, Errors: 0, Skipped: 0, Time elapsed: 0 sec - in org.apache.commons.lang3.ArrayUtilsAddTest
Running org.apache.commons.lang3.CharEncodingTest
Tests run: 6, Failures: 0, Errors: 0, Skipped: 0, Time elapsed: 0.013 sec - in org.apache.commons.lang3.CharEncodingTest
Running org.apache.commons.lang3.ClassUtilsTest
Tests run: 57, Failures: 0, Errors: 2, Skipped: 0, Time elapsed: 0.029 sec <<< FAILURE! - in org.apache.commons.lang3.ClassUtilsTest
test_getShortClassName_String(org.apache.commons.lang3.ClassUtilsTest)  Time elapsed: 0.001 sec  <<< ERROR!
java.lang.NullPointerException: null
	at org.apache.commons.lang3.StringUtils.isEmpty(StringUtils.java:25)
	at org.apache.commons.lang3.ClassUtils.getShortClassName(ClassUtils.java:195)
	at org.apache.commons.lang3.ClassUtilsTest.test_getShortClassName_String(ClassUtilsTest.java:134)

test_getPackageName_String(org.apache.commons.lang3.ClassUtilsTest)  Time elapsed: 0 sec  <<< ERROR!
java.lang.NullPointerException: null
	at org.apache.commons.lang3.StringUtils.isEmpty(StringUtils.java:25)
	at org.apache.commons.lang3.ClassUtils.getPackageName(ClassUtils.java:297)
	at org.apache.commons.lang3.ClassUtilsTest.test_getPackageName_String(ClassUtilsTest.java:230)

Running org.apache.commons.lang3.RangeTest
Tests run: 24, Failures: 0, Errors: 0, Skipped: 0, Time elapsed: 0.012 sec - in org.apache.commons.lang3.RangeTest
Running org.apache.commons.lang3.event.EventUtilsTest
Tests run: 8, Failures: 0, Errors: 0, Skipped: 0, Time elapsed: 0.028 sec - in org.apache.commons.lang3.event.EventUtilsTest
Running org.apache.commons.lang3.event.EventListenerSupportTest
Tests run: 9, Failures: 0, Errors: 0, Skipped: 0, Time elapsed: 0.021 sec - in org.apache.commons.lang3.event.EventListenerSupportTest
Running org.apache.commons.lang3.ArrayUtilsTest
Tests run: 205, Failures: 0, Errors: 0, Skipped: 0, Time elapsed: 0.047 sec - in org.apache.commons.lang3.ArrayUtilsTest
Running org.apache.commons.lang3.CharUtilsTest
Tests run: 24, Failures: 0, Errors: 3, Skipped: 0, Time elapsed: 0.002 sec <<< FAILURE! - in org.apache.commons.lang3.CharUtilsTest
testToChar_String(org.apache.commons.lang3.CharUtilsTest)  Time elapsed: 0 sec  <<< ERROR!
java.lang.NullPointerException: null
	at org.apache.commons.lang3.StringUtils.isEmpty(StringUtils.java:25)
	at org.apache.commons.lang3.CharUtils.toChar(CharUtils.java:175)
	at org.apache.commons.lang3.CharUtilsTest.testToChar_String(CharUtilsTest.java:104)

testToChar_String_char(org.apache.commons.lang3.CharUtilsTest)  Time elapsed: 0 sec  <<< ERROR!
java.lang.StringIndexOutOfBoundsException: String index out of range: 0
	at java.lang.String.charAt(String.java:658)
	at org.apache.commons.lang3.CharUtils.toChar(CharUtils.java:200)
	at org.apache.commons.lang3.CharUtilsTest.testToChar_String_char(CharUtilsTest.java:115)

testToCharacterObject_String(org.apache.commons.lang3.CharUtilsTest)  Time elapsed: 0 sec  <<< ERROR!
java.lang.NullPointerException: null
	at org.apache.commons.lang3.StringUtils.isEmpty(StringUtils.java:25)
	at org.apache.commons.lang3.CharUtils.toCharacterObject(CharUtils.java:111)
	at org.apache.commons.lang3.CharUtilsTest.testToCharacterObject_String(CharUtilsTest.java:76)

Running org.apache.commons.lang3.NotImplementedExceptionTest
Tests run: 1, Failures: 0, Errors: 0, Skipped: 0, Time elapsed: 0 sec - in org.apache.commons.lang3.NotImplementedExceptionTest
Running org.apache.commons.lang3.StringUtilsEqualsIndexOfTest
Tests run: 50, Failures: 0, Errors: 12, Skipped: 0, Time elapsed: 0.002 sec <<< FAILURE! - in org.apache.commons.lang3.StringUtilsEqualsIndexOfTest
testIndexOfAny_StringString(org.apache.commons.lang3.StringUtilsEqualsIndexOfTest)  Time elapsed: 0 sec  <<< ERROR!
java.lang.NullPointerException: null
	at org.apache.commons.lang3.StringUtils.isEmpty(StringUtils.java:25)
	at org.apache.commons.lang3.StringUtils.indexOfAny(StringUtils.java:165)
	at org.apache.commons.lang3.StringUtilsEqualsIndexOfTest.testIndexOfAny_StringString(StringUtilsEqualsIndexOfTest.java:676)

testIndexOfAnyBut_StringString(org.apache.commons.lang3.StringUtilsEqualsIndexOfTest)  Time elapsed: 0 sec  <<< ERROR!
java.lang.NullPointerException: null
	at org.apache.commons.lang3.StringUtils.isEmpty(StringUtils.java:25)
	at org.apache.commons.lang3.StringUtils.indexOfAnyBut(StringUtils.java:200)
	at org.apache.commons.lang3.StringUtilsEqualsIndexOfTest.testIndexOfAnyBut_StringString(StringUtilsEqualsIndexOfTest.java:749)

testContains_Char(org.apache.commons.lang3.StringUtilsEqualsIndexOfTest)  Time elapsed: 0 sec  <<< ERROR!
java.lang.NullPointerException: null
	at org.apache.commons.lang3.StringUtils.isEmpty(StringUtils.java:25)
	at org.apache.commons.lang3.StringUtils.contains(StringUtils.java:135)
	at org.apache.commons.lang3.StringUtilsEqualsIndexOfTest.testContains_Char(StringUtilsEqualsIndexOfTest.java:66)

testIndexOf_char(org.apache.commons.lang3.StringUtilsEqualsIndexOfTest)  Time elapsed: 0 sec  <<< ERROR!
java.lang.NullPointerException: null
	at org.apache.commons.lang3.StringUtils.isEmpty(StringUtils.java:25)
	at org.apache.commons.lang3.StringUtils.indexOf(StringUtils.java:87)
	at org.apache.commons.lang3.StringUtilsEqualsIndexOfTest.testIndexOf_char(StringUtilsEqualsIndexOfTest.java:578)

testIndexOf_charInt(org.apache.commons.lang3.StringUtilsEqualsIndexOfTest)  Time elapsed: 0 sec  <<< ERROR!
java.lang.NullPointerException: null
	at org.apache.commons.lang3.StringUtils.isEmpty(StringUtils.java:25)
	at org.apache.commons.lang3.StringUtils.indexOf(StringUtils.java:89)
	at org.apache.commons.lang3.StringUtilsEqualsIndexOfTest.testIndexOf_charInt(StringUtilsEqualsIndexOfTest.java:588)

testContainsAny_StringString(org.apache.commons.lang3.StringUtilsEqualsIndexOfTest)  Time elapsed: 0 sec  <<< ERROR!
java.lang.NullPointerException: null
	at org.apache.commons.lang3.StringUtils.isEmpty(StringUtils.java:25)
	at org.apache.commons.lang3.StringUtils.containsAny(StringUtils.java:167)
	at org.apache.commons.lang3.StringUtils.containsAny(StringUtils.java:182)
	at org.apache.commons.lang3.StringUtilsEqualsIndexOfTest.testContainsAny_StringString(StringUtilsEqualsIndexOfTest.java:172)

testLastIndexOf_charInt(org.apache.commons.lang3.StringUtilsEqualsIndexOfTest)  Time elapsed: 0 sec  <<< ERROR!
java.lang.NullPointerException: null
	at org.apache.commons.lang3.StringUtils.isEmpty(StringUtils.java:25)
	at org.apache.commons.lang3.StringUtils.lastIndexOf(StringUtils.java:118)
	at org.apache.commons.lang3.StringUtilsEqualsIndexOfTest.testLastIndexOf_charInt(StringUtilsEqualsIndexOfTest.java:817)

testIndexOfAnyBut_StringCharArray(org.apache.commons.lang3.StringUtilsEqualsIndexOfTest)  Time elapsed: 0 sec  <<< ERROR!
java.lang.NullPointerException: null
	at org.apache.commons.lang3.StringUtils.isEmpty(StringUtils.java:25)
	at org.apache.commons.lang3.StringUtils.indexOfAnyBut(StringUtils.java:186)
	at org.apache.commons.lang3.StringUtilsEqualsIndexOfTest.testIndexOfAnyBut_StringCharArray(StringUtilsEqualsIndexOfTest.java:722)

testLastIndexOf_char(org.apache.commons.lang3.StringUtilsEqualsIndexOfTest)  Time elapsed: 0 sec  <<< ERROR!
java.lang.NullPointerException: null
	at org.apache.commons.lang3.StringUtils.isEmpty(StringUtils.java:25)
	at org.apache.commons.lang3.StringUtils.lastIndexOf(StringUtils.java:116)
	at org.apache.commons.lang3.StringUtilsEqualsIndexOfTest.testLastIndexOf_char(StringUtilsEqualsIndexOfTest.java:807)

testContainsAny_StringCharArray(org.apache.commons.lang3.StringUtilsEqualsIndexOfTest)  Time elapsed: 0 sec  <<< ERROR!
java.lang.NullPointerException: null
	at org.apache.commons.lang3.StringUtils.isEmpty(StringUtils.java:25)
	at org.apache.commons.lang3.StringUtils.containsAny(StringUtils.java:167)
	at org.apache.commons.lang3.StringUtilsEqualsIndexOfTest.testContainsAny_StringCharArray(StringUtilsEqualsIndexOfTest.java:119)

testContainsAny_StringStringArray(org.apache.commons.lang3.StringUtilsEqualsIndexOfTest)  Time elapsed: 0 sec  <<< ERROR!
java.lang.NullPointerException: null
	at org.apache.commons.lang3.StringUtils.isEmpty(StringUtils.java:25)
	at org.apache.commons.lang3.StringUtils.containsAny(StringUtils.java:183)
	at org.apache.commons.lang3.StringUtilsEqualsIndexOfTest.testContainsAny_StringStringArray(StringUtilsEqualsIndexOfTest.java:219)

testIndexOfAny_StringCharArray(org.apache.commons.lang3.StringUtilsEqualsIndexOfTest)  Time elapsed: 0 sec  <<< ERROR!
java.lang.NullPointerException: null
	at org.apache.commons.lang3.StringUtils.isEmpty(StringUtils.java:25)
	at org.apache.commons.lang3.StringUtils.indexOfAny(StringUtils.java:152)
	at org.apache.commons.lang3.StringUtilsEqualsIndexOfTest.testIndexOfAny_StringCharArray(StringUtilsEqualsIndexOfTest.java:648)

Running org.apache.commons.lang3.RandomUtilsTest
Tests run: 23, Failures: 0, Errors: 0, Skipped: 0, Time elapsed: 0.004 sec - in org.apache.commons.lang3.RandomUtilsTest

Results :

Failed tests: 
  StringUtilsTest.testDefaultIfEmpty_CharBuffers:1714 expected:<[NULL]> but was:<[]>
  StringUtilsTest.testDefaultIfEmpty_StringBuffers:1693 expected:<[NULL]> but was:<[]>
  StringUtilsTest.testDefaultIfEmpty_StringBuilders:1672 expected:<[NULL]> but was:<[]>
  StringUtilsTest.testIsAllLowerCase:2070 null
  StringUtilsTest.testIsAllUpperCase:2087 null
  StringUtilsTrimEmptyTest.testTrimToNull:92 expected:<null> but was:<>
  ContextedExceptionTest.testContextedException:45 null
  ContextedRuntimeExceptionTest.testContextedException:47 null
  StrBuilderTest.testAsTokenizer:1666 expected:<2> but was:<3>
  StrMatcherTest.testCharSetMatcher_String:171 expected same:<org.apache.commons.lang3.text.StrMatcher$NoMatcher@16a1fa7f> was not:<org.apache.commons.lang3.text.StrMatcher$CharSetMatcher@6444b374>
  StrMatcherTest.testStringMatcher_String:201 expected same:<org.apache.commons.lang3.text.StrMatcher$NoMatcher@16a1fa7f> was not:<org.apache.commons.lang3.text.StrMatcher$StringMatcher@5a61b819>
  StrTokenizerTest.test4:123 {a,b,c,d;"e,f,,,} expected:<5> but was:<8>
  StrTokenizerTest.test5:147 token[5] was '' but was expected to be 'null' expected:<null> but was:<>
  StrTokenizerTest.test8:223 {a,,,b,c,d e,f,} expected:<5> but was:<8>
  StrTokenizerTest.testBasic1:236 expected:<[b]> but was:<[]>
  StrTokenizerTest.testBasic2:246 expected:<[b]> but was:<[]>
  StrTokenizerTest.testBasic3:256 expected:<[b]> but was:<[]>
  StrTokenizerTest.testBasicEmpty2:318 expected:<null> but was:<>
  StrTokenizerTest.testBasicIgnoreTrimmed1:453 expected:<null> but was:<>
  StrTokenizerTest.testBasicIgnoreTrimmed2:467 expected:<null> but was:<>
  StrTokenizerTest.testBasicIgnoreTrimmed4:494 expected:<null> but was:<>
  StrTokenizerTest.testBasicQuoted2:342 expected:<null> but was:<>
  StrTokenizerTest.testBasicQuotedTrimmed1:413 expected:<null> but was:<>
  StrTokenizerTest.testBasicTrimmed1:426 expected:<null> but was:<>
  StrTokenizerTest.testBasicTrimmed2:439 expected:<null> but was:<>
  StrTokenizerTest.testListArray:507 expected:<3> but was:<4>

Tests in error: 
  CharSetUtilsTest.testContainsAny_StringString:91 » NullPointer
  CharSetUtilsTest.testContainsAny_StringStringarray:106 » NullPointer
  CharSetUtilsTest.testCount_StringString:131 » NullPointer
  CharSetUtilsTest.testCount_StringStringarray:146 » NullPointer
  CharSetUtilsTest.testDelete_StringString:214 » NullPointer
  CharSetUtilsTest.testDelete_StringStringarray:230 » NullPointer
  CharSetUtilsTest.testKeep_StringString:178 » NullPointer
  CharSetUtilsTest.testKeep_StringStringarray:200 » NullPointer
  CharSetUtilsTest.testSqueeze_StringString:50 » NullPointer
  CharSetUtilsTest.testSqueeze_StringStringarray:67 » NullPointer
  CharUtilsTest.testToChar_String:104 » NullPointer
  CharUtilsTest.testToChar_String_char:115 » StringIndexOutOfBounds String index...
  CharUtilsTest.testToCharacterObject_String:76 » NullPointer
  ClassUtilsTest.test_getPackageName_String:230 » NullPointer
  ClassUtilsTest.test_getShortClassName_String:134 » NullPointer
  StringUtilsEqualsIndexOfTest.testContainsAny_StringCharArray:119 » NullPointer
  StringUtilsEqualsIndexOfTest.testContainsAny_StringString:172 » NullPointer
  StringUtilsEqualsIndexOfTest.testContainsAny_StringStringArray:219 » NullPointer
  StringUtilsEqualsIndexOfTest.testContains_Char:66 » NullPointer
  StringUtilsEqualsIndexOfTest.testIndexOfAnyBut_StringCharArray:722 » NullPointer
  StringUtilsEqualsIndexOfTest.testIndexOfAnyBut_StringString:749 » NullPointer
  StringUtilsEqualsIndexOfTest.testIndexOfAny_StringCharArray:648 » NullPointer
  StringUtilsEqualsIndexOfTest.testIndexOfAny_StringString:676 » NullPointer
  StringUtilsEqualsIndexOfTest.testIndexOf_char:578 » NullPointer
  StringUtilsEqualsIndexOfTest.testIndexOf_charInt:588 » NullPointer
  StringUtilsEqualsIndexOfTest.testLastIndexOf_char:807 » NullPointer
  StringUtilsEqualsIndexOfTest.testLastIndexOf_charInt:817 » NullPointer
  StringUtilsIsTest.testIsAlpha:35 » NullPointer
  StringUtilsIsTest.testIsAlphanumeric:50 » NullPointer
  StringUtilsIsTest.testIsNumeric:137 » NullPointer
  StringUtilsStartsEndsWithTest.testEndsWithAny:170 » NullPointer
  StringUtilsStartsEndsWithTest.testStartsWithAny:88 » NullPointer
  StringUtilsSubstringTest.testCountMatches_String:310 » NullPointer
  StringUtilsSubstringTest.testCountMatches_char:327 » NullPointer
  StringUtilsSubstringTest.testSubstringAfterLast_StringString:201 » NullPointer
  StringUtilsSubstringTest.testSubstringAfter_StringString:157 » NullPointer
  StringUtilsSubstringTest.testSubstringBeforeLast_StringString:177 » NullPointer
  StringUtilsSubstringTest.testSubstringBefore_StringString:137 » NullPointer
  StringUtilsSubstringTest.testSubstringsBetween_StringStringString:291 » NullPointer
  StringUtilsTest.testAbbreviateMiddle:1827 » NullPointer
  StringUtilsTest.testAppendIfMissing:2387 » NullPointer
  StringUtilsTest.testAppendIfMissingIgnoreCase:2411 » NullPointer
  StringUtilsTest.testCenter_StringIntString:1611 » NullPointer
  StringUtilsTest.testChomp:1421 » StringIndexOutOfBounds String index out of ra...
  StringUtilsTest.testDefaultIfEmpty_StringString:1649 » NullPointer
  StringUtilsTest.testDeleteWhitespace_String:1106 » NullPointer
  StringUtilsTest.testIsAnyEmpty:147 » NullPointer
  StringUtilsTest.testIsEmpty:129 » NullPointer
  StringUtilsTest.testIsNoneEmpty:159 » NullPointer
  StringUtilsTest.testIsNotEmpty:138 » NullPointer
  StringUtilsTest.testLeftPad_StringIntString:1524 » NullPointer
  StringUtilsTest.testNormalizeSpace:2275 » NullPointer
  StringUtilsTest.testPrependIfMissing:2435 » NullPointer
  StringUtilsTest.testPrependIfMissingIgnoreCase:2459 » NullPointer
  StringUtilsTest.testRemoveEnd:2142 » NullPointer
  StringUtilsTest.testRemoveEndIgnoreCase:2162 » NullPointer
  StringUtilsTest.testRemoveStart:2101 » NullPointer
  StringUtilsTest.testRemoveStartIgnoreCase:2120 » NullPointer
  StringUtilsTest.testRemove_String:2186 » NullPointer
  StringUtilsTest.testRemove_char:2215 » NullPointer
  StringUtilsTest.testReplaceChars_StringStringString:1273 » NullPointer
  StringUtilsTest.testReplaceOnce_StringStringString:1184 » NullPointer
  StringUtilsTest.testReplace_StringStringString:1126 » NullPointer
  StringUtilsTest.testReplace_StringStringStringInt:1158 » NullPointer
  StringUtilsTest.testRightPad_StringIntString:1488 » NullPointer
  StringUtilsTest.testSwapCase_String:274 » NullPointer
  StringUtilsTest.testWrap_StringChar:2501 » NullPointer
  StringUtilsTest.testWrap_StringString:2518 » NullPointer
  StringUtilsTrimEmptyTest.testIsEmpty:38 » NullPointer
  StringUtilsTrimEmptyTest.testIsNotEmpty:47 » NullPointer
  StringUtilsTrimEmptyTest.testStripAll:252 » NullPointer
  StringUtilsTrimEmptyTest.testStrip_String:115 » NullPointer
  StringUtilsTrimEmptyTest.testStrip_StringString:148 » NullPointer
  SystemUtilsTest.testOsVersionMatches:408 » NullPointer
  NumberUtilsTest.testIsDigits:1178 » NullPointer
  NumberUtilsTest.testIsNumber:1213->compareIsNumberWithCreateNumber:1266 » NullPointer
  NumberUtilsTest.testIsParsable:1276 » NullPointer
  StrSubstitutorTest.testGetSetValueDelimiter:545 » NullPointer
  WordUtilsTest.testCapitalizeFullyWithDelimiters_String:208 » NullPointer
  WordUtilsTest.testCapitalizeFully_String:194 » NullPointer
  WordUtilsTest.testCapitalizeWithDelimiters_String:176 » NullPointer
  WordUtilsTest.testCapitalize_String:162 » NullPointer
  WordUtilsTest.testInitials_String:259 » NullPointer
  WordUtilsTest.testInitials_String_charArray:275 » NullPointer
  WordUtilsTest.testSwapCase_String:356 » NullPointer
  WordUtilsTest.testUncapitalizeWithDelimiters_String:240 » NullPointer
  WordUtilsTest.testUncapitalize_String:226 » NullPointer


Tests run: 3526, Failures: 26, Errors: 87, Skipped: 97

[INFO] ------------------------------------------------------------------------
[INFO] BUILD FAILURE
[INFO] ------------------------------------------------------------------------
[INFO] Total time: 34.734s
[INFO] Finished at: Tue Aug 04 02:10:02 BST 2015
[INFO] Final Memory: 23M/414M
[INFO] ------------------------------------------------------------------------
[ERROR] Failed to execute goal org.apache.maven.plugins:maven-surefire-plugin:2.18:test (default-test) on project commons-lang3: There are test failures.
[ERROR] 
[ERROR] Please refer to /home/perham/Study/LittleDarwin/Cases/commons-lang3-3.4-src/target/surefire-reports for the individual test results.
[ERROR] -> [Help 1]
[ERROR] 
[ERROR] To see the full stack trace of the errors, re-run Maven with the -e switch.
[ERROR] Re-run Maven using the -X switch to enable full debug logging.
[ERROR] 
[ERROR] For more information about the errors and possible solutions, please read the following articles:
[ERROR] [Help 1] http://cwiki.apache.org/confluence/display/MAVEN/MojoFailureException
