[INFO] Scanning for projects...
[INFO]                                                                         
[INFO] ------------------------------------------------------------------------
[INFO] Building Apache Commons Lang 3.4
[INFO] ------------------------------------------------------------------------
[INFO] 
[INFO] --- maven-enforcer-plugin:1.3.1:enforce (enforce-maven-3) @ commons-lang3 ---
[INFO] 
[INFO] --- build-helper-maven-plugin:1.8:parse-version (parse-version) @ commons-lang3 ---
[INFO] 
[INFO] --- maven-antrun-plugin:1.8:run (javadoc.resources) @ commons-lang3 ---
[INFO] Executing tasks

main:
[INFO] Executed tasks
[INFO] 
[INFO] --- maven-remote-resources-plugin:1.5:process (default) @ commons-lang3 ---
[INFO] 
[INFO] --- buildnumber-maven-plugin:1.3:create (default) @ commons-lang3 ---
[INFO] Executing: /bin/sh -c cd /home/perham/Study/LittleDarwin/Cases/commons-lang3-3.4-src && svn --non-interactive info
[INFO] Working directory: /home/perham/Study/LittleDarwin/Cases/commons-lang3-3.4-src
[INFO] Storing buildNumber: ?????? at timestamp: 1438645564310
[INFO] Executing: /bin/sh -c cd /home/perham/Study/LittleDarwin/Cases/commons-lang3-3.4-src && svn --non-interactive info
[INFO] Working directory: /home/perham/Study/LittleDarwin/Cases/commons-lang3-3.4-src
[INFO] Storing buildScmBranch: UNKNOWN_BRANCH
[INFO] 
[INFO] --- maven-resources-plugin:2.7:resources (default-resources) @ commons-lang3 ---
[INFO] Using 'ISO-8859-1' encoding to copy filtered resources.
[INFO] Copying 0 resource
[INFO] Copying 2 resources to META-INF
[INFO] 
[INFO] --- maven-compiler-plugin:3.2:compile (default-compile) @ commons-lang3 ---
[INFO] Changes detected - recompiling the module!
[INFO] Compiling 133 source files to /home/perham/Study/LittleDarwin/Cases/commons-lang3-3.4-src/target/classes
[INFO] /home/perham/Study/LittleDarwin/Cases/commons-lang3-3.4-src/src/main/java/org/apache/commons/lang3/SerializationUtils.java: /home/perham/Study/LittleDarwin/Cases/commons-lang3-3.4-src/src/main/java/org/apache/commons/lang3/SerializationUtils.java uses unchecked or unsafe operations.
[INFO] /home/perham/Study/LittleDarwin/Cases/commons-lang3-3.4-src/src/main/java/org/apache/commons/lang3/SerializationUtils.java: Recompile with -Xlint:unchecked for details.
[INFO] 
[INFO] --- maven-bundle-plugin:2.5.3:manifest (bundle-manifest) @ commons-lang3 ---
[INFO] 
[INFO] --- animal-sniffer-maven-plugin:1.13:check (checkAPIcompatibility) @ commons-lang3 ---
[INFO] Checking unresolved references to org.codehaus.mojo.signature:java16:1.0
[INFO] 
[INFO] --- maven-resources-plugin:2.7:testResources (default-testResources) @ commons-lang3 ---
[INFO] Using 'ISO-8859-1' encoding to copy filtered resources.
[INFO] Copying 2 resources
[INFO] Copying 2 resources to META-INF
[INFO] 
[INFO] --- maven-compiler-plugin:3.2:testCompile (default-testCompile) @ commons-lang3 ---
[INFO] Nothing to compile - all classes are up to date
[INFO] 
[INFO] --- maven-surefire-plugin:2.18:test (default-test) @ commons-lang3 ---
[INFO] Surefire report directory: /home/perham/Study/LittleDarwin/Cases/commons-lang3-3.4-src/target/surefire-reports

-------------------------------------------------------
 T E S T S
-------------------------------------------------------
Running org.apache.commons.lang3.ValidateTest
Tests run: 63, Failures: 0, Errors: 0, Skipped: 0, Time elapsed: 0.031 sec - in org.apache.commons.lang3.ValidateTest
Running org.apache.commons.lang3.LocaleUtilsTest
Tests run: 15, Failures: 0, Errors: 6, Skipped: 0, Time elapsed: 0.017 sec <<< FAILURE! - in org.apache.commons.lang3.LocaleUtilsTest
testLang328(org.apache.commons.lang3.LocaleUtilsTest)  Time elapsed: 0.007 sec  <<< ERROR!
java.lang.IllegalArgumentException: Invalid locale format: fr__P
	at org.apache.commons.lang3.LocaleUtils.toLocale(LocaleUtils.java:153)
	at org.apache.commons.lang3.LocaleUtilsTest.assertValidToLocale(LocaleUtilsTest.java:118)
	at org.apache.commons.lang3.LocaleUtilsTest.testLang328(LocaleUtilsTest.java:506)

testThreeCharsLocale(org.apache.commons.lang3.LocaleUtilsTest)  Time elapsed: 0 sec  <<< ERROR!
java.lang.IllegalArgumentException: Invalid locale format: udm
	at org.apache.commons.lang3.LocaleUtils.toLocale(LocaleUtils.java:133)
	at org.apache.commons.lang3.LocaleUtilsTest.testThreeCharsLocale(LocaleUtilsTest.java:382)

testParseAllLocales(org.apache.commons.lang3.LocaleUtilsTest)  Time elapsed: 0.001 sec  <<< ERROR!
java.lang.IllegalArgumentException: Invalid locale format: ms_MY
	at org.apache.commons.lang3.LocaleUtils.toLocale(LocaleUtils.java:141)
	at org.apache.commons.lang3.LocaleUtilsTest.testParseAllLocales(LocaleUtilsTest.java:580)

testToLocale_1Part(org.apache.commons.lang3.LocaleUtilsTest)  Time elapsed: 0 sec  <<< ERROR!
java.lang.IllegalArgumentException: Invalid locale format: us
	at org.apache.commons.lang3.LocaleUtils.toLocale(LocaleUtils.java:133)
	at org.apache.commons.lang3.LocaleUtilsTest.assertValidToLocale(LocaleUtilsTest.java:83)
	at org.apache.commons.lang3.LocaleUtilsTest.testToLocale_1Part(LocaleUtilsTest.java:132)

testToLocale_2Part(org.apache.commons.lang3.LocaleUtilsTest)  Time elapsed: 0.001 sec  <<< ERROR!
java.lang.IllegalArgumentException: Invalid locale format: us_EN
	at org.apache.commons.lang3.LocaleUtils.toLocale(LocaleUtils.java:141)
	at org.apache.commons.lang3.LocaleUtilsTest.assertValidToLocale(LocaleUtilsTest.java:99)
	at org.apache.commons.lang3.LocaleUtilsTest.testToLocale_2Part(LocaleUtilsTest.java:174)

testToLocale_3Part(org.apache.commons.lang3.LocaleUtilsTest)  Time elapsed: 0 sec  <<< ERROR!
java.lang.IllegalArgumentException: Invalid locale format: us_EN_A
	at org.apache.commons.lang3.LocaleUtils.toLocale(LocaleUtils.java:153)
	at org.apache.commons.lang3.LocaleUtilsTest.assertValidToLocale(LocaleUtilsTest.java:118)
	at org.apache.commons.lang3.LocaleUtilsTest.testToLocale_3Part(LocaleUtilsTest.java:209)

Running org.apache.commons.lang3.tuple.MutableTripleTest
Tests run: 8, Failures: 0, Errors: 0, Skipped: 0, Time elapsed: 0.002 sec - in org.apache.commons.lang3.tuple.MutableTripleTest
Running org.apache.commons.lang3.tuple.TripleTest
Tests run: 10, Failures: 0, Errors: 0, Skipped: 0, Time elapsed: 0.009 sec - in org.apache.commons.lang3.tuple.TripleTest
Running org.apache.commons.lang3.tuple.ImmutablePairTest
Tests run: 6, Failures: 0, Errors: 0, Skipped: 0, Time elapsed: 0.002 sec - in org.apache.commons.lang3.tuple.ImmutablePairTest
Running org.apache.commons.lang3.tuple.MutablePairTest
Tests run: 8, Failures: 0, Errors: 0, Skipped: 0, Time elapsed: 0.001 sec - in org.apache.commons.lang3.tuple.MutablePairTest
Running org.apache.commons.lang3.tuple.ImmutableTripleTest
Tests run: 6, Failures: 0, Errors: 0, Skipped: 0, Time elapsed: 0.006 sec - in org.apache.commons.lang3.tuple.ImmutableTripleTest
Running org.apache.commons.lang3.tuple.PairTest
Tests run: 9, Failures: 0, Errors: 0, Skipped: 0, Time elapsed: 0.001 sec - in org.apache.commons.lang3.tuple.PairTest
Running org.apache.commons.lang3.StringUtilsIsTest
Tests run: 8, Failures: 0, Errors: 3, Skipped: 0, Time elapsed: 0 sec <<< FAILURE! - in org.apache.commons.lang3.StringUtilsIsTest
testIsNumeric(org.apache.commons.lang3.StringUtilsIsTest)  Time elapsed: 0 sec  <<< ERROR!
java.lang.NullPointerException: null
	at org.apache.commons.lang3.StringUtils.isEmpty(StringUtils.java:25)
	at org.apache.commons.lang3.StringUtils.isNumeric(StringUtils.java:864)
	at org.apache.commons.lang3.StringUtilsIsTest.testIsNumeric(StringUtilsIsTest.java:137)

testIsAlphanumeric(org.apache.commons.lang3.StringUtilsIsTest)  Time elapsed: 0 sec  <<< ERROR!
java.lang.NullPointerException: null
	at org.apache.commons.lang3.StringUtils.isEmpty(StringUtils.java:25)
	at org.apache.commons.lang3.StringUtils.isAlphanumeric(StringUtils.java:846)
	at org.apache.commons.lang3.StringUtilsIsTest.testIsAlphanumeric(StringUtilsIsTest.java:50)

testIsAlpha(org.apache.commons.lang3.StringUtilsIsTest)  Time elapsed: 0 sec  <<< ERROR!
java.lang.NullPointerException: null
	at org.apache.commons.lang3.StringUtils.isEmpty(StringUtils.java:25)
	at org.apache.commons.lang3.StringUtils.isAlpha(StringUtils.java:834)
	at org.apache.commons.lang3.StringUtilsIsTest.testIsAlpha(StringUtilsIsTest.java:35)

Running org.apache.commons.lang3.JavaVersionTest
Tests run: 3, Failures: 0, Errors: 0, Skipped: 0, Time elapsed: 0 sec - in org.apache.commons.lang3.JavaVersionTest
Running org.apache.commons.lang3.builder.NoFieldNamesToStringStyleTest
Tests run: 8, Failures: 1, Errors: 0, Skipped: 0, Time elapsed: 0.001 sec <<< FAILURE! - in org.apache.commons.lang3.builder.NoFieldNamesToStringStyleTest
testObject(org.apache.commons.lang3.builder.NoFieldNamesToStringStyleTest)  Time elapsed: 0 sec  <<< FAILURE!
org.junit.ComparisonFailure: expected:<...ng.Integer@1e46128[<[Integer]>]> but was:<...ng.Integer@1e46128[<[]>]>
	at org.junit.Assert.assertEquals(Assert.java:115)
	at org.junit.Assert.assertEquals(Assert.java:144)
	at org.apache.commons.lang3.builder.NoFieldNamesToStringStyleTest.testObject(NoFieldNamesToStringStyleTest.java:75)

Running org.apache.commons.lang3.builder.ShortPrefixToStringStyleTest
Tests run: 8, Failures: 8, Errors: 0, Skipped: 0, Time elapsed: 0.001 sec <<< FAILURE! - in org.apache.commons.lang3.builder.ShortPrefixToStringStyleTest
testObjectArray(org.apache.commons.lang3.builder.ShortPrefixToStringStyleTest)  Time elapsed: 0 sec  <<< FAILURE!
org.junit.ComparisonFailure: expected:<[Integer][{<null>,5,{3,6}}]> but was:<[][{<null>,5,{3,6}}]>
	at org.junit.Assert.assertEquals(Assert.java:115)
	at org.junit.Assert.assertEquals(Assert.java:144)
	at org.apache.commons.lang3.builder.ShortPrefixToStringStyleTest.testObjectArray(ShortPrefixToStringStyleTest.java:104)

testBlank(org.apache.commons.lang3.builder.ShortPrefixToStringStyleTest)  Time elapsed: 0 sec  <<< FAILURE!
org.junit.ComparisonFailure: expected:<[Integer][]> but was:<[][]>
	at org.junit.Assert.assertEquals(Assert.java:115)
	at org.junit.Assert.assertEquals(Assert.java:144)
	at org.apache.commons.lang3.builder.ShortPrefixToStringStyleTest.testBlank(ShortPrefixToStringStyleTest.java:53)

testLong(org.apache.commons.lang3.builder.ShortPrefixToStringStyleTest)  Time elapsed: 0 sec  <<< FAILURE!
org.junit.ComparisonFailure: expected:<[Integer][3]> but was:<[][3]>
	at org.junit.Assert.assertEquals(Assert.java:115)
	at org.junit.Assert.assertEquals(Assert.java:144)
	at org.apache.commons.lang3.builder.ShortPrefixToStringStyleTest.testLong(ShortPrefixToStringStyleTest.java:96)

testLongArrayArray(org.apache.commons.lang3.builder.ShortPrefixToStringStyleTest)  Time elapsed: 0 sec  <<< FAILURE!
org.junit.ComparisonFailure: expected:<[Integer][{{1,2},<null>,{5}}]> but was:<[][{{1,2},<null>,{5}}]>
	at org.junit.Assert.assertEquals(Assert.java:115)
	at org.junit.Assert.assertEquals(Assert.java:144)
	at org.apache.commons.lang3.builder.ShortPrefixToStringStyleTest.testLongArrayArray(ShortPrefixToStringStyleTest.java:124)

testLongArray(org.apache.commons.lang3.builder.ShortPrefixToStringStyleTest)  Time elapsed: 0 sec  <<< FAILURE!
org.junit.ComparisonFailure: expected:<[Integer][{1,2,-3,4}]> but was:<[][{1,2,-3,4}]>
	at org.junit.Assert.assertEquals(Assert.java:115)
	at org.junit.Assert.assertEquals(Assert.java:144)
	at org.apache.commons.lang3.builder.ShortPrefixToStringStyleTest.testLongArray(ShortPrefixToStringStyleTest.java:114)

testObject(org.apache.commons.lang3.builder.ShortPrefixToStringStyleTest)  Time elapsed: 0 sec  <<< FAILURE!
org.junit.ComparisonFailure: expected:<[Integer][<null>]> but was:<[][<null>]>
	at org.junit.Assert.assertEquals(Assert.java:115)
	at org.junit.Assert.assertEquals(Assert.java:144)
	at org.apache.commons.lang3.builder.ShortPrefixToStringStyleTest.testObject(ShortPrefixToStringStyleTest.java:70)

testPerson(org.apache.commons.lang3.builder.ShortPrefixToStringStyleTest)  Time elapsed: 0 sec  <<< FAILURE!
org.junit.ComparisonFailure: expected:<[ToStringStyleTest.Person][name=John Q. Public...> but was:<[][name=John Q. Public...>
	at org.junit.Assert.assertEquals(Assert.java:115)
	at org.junit.Assert.assertEquals(Assert.java:144)
	at org.apache.commons.lang3.builder.ShortPrefixToStringStyleTest.testPerson(ShortPrefixToStringStyleTest.java:91)

testAppendSuper(org.apache.commons.lang3.builder.ShortPrefixToStringStyleTest)  Time elapsed: 0 sec  <<< FAILURE!
org.junit.ComparisonFailure: expected:<[Integer][]> but was:<[][]>
	at org.junit.Assert.assertEquals(Assert.java:115)
	at org.junit.Assert.assertEquals(Assert.java:144)
	at org.apache.commons.lang3.builder.ShortPrefixToStringStyleTest.testAppendSuper(ShortPrefixToStringStyleTest.java:58)

Running org.apache.commons.lang3.builder.DiffResultTest
Tests run: 9, Failures: 1, Errors: 0, Skipped: 0, Time elapsed: 0.001 sec <<< FAILURE! - in org.apache.commons.lang3.builder.DiffResultTest
testToStringOutput(org.apache.commons.lang3.builder.DiffResultTest)  Time elapsed: 0 sec  <<< FAILURE!
org.junit.ComparisonFailure: expected:<[DiffResultTest.EmptyClass[test=false] differs from DiffResultTest.EmptyClass][test=true]> but was:<[[test=false] differs from ][test=true]>
	at org.junit.Assert.assertEquals(Assert.java:115)
	at org.junit.Assert.assertEquals(Assert.java:144)
	at org.apache.commons.lang3.builder.DiffResultTest.testToStringOutput(DiffResultTest.java:95)

Running org.apache.commons.lang3.builder.CompareToBuilderTest
Tests run: 48, Failures: 0, Errors: 0, Skipped: 0, Time elapsed: 0.018 sec - in org.apache.commons.lang3.builder.CompareToBuilderTest
Running org.apache.commons.lang3.builder.MultilineRecursiveToStringStyleTest
Tests run: 10, Failures: 0, Errors: 0, Skipped: 0, Time elapsed: 0.006 sec - in org.apache.commons.lang3.builder.MultilineRecursiveToStringStyleTest
Running org.apache.commons.lang3.builder.RecursiveToStringStyleTest
Tests run: 8, Failures: 1, Errors: 0, Skipped: 0, Time elapsed: 0.008 sec <<< FAILURE! - in org.apache.commons.lang3.builder.RecursiveToStringStyleTest
testObject(org.apache.commons.lang3.builder.RecursiveToStringStyleTest)  Time elapsed: 0 sec  <<< FAILURE!
org.junit.ComparisonFailure: expected:<....Integer@1e46128[a=<[Integer]>]> but was:<....Integer@1e46128[a=<[]>]>
	at org.junit.Assert.assertEquals(Assert.java:115)
	at org.junit.Assert.assertEquals(Assert.java:144)
	at org.apache.commons.lang3.builder.RecursiveToStringStyleTest.testObject(RecursiveToStringStyleTest.java:74)

Running org.apache.commons.lang3.builder.DefaultToStringStyleTest
Tests run: 8, Failures: 1, Errors: 0, Skipped: 0, Time elapsed: 0.003 sec <<< FAILURE! - in org.apache.commons.lang3.builder.DefaultToStringStyleTest
testObject(org.apache.commons.lang3.builder.DefaultToStringStyleTest)  Time elapsed: 0 sec  <<< FAILURE!
org.junit.ComparisonFailure: expected:<....Integer@1e46128[a=<[Integer]>]> but was:<....Integer@1e46128[a=<[]>]>
	at org.junit.Assert.assertEquals(Assert.java:115)
	at org.junit.Assert.assertEquals(Assert.java:144)
	at org.apache.commons.lang3.builder.DefaultToStringStyleTest.testObject(DefaultToStringStyleTest.java:75)

Running org.apache.commons.lang3.builder.ReflectionToStringBuilderExcludeTest
Tests run: 11, Failures: 0, Errors: 0, Skipped: 0, Time elapsed: 0 sec - in org.apache.commons.lang3.builder.ReflectionToStringBuilderExcludeTest
Running org.apache.commons.lang3.builder.StandardToStringStyleTest
Tests run: 8, Failures: 8, Errors: 0, Skipped: 0, Time elapsed: 0.002 sec <<< FAILURE! - in org.apache.commons.lang3.builder.StandardToStringStyleTest
testObjectArray(org.apache.commons.lang3.builder.StandardToStringStyleTest)  Time elapsed: 0 sec  <<< FAILURE!
org.junit.ComparisonFailure: expected:<[Integer][[%NULL%, 5, [3, 6]]...> but was:<[][[%NULL%, 5, [3, 6]]...>
	at org.junit.Assert.assertEquals(Assert.java:115)
	at org.junit.Assert.assertEquals(Assert.java:144)
	at org.apache.commons.lang3.builder.StandardToStringStyleTest.testObjectArray(StandardToStringStyleTest.java:119)

testBlank(org.apache.commons.lang3.builder.StandardToStringStyleTest)  Time elapsed: 0 sec  <<< FAILURE!
org.junit.ComparisonFailure: expected:<[Integer][]> but was:<[][]>
	at org.junit.Assert.assertEquals(Assert.java:115)
	at org.junit.Assert.assertEquals(Assert.java:144)
	at org.apache.commons.lang3.builder.StandardToStringStyleTest.testBlank(StandardToStringStyleTest.java:68)

testLong(org.apache.commons.lang3.builder.StandardToStringStyleTest)  Time elapsed: 0 sec  <<< FAILURE!
org.junit.ComparisonFailure: expected:<[Integer][3]> but was:<[][3]>
	at org.junit.Assert.assertEquals(Assert.java:115)
	at org.junit.Assert.assertEquals(Assert.java:144)
	at org.apache.commons.lang3.builder.StandardToStringStyleTest.testLong(StandardToStringStyleTest.java:111)

testLongArrayArray(org.apache.commons.lang3.builder.StandardToStringStyleTest)  Time elapsed: 0 sec  <<< FAILURE!
org.junit.ComparisonFailure: expected:<[Integer][[[1, 2], %NULL%, [5...> but was:<[][[[1, 2], %NULL%, [5...>
	at org.junit.Assert.assertEquals(Assert.java:115)
	at org.junit.Assert.assertEquals(Assert.java:144)
	at org.apache.commons.lang3.builder.StandardToStringStyleTest.testLongArrayArray(StandardToStringStyleTest.java:139)

testLongArray(org.apache.commons.lang3.builder.StandardToStringStyleTest)  Time elapsed: 0 sec  <<< FAILURE!
org.junit.ComparisonFailure: expected:<[Integer][[1, 2, -3, 4]]> but was:<[][[1, 2, -3, 4]]>
	at org.junit.Assert.assertEquals(Assert.java:115)
	at org.junit.Assert.assertEquals(Assert.java:144)
	at org.apache.commons.lang3.builder.StandardToStringStyleTest.testLongArray(StandardToStringStyleTest.java:129)

testObject(org.apache.commons.lang3.builder.StandardToStringStyleTest)  Time elapsed: 0.001 sec  <<< FAILURE!
org.junit.ComparisonFailure: expected:<[Integer][%NULL%]> but was:<[][%NULL%]>
	at org.junit.Assert.assertEquals(Assert.java:115)
	at org.junit.Assert.assertEquals(Assert.java:144)
	at org.apache.commons.lang3.builder.StandardToStringStyleTest.testObject(StandardToStringStyleTest.java:85)

testPerson(org.apache.commons.lang3.builder.StandardToStringStyleTest)  Time elapsed: 0.001 sec  <<< FAILURE!
org.junit.ComparisonFailure: expected:<[ToStringStyleTest.Person][name=Suzy Queue,age...> but was:<[][name=Suzy Queue,age...>
	at org.junit.Assert.assertEquals(Assert.java:115)
	at org.junit.Assert.assertEquals(Assert.java:144)
	at org.apache.commons.lang3.builder.StandardToStringStyleTest.testPerson(StandardToStringStyleTest.java:106)

testAppendSuper(org.apache.commons.lang3.builder.StandardToStringStyleTest)  Time elapsed: 0 sec  <<< FAILURE!
org.junit.ComparisonFailure: expected:<[Integer][]> but was:<[][]>
	at org.junit.Assert.assertEquals(Assert.java:115)
	at org.junit.Assert.assertEquals(Assert.java:144)
	at org.apache.commons.lang3.builder.StandardToStringStyleTest.testAppendSuper(StandardToStringStyleTest.java:73)

Running org.apache.commons.lang3.builder.ToStringStyleTest
Tests run: 12, Failures: 0, Errors: 0, Skipped: 0, Time elapsed: 0.004 sec - in org.apache.commons.lang3.builder.ToStringStyleTest
Running org.apache.commons.lang3.builder.DiffTest
Tests run: 4, Failures: 0, Errors: 0, Skipped: 0, Time elapsed: 0.001 sec - in org.apache.commons.lang3.builder.DiffTest
Running org.apache.commons.lang3.builder.SimpleToStringStyleTest
Tests run: 8, Failures: 1, Errors: 0, Skipped: 0, Time elapsed: 0.001 sec <<< FAILURE! - in org.apache.commons.lang3.builder.SimpleToStringStyleTest
testObject(org.apache.commons.lang3.builder.SimpleToStringStyleTest)  Time elapsed: 0.001 sec  <<< FAILURE!
org.junit.ComparisonFailure: expected:<<[Integer]>> but was:<<[]>>
	at org.junit.Assert.assertEquals(Assert.java:115)
	at org.junit.Assert.assertEquals(Assert.java:144)
	at org.apache.commons.lang3.builder.SimpleToStringStyleTest.testObject(SimpleToStringStyleTest.java:74)

Running org.apache.commons.lang3.builder.MultiLineToStringStyleTest
Tests run: 8, Failures: 1, Errors: 0, Skipped: 0, Time elapsed: 0.004 sec <<< FAILURE! - in org.apache.commons.lang3.builder.MultiLineToStringStyleTest
testObject(org.apache.commons.lang3.builder.MultiLineToStringStyleTest)  Time elapsed: 0 sec  <<< FAILURE!
org.junit.ComparisonFailure: expected:<...teger@1e46128[
  a=<[Integer]>
]> but was:<...teger@1e46128[
  a=<[]>
]>
	at org.junit.Assert.assertEquals(Assert.java:115)
	at org.junit.Assert.assertEquals(Assert.java:144)
	at org.apache.commons.lang3.builder.MultiLineToStringStyleTest.testObject(MultiLineToStringStyleTest.java:76)

Running org.apache.commons.lang3.builder.ToStringStyleConcurrencyTest
Tests run: 3, Failures: 0, Errors: 0, Skipped: 0, Time elapsed: 4.12 sec - in org.apache.commons.lang3.builder.ToStringStyleConcurrencyTest
Running org.apache.commons.lang3.builder.ReflectionToStringBuilderMutateInspectConcurrencyTest
Tests run: 1, Failures: 0, Errors: 0, Skipped: 1, Time elapsed: 0 sec - in org.apache.commons.lang3.builder.ReflectionToStringBuilderMutateInspectConcurrencyTest
Running org.apache.commons.lang3.builder.ToStringBuilderTest
Tests run: 74, Failures: 2, Errors: 0, Skipped: 1, Time elapsed: 0.042 sec <<< FAILURE! - in org.apache.commons.lang3.builder.ToStringBuilderTest
testObjectBuild(org.apache.commons.lang3.builder.ToStringBuilderTest)  Time elapsed: 0.001 sec  <<< FAILURE!
org.junit.ComparisonFailure: expected:<....Integer@1e46128[a=<[Integer]>]> but was:<....Integer@1e46128[a=<[]>]>
	at org.junit.Assert.assertEquals(Assert.java:115)
	at org.junit.Assert.assertEquals(Assert.java:144)
	at org.apache.commons.lang3.builder.ToStringBuilderTest.testObjectBuild(ToStringBuilderTest.java:646)

testObject(org.apache.commons.lang3.builder.ToStringBuilderTest)  Time elapsed: 0.001 sec  <<< FAILURE!
org.junit.ComparisonFailure: expected:<....Integer@1e46128[a=<[Integer]>]> but was:<....Integer@1e46128[a=<[]>]>
	at org.junit.Assert.assertEquals(Assert.java:115)
	at org.junit.Assert.assertEquals(Assert.java:144)
	at org.apache.commons.lang3.builder.ToStringBuilderTest.testObject(ToStringBuilderTest.java:628)

Running org.apache.commons.lang3.builder.EqualsBuilderTest
Tests run: 48, Failures: 0, Errors: 0, Skipped: 0, Time elapsed: 0.021 sec - in org.apache.commons.lang3.builder.EqualsBuilderTest
Running org.apache.commons.lang3.builder.HashCodeBuilderAndEqualsBuilderTest
Tests run: 4, Failures: 0, Errors: 0, Skipped: 0, Time elapsed: 0.008 sec - in org.apache.commons.lang3.builder.HashCodeBuilderAndEqualsBuilderTest
Running org.apache.commons.lang3.builder.ReflectionToStringBuilderConcurrencyTest
Tests run: 3, Failures: 0, Errors: 0, Skipped: 3, Time elapsed: 0 sec - in org.apache.commons.lang3.builder.ReflectionToStringBuilderConcurrencyTest
Running org.apache.commons.lang3.builder.JsonToStringStyleTest
Tests run: 9, Failures: 0, Errors: 0, Skipped: 0, Time elapsed: 0.001 sec - in org.apache.commons.lang3.builder.JsonToStringStyleTest
Running org.apache.commons.lang3.builder.NoClassNameToStringStyleTest
Tests run: 8, Failures: 1, Errors: 0, Skipped: 0, Time elapsed: 0 sec <<< FAILURE! - in org.apache.commons.lang3.builder.NoClassNameToStringStyleTest
testObject(org.apache.commons.lang3.builder.NoClassNameToStringStyleTest)  Time elapsed: 0 sec  <<< FAILURE!
org.junit.ComparisonFailure: expected:<[a=<[Integer]>]> but was:<[a=<[]>]>
	at org.junit.Assert.assertEquals(Assert.java:115)
	at org.junit.Assert.assertEquals(Assert.java:144)
	at org.apache.commons.lang3.builder.NoClassNameToStringStyleTest.testObject(NoClassNameToStringStyleTest.java:74)

Running org.apache.commons.lang3.builder.DiffBuilderTest
Tests run: 30, Failures: 0, Errors: 0, Skipped: 0, Time elapsed: 0.029 sec - in org.apache.commons.lang3.builder.DiffBuilderTest
Running org.apache.commons.lang3.builder.HashCodeBuilderTest
Tests run: 44, Failures: 0, Errors: 0, Skipped: 0, Time elapsed: 0.01 sec - in org.apache.commons.lang3.builder.HashCodeBuilderTest
Running org.apache.commons.lang3.concurrent.AtomicInitializerTest
Tests run: 3, Failures: 0, Errors: 0, Skipped: 0, Time elapsed: 0.01 sec - in org.apache.commons.lang3.concurrent.AtomicInitializerTest
Running org.apache.commons.lang3.concurrent.CallableBackgroundInitializerTest
Tests run: 4, Failures: 0, Errors: 0, Skipped: 0, Time elapsed: 0.002 sec - in org.apache.commons.lang3.concurrent.CallableBackgroundInitializerTest
Running org.apache.commons.lang3.concurrent.BackgroundInitializerTest
Tests run: 15, Failures: 0, Errors: 0, Skipped: 0, Time elapsed: 0.015 sec - in org.apache.commons.lang3.concurrent.BackgroundInitializerTest
Running org.apache.commons.lang3.concurrent.LazyInitializerTest
Tests run: 3, Failures: 0, Errors: 0, Skipped: 0, Time elapsed: 0.005 sec - in org.apache.commons.lang3.concurrent.LazyInitializerTest
Running org.apache.commons.lang3.concurrent.BasicThreadFactoryTest
Tests run: 15, Failures: 0, Errors: 0, Skipped: 0, Time elapsed: 0.037 sec - in org.apache.commons.lang3.concurrent.BasicThreadFactoryTest
Running org.apache.commons.lang3.concurrent.ConstantInitializerTest
Tests run: 7, Failures: 0, Errors: 0, Skipped: 0, Time elapsed: 0.001 sec - in org.apache.commons.lang3.concurrent.ConstantInitializerTest
Running org.apache.commons.lang3.concurrent.MultiBackgroundInitializerTest
Tests run: 17, Failures: 0, Errors: 0, Skipped: 0, Time elapsed: 0.069 sec - in org.apache.commons.lang3.concurrent.MultiBackgroundInitializerTest
Running org.apache.commons.lang3.concurrent.AtomicSafeInitializerTest
Tests run: 4, Failures: 0, Errors: 0, Skipped: 0, Time elapsed: 0.021 sec - in org.apache.commons.lang3.concurrent.AtomicSafeInitializerTest
Running org.apache.commons.lang3.concurrent.ConcurrentUtilsTest
Tests run: 40, Failures: 0, Errors: 0, Skipped: 0, Time elapsed: 0.013 sec - in org.apache.commons.lang3.concurrent.ConcurrentUtilsTest
Running org.apache.commons.lang3.concurrent.TimedSemaphoreTest
Tests run: 15, Failures: 0, Errors: 0, Skipped: 0, Time elapsed: 1.198 sec - in org.apache.commons.lang3.concurrent.TimedSemaphoreTest
Running org.apache.commons.lang3.StringUtilsSubstringTest
Tests run: 14, Failures: 4, Errors: 3, Skipped: 0, Time elapsed: 0.01 sec <<< FAILURE! - in org.apache.commons.lang3.StringUtilsSubstringTest
testSubstringBefore_StringString(org.apache.commons.lang3.StringUtilsSubstringTest)  Time elapsed: 0 sec  <<< FAILURE!
org.junit.ComparisonFailure: expected:<foo[]> but was:<foo[XXbarXXbaz]>
	at org.junit.Assert.assertEquals(Assert.java:115)
	at org.junit.Assert.assertEquals(Assert.java:144)
	at org.apache.commons.lang3.StringUtilsSubstringTest.testSubstringBefore_StringString(StringUtilsSubstringTest.java:135)

testSubstringsBetween_StringStringString(org.apache.commons.lang3.StringUtilsSubstringTest)  Time elapsed: 0.001 sec  <<< ERROR!
java.lang.NullPointerException: null
	at org.apache.commons.lang3.StringUtilsSubstringTest.testSubstringsBetween_StringStringString(StringUtilsSubstringTest.java:253)

testSubstringAfterLast_StringString(org.apache.commons.lang3.StringUtilsSubstringTest)  Time elapsed: 0.001 sec  <<< FAILURE!
org.junit.ComparisonFailure: expected:<[]baz> but was:<[fooXXbarXX]baz>
	at org.junit.Assert.assertEquals(Assert.java:115)
	at org.junit.Assert.assertEquals(Assert.java:144)
	at org.apache.commons.lang3.StringUtilsSubstringTest.testSubstringAfterLast_StringString(StringUtilsSubstringTest.java:199)

testCountMatches_String(org.apache.commons.lang3.StringUtilsSubstringTest)  Time elapsed: 0.001 sec  <<< ERROR!
java.lang.NullPointerException: null
	at org.apache.commons.lang3.StringUtils.isEmpty(StringUtils.java:25)
	at org.apache.commons.lang3.StringUtils.countMatches(StringUtils.java:822)
	at org.apache.commons.lang3.StringUtilsSubstringTest.testCountMatches_String(StringUtilsSubstringTest.java:310)

testCountMatches_char(org.apache.commons.lang3.StringUtilsSubstringTest)  Time elapsed: 0 sec  <<< ERROR!
java.lang.NullPointerException: null
	at org.apache.commons.lang3.StringUtils.isEmpty(StringUtils.java:25)
	at org.apache.commons.lang3.StringUtils.countMatches(StringUtils.java:828)
	at org.apache.commons.lang3.StringUtilsSubstringTest.testCountMatches_char(StringUtilsSubstringTest.java:327)

testSubstringBeforeLast_StringString(org.apache.commons.lang3.StringUtilsSubstringTest)  Time elapsed: 0 sec  <<< FAILURE!
org.junit.ComparisonFailure: expected:<fooXXbar[]> but was:<fooXXbar[XXbaz]>
	at org.junit.Assert.assertEquals(Assert.java:115)
	at org.junit.Assert.assertEquals(Assert.java:144)
	at org.apache.commons.lang3.StringUtilsSubstringTest.testSubstringBeforeLast_StringString(StringUtilsSubstringTest.java:175)

testSubstringAfter_StringString(org.apache.commons.lang3.StringUtilsSubstringTest)  Time elapsed: 0 sec  <<< FAILURE!
org.junit.ComparisonFailure: expected:<[]barXXbaz> but was:<[fooXX]barXXbaz>
	at org.junit.Assert.assertEquals(Assert.java:115)
	at org.junit.Assert.assertEquals(Assert.java:144)
	at org.apache.commons.lang3.StringUtilsSubstringTest.testSubstringAfter_StringString(StringUtilsSubstringTest.java:155)

Running org.apache.commons.lang3.SystemUtilsTest
Tests run: 12, Failures: 1, Errors: 1, Skipped: 0, Time elapsed: 0.001 sec <<< FAILURE! - in org.apache.commons.lang3.SystemUtilsTest
testOSMatchesNameAndVersion(org.apache.commons.lang3.SystemUtilsTest)  Time elapsed: 0 sec  <<< FAILURE!
java.lang.AssertionError: null
	at org.junit.Assert.fail(Assert.java:86)
	at org.junit.Assert.assertTrue(Assert.java:41)
	at org.junit.Assert.assertTrue(Assert.java:52)
	at org.apache.commons.lang3.SystemUtilsTest.testOSMatchesNameAndVersion(SystemUtilsTest.java:393)

testOsVersionMatches(org.apache.commons.lang3.SystemUtilsTest)  Time elapsed: 0 sec  <<< ERROR!
java.lang.NullPointerException: null
	at org.apache.commons.lang3.StringUtils.isEmpty(StringUtils.java:25)
	at org.apache.commons.lang3.SystemUtils.isOSVersionMatch(SystemUtils.java:1634)
	at org.apache.commons.lang3.SystemUtilsTest.testOsVersionMatches(SystemUtilsTest.java:408)

Running org.apache.commons.lang3.CharRangeTest
Tests run: 16, Failures: 0, Errors: 0, Skipped: 0, Time elapsed: 0.03 sec - in org.apache.commons.lang3.CharRangeTest
Running org.apache.commons.lang3.CharSetTest
Tests run: 14, Failures: 0, Errors: 0, Skipped: 0, Time elapsed: 0.008 sec - in org.apache.commons.lang3.CharSetTest
Running org.apache.commons.lang3.StringUtilsStartsEndsWithTest
Tests run: 6, Failures: 0, Errors: 2, Skipped: 0, Time elapsed: 0.002 sec <<< FAILURE! - in org.apache.commons.lang3.StringUtilsStartsEndsWithTest
testStartsWithAny(org.apache.commons.lang3.StringUtilsStartsEndsWithTest)  Time elapsed: 0 sec  <<< ERROR!
java.lang.NullPointerException: null
	at org.apache.commons.lang3.StringUtils.isEmpty(StringUtils.java:25)
	at org.apache.commons.lang3.StringUtils.startsWithAny(StringUtils.java:1102)
	at org.apache.commons.lang3.StringUtilsStartsEndsWithTest.testStartsWithAny(StringUtilsStartsEndsWithTest.java:88)

testEndsWithAny(org.apache.commons.lang3.StringUtilsStartsEndsWithTest)  Time elapsed: 0.001 sec  <<< ERROR!
java.lang.NullPointerException: null
	at org.apache.commons.lang3.StringUtils.isEmpty(StringUtils.java:25)
	at org.apache.commons.lang3.StringUtils.endsWithAny(StringUtils.java:1128)
	at org.apache.commons.lang3.StringUtilsStartsEndsWithTest.testEndsWithAny(StringUtilsStartsEndsWithTest.java:170)

Running org.apache.commons.lang3.RandomStringUtilsTest
Tests run: 11, Failures: 0, Errors: 0, Skipped: 0, Time elapsed: 0.037 sec - in org.apache.commons.lang3.RandomStringUtilsTest
Running org.apache.commons.lang3.SerializationUtilsTest
Tests run: 26, Failures: 0, Errors: 0, Skipped: 0, Time elapsed: 0.053 sec - in org.apache.commons.lang3.SerializationUtilsTest
Running org.apache.commons.lang3.time.StopWatchTest
Tests run: 8, Failures: 0, Errors: 0, Skipped: 0, Time elapsed: 4.76 sec - in org.apache.commons.lang3.time.StopWatchTest
Running org.apache.commons.lang3.time.DateUtilsRoundingTest
Tests run: 22, Failures: 0, Errors: 0, Skipped: 0, Time elapsed: 0.168 sec - in org.apache.commons.lang3.time.DateUtilsRoundingTest
Running org.apache.commons.lang3.time.FastDateParserTest
Tests run: 33, Failures: 0, Errors: 0, Skipped: 0, Time elapsed: 2.387 sec - in org.apache.commons.lang3.time.FastDateParserTest
Running org.apache.commons.lang3.time.FastDateFormat_ParserTest
Tests run: 33, Failures: 0, Errors: 0, Skipped: 0, Time elapsed: 0.681 sec - in org.apache.commons.lang3.time.FastDateFormat_ParserTest
Running org.apache.commons.lang3.time.DurationFormatUtilsTest
Tests run: 25, Failures: 2, Errors: 0, Skipped: 0, Time elapsed: 0.787 sec <<< FAILURE! - in org.apache.commons.lang3.time.DurationFormatUtilsTest
testFormatDurationPluralWords(org.apache.commons.lang3.time.DurationFormatUtilsTest)  Time elapsed: 0.001 sec  <<< FAILURE!
org.junit.ComparisonFailure: expected:<...s 0 minutes 1 second[]> but was:<...s 0 minutes 1 second[s]>
	at org.junit.Assert.assertEquals(Assert.java:115)
	at org.junit.Assert.assertEquals(Assert.java:144)
	at org.apache.commons.lang3.time.DurationFormatUtilsTest.testFormatDurationPluralWords(DurationFormatUtilsTest.java:126)

testFormatDurationWords(org.apache.commons.lang3.time.DurationFormatUtilsTest)  Time elapsed: 0.001 sec  <<< FAILURE!
org.junit.ComparisonFailure: expected:<[]50 seconds> but was:<[0 days 0 hours 0 minutes ]50 seconds>
	at org.junit.Assert.assertEquals(Assert.java:115)
	at org.junit.Assert.assertEquals(Assert.java:144)
	at org.apache.commons.lang3.time.DurationFormatUtilsTest.testFormatDurationWords(DurationFormatUtilsTest.java:56)

Running org.apache.commons.lang3.time.DateFormatUtilsTest
Tests run: 10, Failures: 0, Errors: 0, Skipped: 0, Time elapsed: 0.001 sec - in org.apache.commons.lang3.time.DateFormatUtilsTest
Running org.apache.commons.lang3.time.DateUtilsFragmentTest
Tests run: 57, Failures: 0, Errors: 0, Skipped: 0, Time elapsed: 0.01 sec - in org.apache.commons.lang3.time.DateUtilsFragmentTest
Running org.apache.commons.lang3.time.FastDatePrinterTimeZonesTest
Tests run: 617, Failures: 0, Errors: 0, Skipped: 0, Time elapsed: 0.211 sec - in org.apache.commons.lang3.time.FastDatePrinterTimeZonesTest
Running org.apache.commons.lang3.time.FastDateFormatTest
>>FastDateFormatTest: FastDateParser:32273  SimpleDateFormat:4327
Tests run: 14, Failures: 0, Errors: 0, Skipped: 0, Time elapsed: 3.941 sec - in org.apache.commons.lang3.time.FastDateFormatTest
Running org.apache.commons.lang3.time.FastDateFormat_PrinterTest
Tests run: 17, Failures: 0, Errors: 0, Skipped: 0, Time elapsed: 0.007 sec - in org.apache.commons.lang3.time.FastDateFormat_PrinterTest
Running org.apache.commons.lang3.time.FastDatePrinterTest
Tests run: 17, Failures: 0, Errors: 0, Skipped: 0, Time elapsed: 0.004 sec - in org.apache.commons.lang3.time.FastDatePrinterTest
Running org.apache.commons.lang3.time.FastDateParserSDFTest
Tests run: 276, Failures: 0, Errors: 0, Skipped: 92, Time elapsed: 0.06 sec - in org.apache.commons.lang3.time.FastDateParserSDFTest
Running org.apache.commons.lang3.time.DateUtilsTest
DateUtilsTest: Default Locale=en_US
Tests run: 38, Failures: 0, Errors: 0, Skipped: 0, Time elapsed: 0.011 sec - in org.apache.commons.lang3.time.DateUtilsTest
Running org.apache.commons.lang3.reflect.InheritanceUtilsTest
Tests run: 9, Failures: 0, Errors: 0, Skipped: 0, Time elapsed: 0.002 sec - in org.apache.commons.lang3.reflect.InheritanceUtilsTest
Running org.apache.commons.lang3.reflect.MethodUtilsTest
Tests run: 23, Failures: 0, Errors: 0, Skipped: 0, Time elapsed: 0.033 sec - in org.apache.commons.lang3.reflect.MethodUtilsTest
Running org.apache.commons.lang3.reflect.ConstructorUtilsTest
Tests run: 7, Failures: 0, Errors: 0, Skipped: 0, Time elapsed: 0.013 sec - in org.apache.commons.lang3.reflect.ConstructorUtilsTest
Running org.apache.commons.lang3.reflect.FieldUtilsTest
Tests run: 64, Failures: 0, Errors: 0, Skipped: 0, Time elapsed: 0.022 sec - in org.apache.commons.lang3.reflect.FieldUtilsTest
Running org.apache.commons.lang3.reflect.TypeLiteralTest
Tests run: 4, Failures: 0, Errors: 0, Skipped: 0, Time elapsed: 0.005 sec - in org.apache.commons.lang3.reflect.TypeLiteralTest
Running org.apache.commons.lang3.reflect.TypeUtilsTest
Tests run: 19, Failures: 0, Errors: 0, Skipped: 0, Time elapsed: 0.042 sec - in org.apache.commons.lang3.reflect.TypeUtilsTest
Running org.apache.commons.lang3.mutable.MutableByteTest
Tests run: 17, Failures: 0, Errors: 0, Skipped: 0, Time elapsed: 0.003 sec - in org.apache.commons.lang3.mutable.MutableByteTest
Running org.apache.commons.lang3.mutable.MutableShortTest
Tests run: 14, Failures: 0, Errors: 0, Skipped: 0, Time elapsed: 0.004 sec - in org.apache.commons.lang3.mutable.MutableShortTest
Running org.apache.commons.lang3.mutable.MutableIntTest
Tests run: 17, Failures: 0, Errors: 0, Skipped: 0, Time elapsed: 0.002 sec - in org.apache.commons.lang3.mutable.MutableIntTest
Running org.apache.commons.lang3.mutable.MutableDoubleTest
Tests run: 18, Failures: 0, Errors: 0, Skipped: 0, Time elapsed: 0.005 sec - in org.apache.commons.lang3.mutable.MutableDoubleTest
Running org.apache.commons.lang3.mutable.MutableFloatTest
Tests run: 18, Failures: 0, Errors: 0, Skipped: 0, Time elapsed: 0 sec - in org.apache.commons.lang3.mutable.MutableFloatTest
Running org.apache.commons.lang3.mutable.MutableLongTest
Tests run: 17, Failures: 0, Errors: 0, Skipped: 0, Time elapsed: 0.003 sec - in org.apache.commons.lang3.mutable.MutableLongTest
Running org.apache.commons.lang3.mutable.MutableBooleanTest
Tests run: 9, Failures: 0, Errors: 0, Skipped: 0, Time elapsed: 0.001 sec - in org.apache.commons.lang3.mutable.MutableBooleanTest
Running org.apache.commons.lang3.mutable.MutableObjectTest
Tests run: 5, Failures: 0, Errors: 0, Skipped: 0, Time elapsed: 0 sec - in org.apache.commons.lang3.mutable.MutableObjectTest
Running org.apache.commons.lang3.text.translate.UnicodeEscaperTest
Tests run: 3, Failures: 0, Errors: 0, Skipped: 0, Time elapsed: 0 sec - in org.apache.commons.lang3.text.translate.UnicodeEscaperTest
Running org.apache.commons.lang3.text.translate.EntityArraysTest
Tests run: 3, Failures: 0, Errors: 0, Skipped: 0, Time elapsed: 0 sec - in org.apache.commons.lang3.text.translate.EntityArraysTest
Running org.apache.commons.lang3.text.translate.UnicodeUnpairedSurrogateRemoverTest
Tests run: 2, Failures: 0, Errors: 0, Skipped: 0, Time elapsed: 0.001 sec - in org.apache.commons.lang3.text.translate.UnicodeUnpairedSurrogateRemoverTest
Running org.apache.commons.lang3.text.translate.NumericEntityUnescaperTest
Tests run: 3, Failures: 0, Errors: 0, Skipped: 0, Time elapsed: 0 sec - in org.apache.commons.lang3.text.translate.NumericEntityUnescaperTest
Running org.apache.commons.lang3.text.translate.NumericEntityEscaperTest
Tests run: 4, Failures: 0, Errors: 0, Skipped: 0, Time elapsed: 0 sec - in org.apache.commons.lang3.text.translate.NumericEntityEscaperTest
Running org.apache.commons.lang3.text.translate.LookupTranslatorTest
Tests run: 2, Failures: 0, Errors: 0, Skipped: 0, Time elapsed: 0 sec - in org.apache.commons.lang3.text.translate.LookupTranslatorTest
Running org.apache.commons.lang3.text.translate.UnicodeUnescaperTest
Tests run: 3, Failures: 0, Errors: 0, Skipped: 0, Time elapsed: 0.001 sec - in org.apache.commons.lang3.text.translate.UnicodeUnescaperTest
Running org.apache.commons.lang3.text.translate.OctalUnescaperTest
Tests run: 1, Failures: 0, Errors: 0, Skipped: 0, Time elapsed: 0.001 sec - in org.apache.commons.lang3.text.translate.OctalUnescaperTest
Running org.apache.commons.lang3.text.StrMatcherTest
Tests run: 14, Failures: 3, Errors: 0, Skipped: 0, Time elapsed: 0.002 sec <<< FAILURE! - in org.apache.commons.lang3.text.StrMatcherTest
testCharSetMatcher_String(org.apache.commons.lang3.text.StrMatcherTest)  Time elapsed: 0 sec  <<< FAILURE!
java.lang.AssertionError: expected:<1> but was:<0>
	at org.junit.Assert.fail(Assert.java:88)
	at org.junit.Assert.failNotEquals(Assert.java:834)
	at org.junit.Assert.assertEquals(Assert.java:645)
	at org.junit.Assert.assertEquals(Assert.java:631)
	at org.apache.commons.lang3.text.StrMatcherTest.testCharSetMatcher_String(StrMatcherTest.java:165)

testMatcherIndices(org.apache.commons.lang3.text.StrMatcherTest)  Time elapsed: 0.001 sec  <<< FAILURE!
java.lang.AssertionError: expected:<2> but was:<0>
	at org.junit.Assert.fail(Assert.java:88)
	at org.junit.Assert.failNotEquals(Assert.java:834)
	at org.junit.Assert.assertEquals(Assert.java:645)
	at org.junit.Assert.assertEquals(Assert.java:631)
	at org.apache.commons.lang3.text.StrMatcherTest.testMatcherIndices(StrMatcherTest.java:212)

testStringMatcher_String(org.apache.commons.lang3.text.StrMatcherTest)  Time elapsed: 0 sec  <<< FAILURE!
java.lang.AssertionError: expected:<2> but was:<0>
	at org.junit.Assert.fail(Assert.java:88)
	at org.junit.Assert.failNotEquals(Assert.java:834)
	at org.junit.Assert.assertEquals(Assert.java:645)
	at org.junit.Assert.assertEquals(Assert.java:631)
	at org.apache.commons.lang3.text.StrMatcherTest.testStringMatcher_String(StrMatcherTest.java:196)

Running org.apache.commons.lang3.text.StrTokenizerTest
Tests run: 55, Failures: 18, Errors: 22, Skipped: 0, Time elapsed: 0.033 sec <<< FAILURE! - in org.apache.commons.lang3.text.StrTokenizerTest
testBasicDelim1(org.apache.commons.lang3.text.StrTokenizerTest)  Time elapsed: 0.001 sec  <<< ERROR!
java.util.NoSuchElementException: null
	at org.apache.commons.lang3.text.StrTokenizer.next(StrTokenizer.java:520)
	at org.apache.commons.lang3.text.StrTokenizerTest.testBasicDelim1(StrTokenizerTest.java:285)

testBasicDelim2(org.apache.commons.lang3.text.StrTokenizerTest)  Time elapsed: 0 sec  <<< ERROR!
java.util.NoSuchElementException: null
	at org.apache.commons.lang3.text.StrTokenizer.next(StrTokenizer.java:520)
	at org.apache.commons.lang3.text.StrTokenizerTest.testBasicDelim2(StrTokenizerTest.java:295)

testBasicEmpty2(org.apache.commons.lang3.text.StrTokenizerTest)  Time elapsed: 0 sec  <<< FAILURE!
java.lang.AssertionError: expected:<a> but was:<null>
	at org.junit.Assert.fail(Assert.java:88)
	at org.junit.Assert.failNotEquals(Assert.java:834)
	at org.junit.Assert.assertEquals(Assert.java:118)
	at org.junit.Assert.assertEquals(Assert.java:144)
	at org.apache.commons.lang3.text.StrTokenizerTest.testBasicEmpty2(StrTokenizerTest.java:317)

testConstructor_charArray_char(org.apache.commons.lang3.text.StrTokenizerTest)  Time elapsed: 0 sec  <<< ERROR!
java.util.NoSuchElementException: null
	at org.apache.commons.lang3.text.StrTokenizer.next(StrTokenizer.java:520)
	at org.apache.commons.lang3.text.StrTokenizerTest.testConstructor_charArray_char(StrTokenizerTest.java:691)

testIteration(org.apache.commons.lang3.text.StrTokenizerTest)  Time elapsed: 0 sec  <<< FAILURE!
java.lang.AssertionError: null
	at org.junit.Assert.fail(Assert.java:86)
	at org.junit.Assert.assertTrue(Assert.java:41)
	at org.junit.Assert.assertTrue(Assert.java:52)
	at org.apache.commons.lang3.text.StrTokenizerTest.testIteration(StrTokenizerTest.java:808)

testConstructor_String_char_char(org.apache.commons.lang3.text.StrTokenizerTest)  Time elapsed: 0.001 sec  <<< ERROR!
java.util.NoSuchElementException: null
	at org.apache.commons.lang3.text.StrTokenizer.next(StrTokenizer.java:520)
	at org.apache.commons.lang3.text.StrTokenizerTest.testConstructor_String_char_char(StrTokenizerTest.java:660)

testReset(org.apache.commons.lang3.text.StrTokenizerTest)  Time elapsed: 0 sec  <<< ERROR!
java.util.NoSuchElementException: null
	at org.apache.commons.lang3.text.StrTokenizer.next(StrTokenizer.java:520)
	at org.apache.commons.lang3.text.StrTokenizerTest.testReset(StrTokenizerTest.java:723)

testReset_charArray(org.apache.commons.lang3.text.StrTokenizerTest)  Time elapsed: 0.001 sec  <<< ERROR!
java.util.NoSuchElementException: null
	at org.apache.commons.lang3.text.StrTokenizer.next(StrTokenizer.java:520)
	at org.apache.commons.lang3.text.StrTokenizerTest.testReset_charArray(StrTokenizerTest.java:755)

testToString(org.apache.commons.lang3.text.StrTokenizerTest)  Time elapsed: 0 sec  <<< ERROR!
java.util.NoSuchElementException: null
	at org.apache.commons.lang3.text.StrTokenizer.next(StrTokenizer.java:520)
	at org.apache.commons.lang3.text.StrTokenizerTest.testToString(StrTokenizerTest.java:876)

testTokenizeSubclassOutputChange(org.apache.commons.lang3.text.StrTokenizerTest)  Time elapsed: 0.001 sec  <<< ERROR!
java.util.NoSuchElementException: null
	at org.apache.commons.lang3.text.StrTokenizer.next(StrTokenizer.java:520)
	at org.apache.commons.lang3.text.StrTokenizerTest.testTokenizeSubclassOutputChange(StrTokenizerTest.java:866)

testListArray(org.apache.commons.lang3.text.StrTokenizerTest)  Time elapsed: 0 sec  <<< FAILURE!
java.lang.AssertionError: expected:<3> but was:<0>
	at org.junit.Assert.fail(Assert.java:88)
	at org.junit.Assert.failNotEquals(Assert.java:834)
	at org.junit.Assert.assertEquals(Assert.java:645)
	at org.junit.Assert.assertEquals(Assert.java:631)
	at org.apache.commons.lang3.text.StrTokenizerTest.testListArray(StrTokenizerTest.java:507)

testBasicQuoted1(org.apache.commons.lang3.text.StrTokenizerTest)  Time elapsed: 0 sec  <<< ERROR!
java.util.NoSuchElementException: null
	at org.apache.commons.lang3.text.StrTokenizer.next(StrTokenizer.java:520)
	at org.apache.commons.lang3.text.StrTokenizerTest.testBasicQuoted1(StrTokenizerTest.java:328)

testBasicQuoted2(org.apache.commons.lang3.text.StrTokenizerTest)  Time elapsed: 0 sec  <<< FAILURE!
java.lang.AssertionError: expected:<a> but was:<null>
	at org.junit.Assert.fail(Assert.java:88)
	at org.junit.Assert.failNotEquals(Assert.java:834)
	at org.junit.Assert.assertEquals(Assert.java:118)
	at org.junit.Assert.assertEquals(Assert.java:144)
	at org.apache.commons.lang3.text.StrTokenizerTest.testBasicQuoted2(StrTokenizerTest.java:340)

testBasicQuoted3(org.apache.commons.lang3.text.StrTokenizerTest)  Time elapsed: 0.001 sec  <<< FAILURE!
java.lang.AssertionError: expected:<a> but was:<null>
	at org.junit.Assert.fail(Assert.java:88)
	at org.junit.Assert.failNotEquals(Assert.java:834)
	at org.junit.Assert.assertEquals(Assert.java:118)
	at org.junit.Assert.assertEquals(Assert.java:144)
	at org.apache.commons.lang3.text.StrTokenizerTest.testBasicQuoted3(StrTokenizerTest.java:352)

testBasicQuoted4(org.apache.commons.lang3.text.StrTokenizerTest)  Time elapsed: 0 sec  <<< FAILURE!
java.lang.AssertionError: expected:<a> but was:<null>
	at org.junit.Assert.fail(Assert.java:88)
	at org.junit.Assert.failNotEquals(Assert.java:834)
	at org.junit.Assert.assertEquals(Assert.java:118)
	at org.junit.Assert.assertEquals(Assert.java:144)
	at org.apache.commons.lang3.text.StrTokenizerTest.testBasicQuoted4(StrTokenizerTest.java:364)

testBasicQuoted5(org.apache.commons.lang3.text.StrTokenizerTest)  Time elapsed: 0.001 sec  <<< FAILURE!
java.lang.AssertionError: expected:<a> but was:<null>
	at org.junit.Assert.fail(Assert.java:88)
	at org.junit.Assert.failNotEquals(Assert.java:834)
	at org.junit.Assert.assertEquals(Assert.java:118)
	at org.junit.Assert.assertEquals(Assert.java:144)
	at org.apache.commons.lang3.text.StrTokenizerTest.testBasicQuoted5(StrTokenizerTest.java:377)

testBasicQuoted6(org.apache.commons.lang3.text.StrTokenizerTest)  Time elapsed: 0 sec  <<< ERROR!
java.util.NoSuchElementException: null
	at org.apache.commons.lang3.text.StrTokenizer.next(StrTokenizer.java:520)
	at org.apache.commons.lang3.text.StrTokenizerTest.testBasicQuoted6(StrTokenizerTest.java:388)

testBasicQuoted7(org.apache.commons.lang3.text.StrTokenizerTest)  Time elapsed: 0.001 sec  <<< ERROR!
java.util.NoSuchElementException: null
	at org.apache.commons.lang3.text.StrTokenizer.next(StrTokenizer.java:520)
	at org.apache.commons.lang3.text.StrTokenizerTest.testBasicQuoted7(StrTokenizerTest.java:398)

testReset_String(org.apache.commons.lang3.text.StrTokenizerTest)  Time elapsed: 0 sec  <<< ERROR!
java.util.NoSuchElementException: null
	at org.apache.commons.lang3.text.StrTokenizer.next(StrTokenizer.java:520)
	at org.apache.commons.lang3.text.StrTokenizerTest.testReset_String(StrTokenizerTest.java:740)

testConstructor_String(org.apache.commons.lang3.text.StrTokenizerTest)  Time elapsed: 0.001 sec  <<< ERROR!
java.util.NoSuchElementException: null
	at org.apache.commons.lang3.text.StrTokenizer.next(StrTokenizer.java:520)
	at org.apache.commons.lang3.text.StrTokenizerTest.testConstructor_String(StrTokenizerTest.java:627)

test4(org.apache.commons.lang3.text.StrTokenizerTest)  Time elapsed: 0 sec  <<< FAILURE!
java.lang.AssertionError: {} expected:<5> but was:<0>
	at org.junit.Assert.fail(Assert.java:88)
	at org.junit.Assert.failNotEquals(Assert.java:834)
	at org.junit.Assert.assertEquals(Assert.java:645)
	at org.apache.commons.lang3.text.StrTokenizerTest.test4(StrTokenizerTest.java:123)

test5(org.apache.commons.lang3.text.StrTokenizerTest)  Time elapsed: 0 sec  <<< FAILURE!
java.lang.AssertionError: token[0] was 'null' but was expected to be 'a' expected:<a> but was:<null>
	at org.junit.Assert.fail(Assert.java:88)
	at org.junit.Assert.failNotEquals(Assert.java:834)
	at org.junit.Assert.assertEquals(Assert.java:118)
	at org.apache.commons.lang3.text.StrTokenizerTest.test5(StrTokenizerTest.java:147)

test8(org.apache.commons.lang3.text.StrTokenizerTest)  Time elapsed: 0 sec  <<< FAILURE!
java.lang.AssertionError: {} expected:<5> but was:<0>
	at org.junit.Assert.fail(Assert.java:88)
	at org.junit.Assert.failNotEquals(Assert.java:834)
	at org.junit.Assert.assertEquals(Assert.java:645)
	at org.apache.commons.lang3.text.StrTokenizerTest.test8(StrTokenizerTest.java:223)

testConstructor_String_char(org.apache.commons.lang3.text.StrTokenizerTest)  Time elapsed: 0.002 sec  <<< ERROR!
java.util.NoSuchElementException: null
	at org.apache.commons.lang3.text.StrTokenizer.next(StrTokenizer.java:520)
	at org.apache.commons.lang3.text.StrTokenizerTest.testConstructor_String_char(StrTokenizerTest.java:643)

testTokenizeSubclassInputChange(org.apache.commons.lang3.text.StrTokenizerTest)  Time elapsed: 0 sec  <<< ERROR!
java.util.NoSuchElementException: null
	at org.apache.commons.lang3.text.StrTokenizer.next(StrTokenizer.java:520)
	at org.apache.commons.lang3.text.StrTokenizerTest.testTokenizeSubclassInputChange(StrTokenizerTest.java:851)

testConstructor_charArray(org.apache.commons.lang3.text.StrTokenizerTest)  Time elapsed: 0 sec  <<< ERROR!
java.util.NoSuchElementException: null
	at org.apache.commons.lang3.text.StrTokenizer.next(StrTokenizer.java:520)
	at org.apache.commons.lang3.text.StrTokenizerTest.testConstructor_charArray(StrTokenizerTest.java:675)

testConstructor_charArray_char_char(org.apache.commons.lang3.text.StrTokenizerTest)  Time elapsed: 0.001 sec  <<< ERROR!
java.util.NoSuchElementException: null
	at org.apache.commons.lang3.text.StrTokenizer.next(StrTokenizer.java:520)
	at org.apache.commons.lang3.text.StrTokenizerTest.testConstructor_charArray_char_char(StrTokenizerTest.java:708)

testBasicIgnoreTrimmed1(org.apache.commons.lang3.text.StrTokenizerTest)  Time elapsed: 0.001 sec  <<< FAILURE!
java.lang.AssertionError: expected:<a> but was:<null>
	at org.junit.Assert.fail(Assert.java:88)
	at org.junit.Assert.failNotEquals(Assert.java:834)
	at org.junit.Assert.assertEquals(Assert.java:118)
	at org.junit.Assert.assertEquals(Assert.java:144)
	at org.apache.commons.lang3.text.StrTokenizerTest.testBasicIgnoreTrimmed1(StrTokenizerTest.java:451)

testBasicIgnoreTrimmed2(org.apache.commons.lang3.text.StrTokenizerTest)  Time elapsed: 0 sec  <<< FAILURE!
java.lang.AssertionError: expected:<a> but was:<null>
	at org.junit.Assert.fail(Assert.java:88)
	at org.junit.Assert.failNotEquals(Assert.java:834)
	at org.junit.Assert.assertEquals(Assert.java:118)
	at org.junit.Assert.assertEquals(Assert.java:144)
	at org.apache.commons.lang3.text.StrTokenizerTest.testBasicIgnoreTrimmed2(StrTokenizerTest.java:465)

testBasicIgnoreTrimmed3(org.apache.commons.lang3.text.StrTokenizerTest)  Time elapsed: 0.001 sec  <<< FAILURE!
java.lang.AssertionError: expected:<a> but was:<null>
	at org.junit.Assert.fail(Assert.java:88)
	at org.junit.Assert.failNotEquals(Assert.java:834)
	at org.junit.Assert.assertEquals(Assert.java:118)
	at org.junit.Assert.assertEquals(Assert.java:144)
	at org.apache.commons.lang3.text.StrTokenizerTest.testBasicIgnoreTrimmed3(StrTokenizerTest.java:478)

testBasicIgnoreTrimmed4(org.apache.commons.lang3.text.StrTokenizerTest)  Time elapsed: 0 sec  <<< FAILURE!
java.lang.AssertionError: expected:<a> but was:<null>
	at org.junit.Assert.fail(Assert.java:88)
	at org.junit.Assert.failNotEquals(Assert.java:834)
	at org.junit.Assert.assertEquals(Assert.java:118)
	at org.junit.Assert.assertEquals(Assert.java:144)
	at org.apache.commons.lang3.text.StrTokenizerTest.testBasicIgnoreTrimmed4(StrTokenizerTest.java:492)

testBasicQuotedTrimmed1(org.apache.commons.lang3.text.StrTokenizerTest)  Time elapsed: 0 sec  <<< FAILURE!
java.lang.AssertionError: expected:<a> but was:<null>
	at org.junit.Assert.fail(Assert.java:88)
	at org.junit.Assert.failNotEquals(Assert.java:834)
	at org.junit.Assert.assertEquals(Assert.java:118)
	at org.junit.Assert.assertEquals(Assert.java:144)
	at org.apache.commons.lang3.text.StrTokenizerTest.testBasicQuotedTrimmed1(StrTokenizerTest.java:411)

testBasic1(org.apache.commons.lang3.text.StrTokenizerTest)  Time elapsed: 0 sec  <<< ERROR!
java.util.NoSuchElementException: null
	at org.apache.commons.lang3.text.StrTokenizer.next(StrTokenizer.java:520)
	at org.apache.commons.lang3.text.StrTokenizerTest.testBasic1(StrTokenizerTest.java:235)

testBasic2(org.apache.commons.lang3.text.StrTokenizerTest)  Time elapsed: 0 sec  <<< ERROR!
java.util.NoSuchElementException: null
	at org.apache.commons.lang3.text.StrTokenizer.next(StrTokenizer.java:520)
	at org.apache.commons.lang3.text.StrTokenizerTest.testBasic2(StrTokenizerTest.java:245)

testBasic3(org.apache.commons.lang3.text.StrTokenizerTest)  Time elapsed: 0 sec  <<< ERROR!
java.util.NoSuchElementException: null
	at org.apache.commons.lang3.text.StrTokenizer.next(StrTokenizer.java:520)
	at org.apache.commons.lang3.text.StrTokenizerTest.testBasic3(StrTokenizerTest.java:255)

testBasic4(org.apache.commons.lang3.text.StrTokenizerTest)  Time elapsed: 0.001 sec  <<< ERROR!
java.util.NoSuchElementException: null
	at org.apache.commons.lang3.text.StrTokenizer.next(StrTokenizer.java:520)
	at org.apache.commons.lang3.text.StrTokenizerTest.testBasic4(StrTokenizerTest.java:265)

testBasic5(org.apache.commons.lang3.text.StrTokenizerTest)  Time elapsed: 0 sec  <<< ERROR!
java.util.NoSuchElementException: null
	at org.apache.commons.lang3.text.StrTokenizer.next(StrTokenizer.java:520)
	at org.apache.commons.lang3.text.StrTokenizerTest.testBasic5(StrTokenizerTest.java:275)

testCloneReset(org.apache.commons.lang3.text.StrTokenizerTest)  Time elapsed: 0 sec  <<< FAILURE!
java.lang.AssertionError: expected:<a> but was:<null>
	at org.junit.Assert.fail(Assert.java:88)
	at org.junit.Assert.failNotEquals(Assert.java:834)
	at org.junit.Assert.assertEquals(Assert.java:118)
	at org.junit.Assert.assertEquals(Assert.java:144)
	at org.apache.commons.lang3.text.StrTokenizerTest.testCloneReset(StrTokenizerTest.java:612)

testBasicTrimmed1(org.apache.commons.lang3.text.StrTokenizerTest)  Time elapsed: 0 sec  <<< FAILURE!
java.lang.AssertionError: expected:<a> but was:<null>
	at org.junit.Assert.fail(Assert.java:88)
	at org.junit.Assert.failNotEquals(Assert.java:834)
	at org.junit.Assert.assertEquals(Assert.java:118)
	at org.junit.Assert.assertEquals(Assert.java:144)
	at org.apache.commons.lang3.text.StrTokenizerTest.testBasicTrimmed1(StrTokenizerTest.java:424)

testBasicTrimmed2(org.apache.commons.lang3.text.StrTokenizerTest)  Time elapsed: 0 sec  <<< FAILURE!
java.lang.AssertionError: expected:<a> but was:<null>
	at org.junit.Assert.fail(Assert.java:88)
	at org.junit.Assert.failNotEquals(Assert.java:834)
	at org.junit.Assert.assertEquals(Assert.java:118)
	at org.junit.Assert.assertEquals(Assert.java:144)
	at org.apache.commons.lang3.text.StrTokenizerTest.testBasicTrimmed2(StrTokenizerTest.java:437)

Running org.apache.commons.lang3.text.FormattableUtilsTest
Tests run: 5, Failures: 0, Errors: 0, Skipped: 0, Time elapsed: 0 sec - in org.apache.commons.lang3.text.FormattableUtilsTest
Running org.apache.commons.lang3.text.CompositeFormatTest
Tests run: 2, Failures: 0, Errors: 0, Skipped: 0, Time elapsed: 0 sec - in org.apache.commons.lang3.text.CompositeFormatTest
Running org.apache.commons.lang3.text.WordUtilsTest
Tests run: 12, Failures: 0, Errors: 9, Skipped: 0, Time elapsed: 0.001 sec <<< FAILURE! - in org.apache.commons.lang3.text.WordUtilsTest
testCapitalizeWithDelimiters_String(org.apache.commons.lang3.text.WordUtilsTest)  Time elapsed: 0 sec  <<< ERROR!
java.lang.NullPointerException: null
	at org.apache.commons.lang3.StringUtils.isEmpty(StringUtils.java:25)
	at org.apache.commons.lang3.text.WordUtils.capitalize(WordUtils.java:290)
	at org.apache.commons.lang3.text.WordUtilsTest.testCapitalizeWithDelimiters_String(WordUtilsTest.java:176)

testUncapitalize_String(org.apache.commons.lang3.text.WordUtilsTest)  Time elapsed: 0 sec  <<< ERROR!
java.lang.NullPointerException: null
	at org.apache.commons.lang3.StringUtils.isEmpty(StringUtils.java:25)
	at org.apache.commons.lang3.text.WordUtils.uncapitalize(WordUtils.java:415)
	at org.apache.commons.lang3.text.WordUtils.uncapitalize(WordUtils.java:385)
	at org.apache.commons.lang3.text.WordUtilsTest.testUncapitalize_String(WordUtilsTest.java:226)

testCapitalize_String(org.apache.commons.lang3.text.WordUtilsTest)  Time elapsed: 0 sec  <<< ERROR!
java.lang.NullPointerException: null
	at org.apache.commons.lang3.StringUtils.isEmpty(StringUtils.java:25)
	at org.apache.commons.lang3.text.WordUtils.capitalize(WordUtils.java:290)
	at org.apache.commons.lang3.text.WordUtils.capitalize(WordUtils.java:256)
	at org.apache.commons.lang3.text.WordUtilsTest.testCapitalize_String(WordUtilsTest.java:162)

testCapitalizeFully_String(org.apache.commons.lang3.text.WordUtilsTest)  Time elapsed: 0 sec  <<< ERROR!
java.lang.NullPointerException: null
	at org.apache.commons.lang3.StringUtils.isEmpty(StringUtils.java:25)
	at org.apache.commons.lang3.text.WordUtils.capitalizeFully(WordUtils.java:359)
	at org.apache.commons.lang3.text.WordUtils.capitalizeFully(WordUtils.java:328)
	at org.apache.commons.lang3.text.WordUtilsTest.testCapitalizeFully_String(WordUtilsTest.java:194)

testInitials_String_charArray(org.apache.commons.lang3.text.WordUtilsTest)  Time elapsed: 0 sec  <<< ERROR!
java.lang.NullPointerException: null
	at org.apache.commons.lang3.StringUtils.isEmpty(StringUtils.java:25)
	at org.apache.commons.lang3.text.WordUtils.initials(WordUtils.java:540)
	at org.apache.commons.lang3.text.WordUtilsTest.testInitials_String_charArray(WordUtilsTest.java:275)

testUncapitalizeWithDelimiters_String(org.apache.commons.lang3.text.WordUtilsTest)  Time elapsed: 0 sec  <<< ERROR!
java.lang.NullPointerException: null
	at org.apache.commons.lang3.StringUtils.isEmpty(StringUtils.java:25)
	at org.apache.commons.lang3.text.WordUtils.uncapitalize(WordUtils.java:415)
	at org.apache.commons.lang3.text.WordUtilsTest.testUncapitalizeWithDelimiters_String(WordUtilsTest.java:240)

testInitials_String(org.apache.commons.lang3.text.WordUtilsTest)  Time elapsed: 0 sec  <<< ERROR!
java.lang.NullPointerException: null
	at org.apache.commons.lang3.StringUtils.isEmpty(StringUtils.java:25)
	at org.apache.commons.lang3.text.WordUtils.initials(WordUtils.java:540)
	at org.apache.commons.lang3.text.WordUtils.initials(WordUtils.java:509)
	at org.apache.commons.lang3.text.WordUtilsTest.testInitials_String(WordUtilsTest.java:259)

testCapitalizeFullyWithDelimiters_String(org.apache.commons.lang3.text.WordUtilsTest)  Time elapsed: 0 sec  <<< ERROR!
java.lang.NullPointerException: null
	at org.apache.commons.lang3.StringUtils.isEmpty(StringUtils.java:25)
	at org.apache.commons.lang3.text.WordUtils.capitalizeFully(WordUtils.java:359)
	at org.apache.commons.lang3.text.WordUtilsTest.testCapitalizeFullyWithDelimiters_String(WordUtilsTest.java:208)

testSwapCase_String(org.apache.commons.lang3.text.WordUtilsTest)  Time elapsed: 0 sec  <<< ERROR!
java.lang.NullPointerException: null
	at org.apache.commons.lang3.StringUtils.isEmpty(StringUtils.java:25)
	at org.apache.commons.lang3.text.WordUtils.swapCase(WordUtils.java:456)
	at org.apache.commons.lang3.text.WordUtilsTest.testSwapCase_String(WordUtilsTest.java:356)

Running org.apache.commons.lang3.text.StrLookupTest
Tests run: 5, Failures: 0, Errors: 0, Skipped: 0, Time elapsed: 0 sec - in org.apache.commons.lang3.text.StrLookupTest
Running org.apache.commons.lang3.text.StrBuilderAppendInsertTest
Tests run: 51, Failures: 0, Errors: 0, Skipped: 0, Time elapsed: 0.012 sec - in org.apache.commons.lang3.text.StrBuilderAppendInsertTest
Running org.apache.commons.lang3.text.ExtendedMessageFormatTest
Tests run: 10, Failures: 0, Errors: 0, Skipped: 0, Time elapsed: 0.739 sec - in org.apache.commons.lang3.text.ExtendedMessageFormatTest
Running org.apache.commons.lang3.text.StrSubstitutorTest
Tests run: 40, Failures: 32, Errors: 0, Skipped: 0, Time elapsed: 0.03 sec <<< FAILURE! - in org.apache.commons.lang3.text.StrSubstitutorTest
testReplaceEscaping(org.apache.commons.lang3.text.StrSubstitutorTest)  Time elapsed: 0.002 sec  <<< FAILURE!
org.junit.ComparisonFailure: expected:<The $[{animal} jumps over the lazy dog].> but was:<The $[${animal} jumps over the ${target}].>
	at org.junit.Assert.assertEquals(Assert.java:115)
	at org.junit.Assert.assertEquals(Assert.java:144)
	at org.apache.commons.lang3.text.StrSubstitutorTest.doTestReplace(StrSubstitutorTest.java:634)
	at org.apache.commons.lang3.text.StrSubstitutorTest.testReplaceEscaping(StrSubstitutorTest.java:163)

testReplaceSoloEscaping(org.apache.commons.lang3.text.StrSubstitutorTest)  Time elapsed: 0.001 sec  <<< FAILURE!
org.junit.ComparisonFailure: expected:<$[]{animal}> but was:<$[$]{animal}>
	at org.junit.Assert.assertEquals(Assert.java:115)
	at org.junit.Assert.assertEquals(Assert.java:144)
	at org.apache.commons.lang3.text.StrSubstitutorTest.doTestReplace(StrSubstitutorTest.java:634)
	at org.apache.commons.lang3.text.StrSubstitutorTest.testReplaceSoloEscaping(StrSubstitutorTest.java:171)

testSubstituteDefaultProperties(org.apache.commons.lang3.text.StrSubstitutorTest)  Time elapsed: 0.001 sec  <<< FAILURE!
org.junit.ComparisonFailure: expected:<[It works!]> but was:<[${doesnotwork}]>
	at org.junit.Assert.assertEquals(Assert.java:115)
	at org.junit.Assert.assertEquals(Assert.java:144)
	at org.apache.commons.lang3.text.StrSubstitutorTest.testSubstituteDefaultProperties(StrSubstitutorTest.java:615)

testReplaceNoPrefixSuffix(org.apache.commons.lang3.text.StrSubstitutorTest)  Time elapsed: 0.001 sec  <<< FAILURE!
org.junit.ComparisonFailure: expected:<...mal} jumps over the [lazy dog].> but was:<...mal} jumps over the [${target}].>
	at org.junit.Assert.assertEquals(Assert.java:115)
	at org.junit.Assert.assertEquals(Assert.java:144)
	at org.apache.commons.lang3.text.StrSubstitutorTest.doTestReplace(StrSubstitutorTest.java:634)
	at org.apache.commons.lang3.text.StrSubstitutorTest.testReplaceNoPrefixSuffix(StrSubstitutorTest.java:212)

testCyclicReplacement(org.apache.commons.lang3.text.StrSubstitutorTest)  Time elapsed: 0.001 sec  <<< FAILURE!
java.lang.AssertionError: Cyclic replacement was not detected!
	at org.junit.Assert.fail(Assert.java:88)
	at org.apache.commons.lang3.text.StrSubstitutorTest.testCyclicReplacement(StrSubstitutorTest.java:252)

testReplaceToIdentical(org.apache.commons.lang3.text.StrSubstitutorTest)  Time elapsed: 0.001 sec  <<< FAILURE!
java.lang.AssertionError: null
	at org.junit.Assert.fail(Assert.java:86)
	at org.junit.Assert.assertTrue(Assert.java:41)
	at org.junit.Assert.assertTrue(Assert.java:52)
	at org.apache.commons.lang3.text.StrSubstitutorTest.doTestReplace(StrSubstitutorTest.java:673)
	at org.apache.commons.lang3.text.StrSubstitutorTest.testReplaceToIdentical(StrSubstitutorTest.java:231)

testReplaceSimple(org.apache.commons.lang3.text.StrSubstitutorTest)  Time elapsed: 0.001 sec  <<< FAILURE!
org.junit.ComparisonFailure: expected:<The [quick brown fox jumps over the lazy dog].> but was:<The [${animal} jumps over the ${target}].>
	at org.junit.Assert.assertEquals(Assert.java:115)
	at org.junit.Assert.assertEquals(Assert.java:144)
	at org.apache.commons.lang3.text.StrSubstitutorTest.doTestReplace(StrSubstitutorTest.java:634)
	at org.apache.commons.lang3.text.StrSubstitutorTest.testReplaceSimple(StrSubstitutorTest.java:63)

testStaticReplacePrefixSuffix(org.apache.commons.lang3.text.StrSubstitutorTest)  Time elapsed: 0 sec  <<< FAILURE!
org.junit.ComparisonFailure: expected:<Hi [commons]!> but was:<Hi [<name>]!>
	at org.junit.Assert.assertEquals(Assert.java:115)
	at org.junit.Assert.assertEquals(Assert.java:144)
	at org.apache.commons.lang3.text.StrSubstitutorTest.testStaticReplacePrefixSuffix(StrSubstitutorTest.java:573)

testReplaceRecursive(org.apache.commons.lang3.text.StrSubstitutorTest)  Time elapsed: 0 sec  <<< FAILURE!
org.junit.ComparisonFailure: expected:<The [quick brown fox jumps over the lazy dog].> but was:<The [${animal} jumps over the ${target}].>
	at org.junit.Assert.assertEquals(Assert.java:115)
	at org.junit.Assert.assertEquals(Assert.java:144)
	at org.apache.commons.lang3.text.StrSubstitutorTest.doTestReplace(StrSubstitutorTest.java:634)
	at org.apache.commons.lang3.text.StrSubstitutorTest.testReplaceRecursive(StrSubstitutorTest.java:152)

testConstructorMapPrefixSuffix(org.apache.commons.lang3.text.StrSubstitutorTest)  Time elapsed: 0.001 sec  <<< FAILURE!
org.junit.ComparisonFailure: expected:<Hi [< commons]> but was:<Hi [$< <name>]>
	at org.junit.Assert.assertEquals(Assert.java:115)
	at org.junit.Assert.assertEquals(Assert.java:144)
	at org.apache.commons.lang3.text.StrSubstitutorTest.testConstructorMapPrefixSuffix(StrSubstitutorTest.java:441)

testSamePrefixAndSuffix(org.apache.commons.lang3.text.StrSubstitutorTest)  Time elapsed: 0.001 sec  <<< FAILURE!
org.junit.ComparisonFailure: expected:<Hi [commons]!> but was:<Hi [@name@]!>
	at org.junit.Assert.assertEquals(Assert.java:115)
	at org.junit.Assert.assertEquals(Assert.java:144)
	at org.apache.commons.lang3.text.StrSubstitutorTest.testSamePrefixAndSuffix(StrSubstitutorTest.java:624)

testStaticReplace(org.apache.commons.lang3.text.StrSubstitutorTest)  Time elapsed: 0 sec  <<< FAILURE!
org.junit.ComparisonFailure: expected:<Hi [commons]!> but was:<Hi [${name}]!>
	at org.junit.Assert.assertEquals(Assert.java:115)
	at org.junit.Assert.assertEquals(Assert.java:144)
	at org.apache.commons.lang3.text.StrSubstitutorTest.testStaticReplace(StrSubstitutorTest.java:563)

testReplaceUnknownKey(org.apache.commons.lang3.text.StrSubstitutorTest)  Time elapsed: 0 sec  <<< FAILURE!
org.junit.ComparisonFailure: expected:<...son} jumps over the [lazy dog].> but was:<...son} jumps over the [${target}].>
	at org.junit.Assert.assertEquals(Assert.java:115)
	at org.junit.Assert.assertEquals(Assert.java:144)
	at org.apache.commons.lang3.text.StrSubstitutorTest.doTestReplace(StrSubstitutorTest.java:634)
	at org.apache.commons.lang3.text.StrSubstitutorTest.testReplaceUnknownKey(StrSubstitutorTest.java:113)

testReplaceNoPrefixNoSuffix(org.apache.commons.lang3.text.StrSubstitutorTest)  Time elapsed: 0.001 sec  <<< FAILURE!
org.junit.ComparisonFailure: expected:<...imal jumps over the [lazy dog].> but was:<...imal jumps over the [${target}].>
	at org.junit.Assert.assertEquals(Assert.java:115)
	at org.junit.Assert.assertEquals(Assert.java:144)
	at org.apache.commons.lang3.text.StrSubstitutorTest.doTestReplace(StrSubstitutorTest.java:634)
	at org.apache.commons.lang3.text.StrSubstitutorTest.testReplaceNoPrefixNoSuffix(StrSubstitutorTest.java:188)

testStaticReplaceSystemProperties(org.apache.commons.lang3.text.StrSubstitutorTest)  Time elapsed: 0.001 sec  <<< FAILURE!
org.junit.ComparisonFailure: expected:<Hi [perham, you are working with HAL-9000, your home directory is /home/perham].> but was:<Hi [${user.name}, you are working with ${os.name}, your home directory is ${user.home}].>
	at org.junit.Assert.assertEquals(Assert.java:115)
	at org.junit.Assert.assertEquals(Assert.java:144)
	at org.apache.commons.lang3.text.StrSubstitutorTest.testStaticReplaceSystemProperties(StrSubstitutorTest.java:587)

testReplaceInVariableRecursive(org.apache.commons.lang3.text.StrSubstitutorTest)  Time elapsed: 0.001 sec  <<< FAILURE!
org.junit.ComparisonFailure: Wrong result (1) expected:<The [white mouse jumps over the lazy dog].> but was:<The [${animal.${species.${color}}} jumps over the ${target}].>
	at org.junit.Assert.assertEquals(Assert.java:115)
	at org.apache.commons.lang3.text.StrSubstitutorTest.testReplaceInVariableRecursive(StrSubstitutorTest.java:357)

testReplaceAdjacentAtEnd(org.apache.commons.lang3.text.StrSubstitutorTest)  Time elapsed: 0.001 sec  <<< FAILURE!
org.junit.ComparisonFailure: expected:<Amount is [GBP12.50]> but was:<Amount is [${code}${amount}]>
	at org.junit.Assert.assertEquals(Assert.java:115)
	at org.junit.Assert.assertEquals(Assert.java:144)
	at org.apache.commons.lang3.text.StrSubstitutorTest.testReplaceAdjacentAtEnd(StrSubstitutorTest.java:136)

testReplaceSolo(org.apache.commons.lang3.text.StrSubstitutorTest)  Time elapsed: 0.001 sec  <<< FAILURE!
org.junit.ComparisonFailure: expected:<[quick brown fox]> but was:<[${animal}]>
	at org.junit.Assert.assertEquals(Assert.java:115)
	at org.junit.Assert.assertEquals(Assert.java:144)
	at org.apache.commons.lang3.text.StrSubstitutorTest.doTestReplace(StrSubstitutorTest.java:634)
	at org.apache.commons.lang3.text.StrSubstitutorTest.testReplaceSolo(StrSubstitutorTest.java:71)

testReplaceChangedMap(org.apache.commons.lang3.text.StrSubstitutorTest)  Time elapsed: 0 sec  <<< FAILURE!
org.junit.ComparisonFailure: expected:<The [quick brown fox jumps over the moon].> but was:<The [${animal} jumps over the ${target}].>
	at org.junit.Assert.assertEquals(Assert.java:115)
	at org.junit.Assert.assertEquals(Assert.java:144)
	at org.apache.commons.lang3.text.StrSubstitutorTest.testReplaceChangedMap(StrSubstitutorTest.java:105)

testReplaceEmptyKeys(org.apache.commons.lang3.text.StrSubstitutorTest)  Time elapsed: 0 sec  <<< FAILURE!
org.junit.ComparisonFailure: expected:<... ${} jumps over the [lazy dog].> but was:<... ${} jumps over the [${target}].>
	at org.junit.Assert.assertEquals(Assert.java:115)
	at org.junit.Assert.assertEquals(Assert.java:144)
	at org.apache.commons.lang3.text.StrSubstitutorTest.doTestReplace(StrSubstitutorTest.java:634)
	at org.apache.commons.lang3.text.StrSubstitutorTest.testReplaceEmptyKeys(StrSubstitutorTest.java:220)

testDefaultValueDelimiters(org.apache.commons.lang3.text.StrSubstitutorTest)  Time elapsed: 0 sec  <<< FAILURE!
org.junit.ComparisonFailure: expected:<The [fox jumps over the lazy dog. 1234567890].> but was:<The [${animal} jumps over the lazy ${target}. ${undefined.number:-1234567890}].>
	at org.junit.Assert.assertEquals(Assert.java:115)
	at org.junit.Assert.assertEquals(Assert.java:144)
	at org.apache.commons.lang3.text.StrSubstitutorTest.testDefaultValueDelimiters(StrSubstitutorTest.java:374)

testReplaceComplexEscaping(org.apache.commons.lang3.text.StrSubstitutorTest)  Time elapsed: 0 sec  <<< FAILURE!
org.junit.ComparisonFailure: expected:<The $[{quick brown fox} jumps over the lazy dog].> but was:<The $[${${animal}} jumps over the ${target}].>
	at org.junit.Assert.assertEquals(Assert.java:115)
	at org.junit.Assert.assertEquals(Assert.java:144)
	at org.apache.commons.lang3.text.StrSubstitutorTest.doTestReplace(StrSubstitutorTest.java:634)
	at org.apache.commons.lang3.text.StrSubstitutorTest.testReplaceComplexEscaping(StrSubstitutorTest.java:179)

testReplaceInVariable(org.apache.commons.lang3.text.StrSubstitutorTest)  Time elapsed: 0.001 sec  <<< FAILURE!
org.junit.ComparisonFailure: Wrong result (1) expected:<The [mouse jumps over the lazy dog].> but was:<The [${animal.${species}} jumps over the ${target}].>
	at org.junit.Assert.assertEquals(Assert.java:115)
	at org.apache.commons.lang3.text.StrSubstitutorTest.testReplaceInVariable(StrSubstitutorTest.java:311)

testReplacePrefixNoSuffix(org.apache.commons.lang3.text.StrSubstitutorTest)  Time elapsed: 0 sec  <<< FAILURE!
org.junit.ComparisonFailure: expected:<... over the ${target} [lazy dog].> but was:<... over the ${target} [${target}].>
	at org.junit.Assert.assertEquals(Assert.java:115)
	at org.junit.Assert.assertEquals(Assert.java:144)
	at org.apache.commons.lang3.text.StrSubstitutorTest.doTestReplace(StrSubstitutorTest.java:634)
	at org.apache.commons.lang3.text.StrSubstitutorTest.testReplacePrefixNoSuffix(StrSubstitutorTest.java:204)

testResolveVariable(org.apache.commons.lang3.text.StrSubstitutorTest)  Time elapsed: 0 sec  <<< FAILURE!
org.junit.ComparisonFailure: expected:<Hi [jakarta]!> but was:<Hi [${name}]!>
	at org.junit.Assert.assertEquals(Assert.java:115)
	at org.junit.Assert.assertEquals(Assert.java:144)
	at org.apache.commons.lang3.text.StrSubstitutorTest.testResolveVariable(StrSubstitutorTest.java:420)

testGetSetValueDelimiter(org.apache.commons.lang3.text.StrSubstitutorTest)  Time elapsed: 0 sec  <<< FAILURE!
java.lang.AssertionError: null
	at org.junit.Assert.fail(Assert.java:86)
	at org.junit.Assert.assertTrue(Assert.java:41)
	at org.junit.Assert.assertTrue(Assert.java:52)
	at org.apache.commons.lang3.text.StrSubstitutorTest.testGetSetValueDelimiter(StrSubstitutorTest.java:539)

testReplaceInVariableDisabled(org.apache.commons.lang3.text.StrSubstitutorTest)  Time elapsed: 0.001 sec  <<< FAILURE!
org.junit.ComparisonFailure: Wrong result (1) expected:<...es}} jumps over the [lazy dog].> but was:<...es}} jumps over the [${target}].>
	at org.junit.Assert.assertEquals(Assert.java:115)
	at org.apache.commons.lang3.text.StrSubstitutorTest.testReplaceInVariableDisabled(StrSubstitutorTest.java:335)

testReplaceIncompletePrefix(org.apache.commons.lang3.text.StrSubstitutorTest)  Time elapsed: 0.001 sec  <<< FAILURE!
org.junit.ComparisonFailure: expected:<...mal} jumps over the [lazy dog].> but was:<...mal} jumps over the [${target}].>
	at org.junit.Assert.assertEquals(Assert.java:115)
	at org.junit.Assert.assertEquals(Assert.java:144)
	at org.apache.commons.lang3.text.StrSubstitutorTest.doTestReplace(StrSubstitutorTest.java:634)
	at org.apache.commons.lang3.text.StrSubstitutorTest.testReplaceIncompletePrefix(StrSubstitutorTest.java:196)

testReplaceAdjacentAtStart(org.apache.commons.lang3.text.StrSubstitutorTest)  Time elapsed: 0 sec  <<< FAILURE!
org.junit.ComparisonFailure: expected:<[GBP12.50] charged> but was:<[${code}${amount}] charged>
	at org.junit.Assert.assertEquals(Assert.java:115)
	at org.junit.Assert.assertEquals(Assert.java:144)
	at org.apache.commons.lang3.text.StrSubstitutorTest.testReplaceAdjacentAtStart(StrSubstitutorTest.java:125)

testGetSetPrefix(org.apache.commons.lang3.text.StrSubstitutorTest)  Time elapsed: 0 sec  <<< FAILURE!
java.lang.AssertionError: null
	at org.junit.Assert.fail(Assert.java:86)
	at org.junit.Assert.assertTrue(Assert.java:41)
	at org.junit.Assert.assertTrue(Assert.java:52)
	at org.apache.commons.lang3.text.StrSubstitutorTest.testGetSetPrefix(StrSubstitutorTest.java:475)

testConstructorMapFull(org.apache.commons.lang3.text.StrSubstitutorTest)  Time elapsed: 0 sec  <<< FAILURE!
org.junit.ComparisonFailure: expected:<Hi [< commons]> but was:<Hi [!< <name>]>
	at org.junit.Assert.assertEquals(Assert.java:115)
	at org.junit.Assert.assertEquals(Assert.java:144)
	at org.apache.commons.lang3.text.StrSubstitutorTest.testConstructorMapFull(StrSubstitutorTest.java:452)

testGetSetSuffix(org.apache.commons.lang3.text.StrSubstitutorTest)  Time elapsed: 0 sec  <<< FAILURE!
java.lang.AssertionError: null
	at org.junit.Assert.fail(Assert.java:86)
	at org.junit.Assert.assertTrue(Assert.java:41)
	at org.junit.Assert.assertTrue(Assert.java:52)
	at org.apache.commons.lang3.text.StrSubstitutorTest.testGetSetSuffix(StrSubstitutorTest.java:507)

Running org.apache.commons.lang3.text.StrBuilderTest
Tests run: 90, Failures: 9, Errors: 0, Skipped: 0, Time elapsed: 0.062 sec <<< FAILURE! - in org.apache.commons.lang3.text.StrBuilderTest
testAsTokenizer(org.apache.commons.lang3.text.StrBuilderTest)  Time elapsed: 0.001 sec  <<< FAILURE!
java.lang.AssertionError: expected:<2> but was:<0>
	at org.junit.Assert.fail(Assert.java:88)
	at org.junit.Assert.failNotEquals(Assert.java:834)
	at org.junit.Assert.assertEquals(Assert.java:645)
	at org.junit.Assert.assertEquals(Assert.java:631)
	at org.apache.commons.lang3.text.StrBuilderTest.testAsTokenizer(StrBuilderTest.java:1666)

testReplaceFirst_StrMatcher_String(org.apache.commons.lang3.text.StrBuilderTest)  Time elapsed: 0 sec  <<< FAILURE!
org.junit.ComparisonFailure: expected:<b[-]ccba> but was:<b[cb]ccba>
	at org.junit.Assert.assertEquals(Assert.java:115)
	at org.junit.Assert.assertEquals(Assert.java:144)
	at org.apache.commons.lang3.text.StrBuilderTest.testReplaceFirst_StrMatcher_String(StrBuilderTest.java:923)

testReplace_StrMatcher_String_int_int_int_VaryEndIndex(org.apache.commons.lang3.text.StrBuilderTest)  Time elapsed: 0 sec  <<< FAILURE!
org.junit.ComparisonFailure: expected:<[-]xaaaayaa> but was:<[aa]xaaaayaa>
	at org.junit.Assert.assertEquals(Assert.java:115)
	at org.junit.Assert.assertEquals(Assert.java:144)
	at org.apache.commons.lang3.text.StrBuilderTest.testReplace_StrMatcher_String_int_int_int_VaryEndIndex(StrBuilderTest.java:1052)

testReplace_StrMatcher_String_int_int_int_VaryCount(org.apache.commons.lang3.text.StrBuilderTest)  Time elapsed: 0 sec  <<< FAILURE!
org.junit.ComparisonFailure: expected:<[-x--y-]> but was:<[aaxaaaayaa]>
	at org.junit.Assert.assertEquals(Assert.java:115)
	at org.junit.Assert.assertEquals(Assert.java:144)
	at org.apache.commons.lang3.text.StrBuilderTest.testReplace_StrMatcher_String_int_int_int_VaryCount(StrBuilderTest.java:1102)

testReplaceAll_StrMatcher_String(org.apache.commons.lang3.text.StrBuilderTest)  Time elapsed: 0 sec  <<< FAILURE!
org.junit.ComparisonFailure: expected:<b[-c-]> but was:<b[cbccb]>
	at org.junit.Assert.assertEquals(Assert.java:115)
	at org.junit.Assert.assertEquals(Assert.java:144)
	at org.apache.commons.lang3.text.StrBuilderTest.testReplaceAll_StrMatcher_String(StrBuilderTest.java:889)

testReplace_StrMatcher_String_int_int_int_VaryStartIndex(org.apache.commons.lang3.text.StrBuilderTest)  Time elapsed: 0.001 sec  <<< FAILURE!
org.junit.ComparisonFailure: expected:<[-x--y-]> but was:<[aaxaaaayaa]>
	at org.junit.Assert.assertEquals(Assert.java:115)
	at org.junit.Assert.assertEquals(Assert.java:144)
	at org.apache.commons.lang3.text.StrBuilderTest.testReplace_StrMatcher_String_int_int_int_VaryStartIndex(StrBuilderTest.java:987)

testReplace_StrMatcher_String_int_int_int_VaryMatcher(org.apache.commons.lang3.text.StrBuilderTest)  Time elapsed: 0 sec  <<< FAILURE!
org.junit.ComparisonFailure: expected:<xb[xcx]x> but was:<xb[cbccb]x>
	at org.junit.Assert.assertEquals(Assert.java:115)
	at org.junit.Assert.assertEquals(Assert.java:144)
	at org.apache.commons.lang3.text.StrBuilderTest.testReplace_StrMatcher_String_int_int_int_VaryMatcher(StrBuilderTest.java:949)

testContains_StrMatcher(org.apache.commons.lang3.text.StrBuilderTest)  Time elapsed: 0 sec  <<< FAILURE!
java.lang.AssertionError: null
	at org.junit.Assert.fail(Assert.java:86)
	at org.junit.Assert.assertTrue(Assert.java:41)
	at org.junit.Assert.assertTrue(Assert.java:52)
	at org.apache.commons.lang3.text.StrBuilderTest.testContains_StrMatcher(StrBuilderTest.java:1323)

testReplace_StrMatcher_String_int_int_int_VaryReplace(org.apache.commons.lang3.text.StrBuilderTest)  Time elapsed: 0 sec  <<< FAILURE!
org.junit.ComparisonFailure: expected:<ab[-c-]a> but was:<ab[cbccb]a>
	at org.junit.Assert.assertEquals(Assert.java:115)
	at org.junit.Assert.assertEquals(Assert.java:144)
	at org.apache.commons.lang3.text.StrBuilderTest.testReplace_StrMatcher_String_int_int_int_VaryReplace(StrBuilderTest.java:968)

Running org.apache.commons.lang3.StringEscapeUtilsTest
Tests run: 28, Failures: 4, Errors: 0, Skipped: 0, Time elapsed: 0.348 sec <<< FAILURE! - in org.apache.commons.lang3.StringEscapeUtilsTest
testEscapeCsvString(org.apache.commons.lang3.StringEscapeUtilsTest)  Time elapsed: 0.001 sec  <<< FAILURE!
org.junit.ComparisonFailure: expected:<"foo"["]bar"> but was:<"foo"[]bar">
	at org.junit.Assert.assertEquals(Assert.java:115)
	at org.junit.Assert.assertEquals(Assert.java:144)
	at org.apache.commons.lang3.StringEscapeUtilsTest.testEscapeCsvString(StringEscapeUtilsTest.java:446)

testEscapeCsvWriter(org.apache.commons.lang3.StringEscapeUtilsTest)  Time elapsed: 0.001 sec  <<< FAILURE!
org.junit.ComparisonFailure: expected:<"foo"["]bar"> but was:<"foo"[]bar">
	at org.junit.Assert.assertEquals(Assert.java:115)
	at org.junit.Assert.assertEquals(Assert.java:144)
	at org.apache.commons.lang3.StringEscapeUtilsTest.checkCsvEscapeWriter(StringEscapeUtilsTest.java:468)
	at org.apache.commons.lang3.StringEscapeUtilsTest.testEscapeCsvWriter(StringEscapeUtilsTest.java:458)

testUnescapeCsvString(org.apache.commons.lang3.StringEscapeUtilsTest)  Time elapsed: 0.001 sec  <<< FAILURE!
org.junit.ComparisonFailure: expected:<[foo,bar]> but was:<["foo,bar"]>
	at org.junit.Assert.assertEquals(Assert.java:115)
	at org.junit.Assert.assertEquals(Assert.java:144)
	at org.apache.commons.lang3.StringEscapeUtilsTest.testUnescapeCsvString(StringEscapeUtilsTest.java:477)

testUnescapeCsvWriter(org.apache.commons.lang3.StringEscapeUtilsTest)  Time elapsed: 0 sec  <<< FAILURE!
org.junit.ComparisonFailure: expected:<[foo,bar]> but was:<["foo,bar"]>
	at org.junit.Assert.assertEquals(Assert.java:115)
	at org.junit.Assert.assertEquals(Assert.java:144)
	at org.apache.commons.lang3.StringEscapeUtilsTest.checkCsvUnescapeWriter(StringEscapeUtilsTest.java:506)
	at org.apache.commons.lang3.StringEscapeUtilsTest.testUnescapeCsvWriter(StringEscapeUtilsTest.java:491)

Running org.apache.commons.lang3.AnnotationUtilsTest
Tests run: 10, Failures: 0, Errors: 0, Skipped: 0, Time elapsed: 0.03 sec - in org.apache.commons.lang3.AnnotationUtilsTest
Running org.apache.commons.lang3.ConversionTest
Tests run: 42, Failures: 0, Errors: 0, Skipped: 0, Time elapsed: 0.022 sec - in org.apache.commons.lang3.ConversionTest
Running org.apache.commons.lang3.StringUtilsTrimEmptyTest
Tests run: 15, Failures: 3, Errors: 5, Skipped: 0, Time elapsed: 0.006 sec <<< FAILURE! - in org.apache.commons.lang3.StringUtilsTrimEmptyTest
testStripAll(org.apache.commons.lang3.StringUtilsTrimEmptyTest)  Time elapsed: 0 sec  <<< ERROR!
java.lang.NullPointerException: null
	at org.apache.commons.lang3.StringUtils.isEmpty(StringUtils.java:25)
	at org.apache.commons.lang3.StringUtils.strip(StringUtils.java:51)
	at org.apache.commons.lang3.StringUtils.stripAll(StringUtils.java:73)
	at org.apache.commons.lang3.StringUtils.stripAll(StringUtils.java:67)
	at org.apache.commons.lang3.StringUtilsTrimEmptyTest.testStripAll(StringUtilsTrimEmptyTest.java:252)

testStripToNull_String(org.apache.commons.lang3.StringUtilsTrimEmptyTest)  Time elapsed: 0 sec  <<< FAILURE!
java.lang.AssertionError: expected:<null> but was:<        >
	at org.junit.Assert.fail(Assert.java:88)
	at org.junit.Assert.failNotEquals(Assert.java:834)
	at org.junit.Assert.assertEquals(Assert.java:118)
	at org.junit.Assert.assertEquals(Assert.java:144)
	at org.apache.commons.lang3.StringUtilsTrimEmptyTest.testStripToNull_String(StringUtilsTrimEmptyTest.java:127)

testIsNotEmpty(org.apache.commons.lang3.StringUtilsTrimEmptyTest)  Time elapsed: 0 sec  <<< ERROR!
java.lang.NullPointerException: null
	at org.apache.commons.lang3.StringUtils.isEmpty(StringUtils.java:25)
	at org.apache.commons.lang3.StringUtils.isNotEmpty(StringUtils.java:26)
	at org.apache.commons.lang3.StringUtilsTrimEmptyTest.testIsNotEmpty(StringUtilsTrimEmptyTest.java:47)

testStrip_StringString(org.apache.commons.lang3.StringUtilsTrimEmptyTest)  Time elapsed: 0 sec  <<< ERROR!
java.lang.NullPointerException: null
	at org.apache.commons.lang3.StringUtils.isEmpty(StringUtils.java:25)
	at org.apache.commons.lang3.StringUtils.strip(StringUtils.java:51)
	at org.apache.commons.lang3.StringUtilsTrimEmptyTest.testStrip_StringString(StringUtilsTrimEmptyTest.java:148)

testStripToEmpty_String(org.apache.commons.lang3.StringUtilsTrimEmptyTest)  Time elapsed: 0 sec  <<< FAILURE!
org.junit.ComparisonFailure: expected:<[]> but was:<[        ]>
	at org.junit.Assert.assertEquals(Assert.java:115)
	at org.junit.Assert.assertEquals(Assert.java:144)
	at org.apache.commons.lang3.StringUtilsTrimEmptyTest.testStripToEmpty_String(StringUtilsTrimEmptyTest.java:138)

testTrimToNull(org.apache.commons.lang3.StringUtilsTrimEmptyTest)  Time elapsed: 0 sec  <<< FAILURE!
java.lang.AssertionError: expected:<foo> but was:<null>
	at org.junit.Assert.fail(Assert.java:88)
	at org.junit.Assert.failNotEquals(Assert.java:834)
	at org.junit.Assert.assertEquals(Assert.java:118)
	at org.junit.Assert.assertEquals(Assert.java:144)
	at org.apache.commons.lang3.StringUtilsTrimEmptyTest.testTrimToNull(StringUtilsTrimEmptyTest.java:88)

testIsEmpty(org.apache.commons.lang3.StringUtilsTrimEmptyTest)  Time elapsed: 0 sec  <<< ERROR!
java.lang.NullPointerException: null
	at org.apache.commons.lang3.StringUtils.isEmpty(StringUtils.java:25)
	at org.apache.commons.lang3.StringUtilsTrimEmptyTest.testIsEmpty(StringUtilsTrimEmptyTest.java:38)

testStrip_String(org.apache.commons.lang3.StringUtilsTrimEmptyTest)  Time elapsed: 0 sec  <<< ERROR!
java.lang.NullPointerException: null
	at org.apache.commons.lang3.StringUtils.isEmpty(StringUtils.java:25)
	at org.apache.commons.lang3.StringUtils.strip(StringUtils.java:51)
	at org.apache.commons.lang3.StringUtils.strip(StringUtils.java:46)
	at org.apache.commons.lang3.StringUtilsTrimEmptyTest.testStrip_String(StringUtilsTrimEmptyTest.java:115)

Running org.apache.commons.lang3.EnumUtilsTest
Tests run: 34, Failures: 0, Errors: 0, Skipped: 0, Time elapsed: 0.007 sec - in org.apache.commons.lang3.EnumUtilsTest
Running org.apache.commons.lang3.exception.ExceptionUtilsTest
Tests run: 28, Failures: 2, Errors: 0, Skipped: 0, Time elapsed: 0.031 sec <<< FAILURE! - in org.apache.commons.lang3.exception.ExceptionUtilsTest
test_getRootCauseMessage_Throwable(org.apache.commons.lang3.exception.ExceptionUtilsTest)  Time elapsed: 0 sec  <<< FAILURE!
org.junit.ComparisonFailure: expected:<[IllegalArgumentException]: Base> but was:<[]: Base>
	at org.junit.Assert.assertEquals(Assert.java:115)
	at org.junit.Assert.assertEquals(Assert.java:144)
	at org.apache.commons.lang3.exception.ExceptionUtilsTest.test_getRootCauseMessage_Throwable(ExceptionUtilsTest.java:478)

test_getMessage_Throwable(org.apache.commons.lang3.exception.ExceptionUtilsTest)  Time elapsed: 0.001 sec  <<< FAILURE!
org.junit.ComparisonFailure: expected:<[IllegalArgumentException]: Base> but was:<[]: Base>
	at org.junit.Assert.assertEquals(Assert.java:115)
	at org.junit.Assert.assertEquals(Assert.java:144)
	at org.apache.commons.lang3.exception.ExceptionUtilsTest.test_getMessage_Throwable(ExceptionUtilsTest.java:466)

Running org.apache.commons.lang3.exception.DefaultExceptionContextTest
Tests run: 8, Failures: 0, Errors: 0, Skipped: 0, Time elapsed: 0.005 sec - in org.apache.commons.lang3.exception.DefaultExceptionContextTest
Running org.apache.commons.lang3.exception.ContextedExceptionTest
Tests run: 14, Failures: 0, Errors: 0, Skipped: 0, Time elapsed: 0.009 sec - in org.apache.commons.lang3.exception.ContextedExceptionTest
Running org.apache.commons.lang3.exception.ContextedRuntimeExceptionTest
Tests run: 14, Failures: 0, Errors: 0, Skipped: 0, Time elapsed: 0.011 sec - in org.apache.commons.lang3.exception.ContextedRuntimeExceptionTest
Running org.apache.commons.lang3.BitFieldTest
Tests run: 15, Failures: 0, Errors: 0, Skipped: 0, Time elapsed: 0.005 sec - in org.apache.commons.lang3.BitFieldTest
Running org.apache.commons.lang3.ArrayUtilsRemoveMultipleTest
Tests run: 55, Failures: 0, Errors: 0, Skipped: 0, Time elapsed: 0.011 sec - in org.apache.commons.lang3.ArrayUtilsRemoveMultipleTest
Running org.apache.commons.lang3.HashSetvBitSetTest
Ratio=9% array=100 count=1 extract=12348049 bitset=1206975
Ratio=7% array=100 count=10 extract=16221572 bitset=1246761
Ratio=4% array=100 count=50 extract=23260152 bitset=1104258
Ratio=4% array=100 count=100 extract=11765609 bitset=471518
Ratio=84% array=1000 count=10 extract=5945281 bitset=4995829
Ratio=63% array=1000 count=100 extract=15397272 bitset=9851108
Ratio=7% array=1000 count=500 extract=47200000 bitset=3563127
Ratio=1% array=1000 count=1000 extract=71062730 bitset=876645
Ratio=3% count=0 hash=4188846 bits=138109
Ratio=32% count=5 hash=564679 bits=180975
Ratio=29% count=10 hash=861291 bits=255134
Ratio=22% count=200 hash=18718366 bits=4237492
Ratio=16% count=50 hash=8264749 bits=1374339
Ratio=24% count=100 hash=9332947 bits=2327485
Ratio=19% count=1000 hash=83789815 bits=16737580
Ratio=22% count=2000 hash=161460853 bits=36503816
Tests run: 2, Failures: 0, Errors: 0, Skipped: 0, Time elapsed: 0.673 sec - in org.apache.commons.lang3.HashSetvBitSetTest
Running org.apache.commons.lang3.StringUtilsTest
Tests run: 124, Failures: 10, Errors: 25, Skipped: 0, Time elapsed: 0.143 sec <<< FAILURE! - in org.apache.commons.lang3.StringUtilsTest
testDeleteWhitespace_String(org.apache.commons.lang3.StringUtilsTest)  Time elapsed: 0 sec  <<< ERROR!
java.lang.NullPointerException: null
	at org.apache.commons.lang3.StringUtils.isEmpty(StringUtils.java:25)
	at org.apache.commons.lang3.StringUtils.deleteWhitespace(StringUtils.java:562)
	at org.apache.commons.lang3.StringUtilsTest.testDeleteWhitespace_String(StringUtilsTest.java:1106)

testRemove_String(org.apache.commons.lang3.StringUtilsTest)  Time elapsed: 0 sec  <<< ERROR!
java.lang.NullPointerException: null
	at org.apache.commons.lang3.StringUtils.isEmpty(StringUtils.java:25)
	at org.apache.commons.lang3.StringUtils.remove(StringUtils.java:583)
	at org.apache.commons.lang3.StringUtilsTest.testRemove_String(StringUtilsTest.java:2186)

testIsAnyEmpty(org.apache.commons.lang3.StringUtilsTest)  Time elapsed: 0 sec  <<< ERROR!
java.lang.NullPointerException: null
	at org.apache.commons.lang3.StringUtils.isEmpty(StringUtils.java:25)
	at org.apache.commons.lang3.StringUtils.isAnyEmpty(StringUtils.java:28)
	at org.apache.commons.lang3.StringUtilsTest.testIsAnyEmpty(StringUtilsTest.java:147)

testNormalizeSpace(org.apache.commons.lang3.StringUtilsTest)  Time elapsed: 0 sec  <<< ERROR!
java.lang.NullPointerException: null
	at org.apache.commons.lang3.StringUtils.isEmpty(StringUtils.java:25)
	at org.apache.commons.lang3.StringUtils.normalizeSpace(StringUtils.java:1111)
	at org.apache.commons.lang3.StringUtilsTest.testNormalizeSpace(StringUtilsTest.java:2275)

testRepeat_StringStringInt(org.apache.commons.lang3.StringUtilsTest)  Time elapsed: 0 sec  <<< FAILURE!
org.junit.ComparisonFailure: expected:<xx[]> but was:<xx[x]>
	at org.junit.Assert.assertEquals(Assert.java:115)
	at org.junit.Assert.assertEquals(Assert.java:144)
	at org.apache.commons.lang3.StringUtilsTest.testRepeat_StringStringInt(StringUtilsTest.java:1367)

testPrependIfMissing(org.apache.commons.lang3.StringUtilsTest)  Time elapsed: 0 sec  <<< ERROR!
java.lang.NullPointerException: null
	at org.apache.commons.lang3.StringUtils.isEmpty(StringUtils.java:25)
	at org.apache.commons.lang3.StringUtils.prependIfMissing(StringUtils.java:1136)
	at org.apache.commons.lang3.StringUtils.prependIfMissing(StringUtils.java:1139)
	at org.apache.commons.lang3.StringUtilsTest.testPrependIfMissing(StringUtilsTest.java:2435)

testIsAllLowerCase(org.apache.commons.lang3.StringUtilsTest)  Time elapsed: 0 sec  <<< FAILURE!
java.lang.AssertionError: null
	at org.junit.Assert.fail(Assert.java:86)
	at org.junit.Assert.assertTrue(Assert.java:41)
	at org.junit.Assert.assertTrue(Assert.java:52)
	at org.apache.commons.lang3.StringUtilsTest.testIsAllLowerCase(StringUtilsTest.java:2072)

testChomp(org.apache.commons.lang3.StringUtilsTest)  Time elapsed: 0.002 sec  <<< FAILURE!
org.junit.ComparisonFailure: chomp(String) failed expected:<foo[]> but was:<foo[
]>
	at org.junit.Assert.assertEquals(Assert.java:115)
	at org.apache.commons.lang3.StringUtilsTest.testChomp(StringUtilsTest.java:1421)

testDefaultIfEmpty_CharBuffers(org.apache.commons.lang3.StringUtilsTest)  Time elapsed: 0 sec  <<< FAILURE!
org.junit.ComparisonFailure: expected:<[abc]> but was:<[NULL]>
	at org.junit.Assert.assertEquals(Assert.java:115)
	at org.junit.Assert.assertEquals(Assert.java:144)
	at org.apache.commons.lang3.StringUtilsTest.testDefaultIfEmpty_CharBuffers(StringUtilsTest.java:1715)

testRemoveStart(org.apache.commons.lang3.StringUtilsTest)  Time elapsed: 0 sec  <<< ERROR!
java.lang.NullPointerException: null
	at org.apache.commons.lang3.StringUtils.isEmpty(StringUtils.java:25)
	at org.apache.commons.lang3.StringUtils.removeStart(StringUtils.java:571)
	at org.apache.commons.lang3.StringUtilsTest.testRemoveStart(StringUtilsTest.java:2101)

testRemove_char(org.apache.commons.lang3.StringUtilsTest)  Time elapsed: 0.001 sec  <<< ERROR!
java.lang.NullPointerException: null
	at org.apache.commons.lang3.StringUtils.isEmpty(StringUtils.java:25)
	at org.apache.commons.lang3.StringUtils.remove(StringUtils.java:585)
	at org.apache.commons.lang3.StringUtilsTest.testRemove_char(StringUtilsTest.java:2215)

testAbbreviateMiddle(org.apache.commons.lang3.StringUtilsTest)  Time elapsed: 0 sec  <<< ERROR!
java.lang.NullPointerException: null
	at org.apache.commons.lang3.StringUtils.isEmpty(StringUtils.java:25)
	at org.apache.commons.lang3.StringUtils.abbreviateMiddle(StringUtils.java:915)
	at org.apache.commons.lang3.StringUtilsTest.testAbbreviateMiddle(StringUtilsTest.java:1827)

testIsAllUpperCase(org.apache.commons.lang3.StringUtilsTest)  Time elapsed: 0 sec  <<< FAILURE!
java.lang.AssertionError: null
	at org.junit.Assert.fail(Assert.java:86)
	at org.junit.Assert.assertTrue(Assert.java:41)
	at org.junit.Assert.assertTrue(Assert.java:52)
	at org.apache.commons.lang3.StringUtilsTest.testIsAllUpperCase(StringUtilsTest.java:2089)

testRemoveEndIgnoreCase(org.apache.commons.lang3.StringUtilsTest)  Time elapsed: 0 sec  <<< ERROR!
java.lang.NullPointerException: null
	at org.apache.commons.lang3.StringUtils.isEmpty(StringUtils.java:25)
	at org.apache.commons.lang3.StringUtils.removeEndIgnoreCase(StringUtils.java:580)
	at org.apache.commons.lang3.StringUtilsTest.testRemoveEndIgnoreCase(StringUtilsTest.java:2162)

testAppendIfMissingIgnoreCase(org.apache.commons.lang3.StringUtilsTest)  Time elapsed: 0 sec  <<< ERROR!
java.lang.NullPointerException: null
	at org.apache.commons.lang3.StringUtils.isEmpty(StringUtils.java:25)
	at org.apache.commons.lang3.StringUtils.appendIfMissing(StringUtils.java:1131)
	at org.apache.commons.lang3.StringUtils.appendIfMissingIgnoreCase(StringUtils.java:1135)
	at org.apache.commons.lang3.StringUtilsTest.testAppendIfMissingIgnoreCase(StringUtilsTest.java:2411)

testWrap_StringString(org.apache.commons.lang3.StringUtilsTest)  Time elapsed: 0 sec  <<< ERROR!
java.lang.NullPointerException: null
	at org.apache.commons.lang3.StringUtils.isEmpty(StringUtils.java:25)
	at org.apache.commons.lang3.StringUtils.wrap(StringUtils.java:1145)
	at org.apache.commons.lang3.StringUtilsTest.testWrap_StringString(StringUtilsTest.java:2518)

testDefaultIfEmpty_StringBuffers(org.apache.commons.lang3.StringUtilsTest)  Time elapsed: 0.001 sec  <<< FAILURE!
org.junit.ComparisonFailure: expected:<[abc]> but was:<[NULL]>
	at org.junit.Assert.assertEquals(Assert.java:115)
	at org.junit.Assert.assertEquals(Assert.java:144)
	at org.apache.commons.lang3.StringUtilsTest.testDefaultIfEmpty_StringBuffers(StringUtilsTest.java:1694)

testReplaceChars_StringStringString(org.apache.commons.lang3.StringUtilsTest)  Time elapsed: 0 sec  <<< ERROR!
java.lang.NullPointerException: null
	at org.apache.commons.lang3.StringUtils.isEmpty(StringUtils.java:25)
	at org.apache.commons.lang3.StringUtils.replaceChars(StringUtils.java:664)
	at org.apache.commons.lang3.StringUtilsTest.testReplaceChars_StringStringString(StringUtilsTest.java:1273)

testLeftPad_StringIntString(org.apache.commons.lang3.StringUtilsTest)  Time elapsed: 0.001 sec  <<< FAILURE!
org.junit.ComparisonFailure: expected:<[-+-+]abc> but was:<[    ]abc>
	at org.junit.Assert.assertEquals(Assert.java:115)
	at org.junit.Assert.assertEquals(Assert.java:144)
	at org.apache.commons.lang3.StringUtilsTest.testLeftPad_StringIntString(StringUtilsTest.java:1519)

testAppendIfMissing(org.apache.commons.lang3.StringUtilsTest)  Time elapsed: 0 sec  <<< ERROR!
java.lang.NullPointerException: null
	at org.apache.commons.lang3.StringUtils.isEmpty(StringUtils.java:25)
	at org.apache.commons.lang3.StringUtils.appendIfMissing(StringUtils.java:1131)
	at org.apache.commons.lang3.StringUtils.appendIfMissing(StringUtils.java:1134)
	at org.apache.commons.lang3.StringUtilsTest.testAppendIfMissing(StringUtilsTest.java:2387)

testDefaultIfEmpty_StringString(org.apache.commons.lang3.StringUtilsTest)  Time elapsed: 0 sec  <<< ERROR!
java.lang.NullPointerException: null
	at org.apache.commons.lang3.StringUtils.isEmpty(StringUtils.java:25)
	at org.apache.commons.lang3.StringUtils.defaultIfEmpty(StringUtils.java:897)
	at org.apache.commons.lang3.StringUtilsTest.testDefaultIfEmpty_StringString(StringUtilsTest.java:1649)

testIsNotEmpty(org.apache.commons.lang3.StringUtilsTest)  Time elapsed: 0.001 sec  <<< ERROR!
java.lang.NullPointerException: null
	at org.apache.commons.lang3.StringUtils.isEmpty(StringUtils.java:25)
	at org.apache.commons.lang3.StringUtils.isNotEmpty(StringUtils.java:26)
	at org.apache.commons.lang3.StringUtilsTest.testIsNotEmpty(StringUtilsTest.java:138)

testReplaceOnce_StringStringString(org.apache.commons.lang3.StringUtilsTest)  Time elapsed: 0 sec  <<< ERROR!
java.lang.NullPointerException: null
	at org.apache.commons.lang3.StringUtils.isEmpty(StringUtils.java:25)
	at org.apache.commons.lang3.StringUtils.replace(StringUtils.java:596)
	at org.apache.commons.lang3.StringUtils.replaceOnce(StringUtils.java:592)
	at org.apache.commons.lang3.StringUtilsTest.testReplaceOnce_StringStringString(StringUtilsTest.java:1184)

testReplace_StringStringString(org.apache.commons.lang3.StringUtilsTest)  Time elapsed: 0 sec  <<< ERROR!
java.lang.NullPointerException: null
	at org.apache.commons.lang3.StringUtils.isEmpty(StringUtils.java:25)
	at org.apache.commons.lang3.StringUtils.replace(StringUtils.java:596)
	at org.apache.commons.lang3.StringUtils.replace(StringUtils.java:595)
	at org.apache.commons.lang3.StringUtilsTest.testReplace_StringStringString(StringUtilsTest.java:1126)

testIsNoneEmpty(org.apache.commons.lang3.StringUtilsTest)  Time elapsed: 0 sec  <<< ERROR!
java.lang.NullPointerException: null
	at org.apache.commons.lang3.StringUtils.isEmpty(StringUtils.java:25)
	at org.apache.commons.lang3.StringUtils.isAnyEmpty(StringUtils.java:28)
	at org.apache.commons.lang3.StringUtils.isNoneEmpty(StringUtils.java:30)
	at org.apache.commons.lang3.StringUtilsTest.testIsNoneEmpty(StringUtilsTest.java:159)

testDefaultIfEmpty_StringBuilders(org.apache.commons.lang3.StringUtilsTest)  Time elapsed: 0.001 sec  <<< FAILURE!
org.junit.ComparisonFailure: expected:<[abc]> but was:<[NULL]>
	at org.junit.Assert.assertEquals(Assert.java:115)
	at org.junit.Assert.assertEquals(Assert.java:144)
	at org.apache.commons.lang3.StringUtilsTest.testDefaultIfEmpty_StringBuilders(StringUtilsTest.java:1673)

testPrependIfMissingIgnoreCase(org.apache.commons.lang3.StringUtilsTest)  Time elapsed: 0.001 sec  <<< ERROR!
java.lang.NullPointerException: null
	at org.apache.commons.lang3.StringUtils.isEmpty(StringUtils.java:25)
	at org.apache.commons.lang3.StringUtils.prependIfMissing(StringUtils.java:1136)
	at org.apache.commons.lang3.StringUtils.prependIfMissingIgnoreCase(StringUtils.java:1140)
	at org.apache.commons.lang3.StringUtilsTest.testPrependIfMissingIgnoreCase(StringUtilsTest.java:2459)

testRightPad_StringIntString(org.apache.commons.lang3.StringUtilsTest)  Time elapsed: 0 sec  <<< FAILURE!
org.junit.ComparisonFailure: expected:<abc[-+-+]> but was:<abc[    ]>
	at org.junit.Assert.assertEquals(Assert.java:115)
	at org.junit.Assert.assertEquals(Assert.java:144)
	at org.apache.commons.lang3.StringUtilsTest.testRightPad_StringIntString(StringUtilsTest.java:1483)

testSwapCase_String(org.apache.commons.lang3.StringUtilsTest)  Time elapsed: 0.001 sec  <<< ERROR!
java.lang.NullPointerException: null
	at org.apache.commons.lang3.StringUtils.isEmpty(StringUtils.java:25)
	at org.apache.commons.lang3.StringUtils.swapCase(StringUtils.java:813)
	at org.apache.commons.lang3.StringUtilsTest.testSwapCase_String(StringUtilsTest.java:274)

testIsEmpty(org.apache.commons.lang3.StringUtilsTest)  Time elapsed: 0 sec  <<< ERROR!
java.lang.NullPointerException: null
	at org.apache.commons.lang3.StringUtils.isEmpty(StringUtils.java:25)
	at org.apache.commons.lang3.StringUtilsTest.testIsEmpty(StringUtilsTest.java:129)

testWrap_StringChar(org.apache.commons.lang3.StringUtilsTest)  Time elapsed: 0 sec  <<< ERROR!
java.lang.NullPointerException: null
	at org.apache.commons.lang3.StringUtils.isEmpty(StringUtils.java:25)
	at org.apache.commons.lang3.StringUtils.wrap(StringUtils.java:1145)
	at org.apache.commons.lang3.StringUtilsTest.testWrap_StringChar(StringUtilsTest.java:2501)

testRemoveStartIgnoreCase(org.apache.commons.lang3.StringUtilsTest)  Time elapsed: 0.001 sec  <<< ERROR!
java.lang.NullPointerException: null
	at org.apache.commons.lang3.StringUtils.isEmpty(StringUtils.java:25)
	at org.apache.commons.lang3.StringUtils.removeStartIgnoreCase(StringUtils.java:574)
	at org.apache.commons.lang3.StringUtilsTest.testRemoveStartIgnoreCase(StringUtilsTest.java:2120)

testRemoveEnd(org.apache.commons.lang3.StringUtilsTest)  Time elapsed: 0 sec  <<< ERROR!
java.lang.NullPointerException: null
	at org.apache.commons.lang3.StringUtils.isEmpty(StringUtils.java:25)
	at org.apache.commons.lang3.StringUtils.removeEnd(StringUtils.java:577)
	at org.apache.commons.lang3.StringUtilsTest.testRemoveEnd(StringUtilsTest.java:2142)

testCenter_StringIntString(org.apache.commons.lang3.StringUtilsTest)  Time elapsed: 0 sec  <<< FAILURE!
org.junit.ComparisonFailure: expected:<[yayz]> but was:<[ a  ]>
	at org.junit.Assert.assertEquals(Assert.java:115)
	at org.junit.Assert.assertEquals(Assert.java:144)
	at org.apache.commons.lang3.StringUtilsTest.testCenter_StringIntString(StringUtilsTest.java:1609)

testReplace_StringStringStringInt(org.apache.commons.lang3.StringUtilsTest)  Time elapsed: 0.001 sec  <<< ERROR!
java.lang.NullPointerException: null
	at org.apache.commons.lang3.StringUtils.isEmpty(StringUtils.java:25)
	at org.apache.commons.lang3.StringUtils.replace(StringUtils.java:596)
	at org.apache.commons.lang3.StringUtilsTest.testReplace_StringStringStringInt(StringUtilsTest.java:1158)

Running org.apache.commons.lang3.ArrayUtilsRemoveTest
Tests run: 19, Failures: 0, Errors: 0, Skipped: 0, Time elapsed: 0.001 sec - in org.apache.commons.lang3.ArrayUtilsRemoveTest
Running org.apache.commons.lang3.ObjectUtilsTest
Tests run: 36, Failures: 0, Errors: 0, Skipped: 0, Time elapsed: 0.005 sec - in org.apache.commons.lang3.ObjectUtilsTest
Running org.apache.commons.lang3.ClassPathUtilsTest
Tests run: 13, Failures: 0, Errors: 0, Skipped: 0, Time elapsed: 0.002 sec - in org.apache.commons.lang3.ClassPathUtilsTest
Running org.apache.commons.lang3.math.NumberUtilsTest
Tests run: 91, Failures: 4, Errors: 4, Skipped: 0, Time elapsed: 0.025 sec <<< FAILURE! - in org.apache.commons.lang3.math.NumberUtilsTest
testCreateNumber(org.apache.commons.lang3.math.NumberUtilsTest)  Time elapsed: 0 sec  <<< ERROR!
java.lang.NumberFormatException: 12345L is not a valid number.
	at org.apache.commons.lang3.math.NumberUtils.createNumber(NumberUtils.java:542)
	at org.apache.commons.lang3.math.NumberUtilsTest.testCreateNumber(NumberUtilsTest.java:206)

testLANG971(org.apache.commons.lang3.math.NumberUtilsTest)  Time elapsed: 0.001 sec  <<< FAILURE!
java.lang.AssertionError: Expecting true for isNumber/createNumber using "07" but got false and true
	at org.junit.Assert.fail(Assert.java:88)
	at org.apache.commons.lang3.math.NumberUtilsTest.compareIsNumberWithCreateNumber(NumberUtilsTest.java:1271)
	at org.apache.commons.lang3.math.NumberUtilsTest.testLANG971(NumberUtilsTest.java:1249)

testLANG972(org.apache.commons.lang3.math.NumberUtilsTest)  Time elapsed: 0 sec  <<< FAILURE!
java.lang.AssertionError: Expecting true for isNumber/createNumber using "0xABCD" but got false and true
	at org.junit.Assert.fail(Assert.java:88)
	at org.apache.commons.lang3.math.NumberUtilsTest.compareIsNumberWithCreateNumber(NumberUtilsTest.java:1271)
	at org.apache.commons.lang3.math.NumberUtilsTest.testLANG972(NumberUtilsTest.java:1261)

testLANG992(org.apache.commons.lang3.math.NumberUtilsTest)  Time elapsed: 0 sec  <<< FAILURE!
java.lang.AssertionError: Expecting true for isNumber/createNumber using "0.0" but got false and true
	at org.junit.Assert.fail(Assert.java:88)
	at org.apache.commons.lang3.math.NumberUtilsTest.compareIsNumberWithCreateNumber(NumberUtilsTest.java:1271)
	at org.apache.commons.lang3.math.NumberUtilsTest.testLANG992(NumberUtilsTest.java:1255)

testLang300(org.apache.commons.lang3.math.NumberUtilsTest)  Time elapsed: 0 sec  <<< ERROR!
java.lang.NumberFormatException: -1l is not a valid number.
	at org.apache.commons.lang3.math.NumberUtils.createNumber(NumberUtils.java:542)
	at org.apache.commons.lang3.math.NumberUtilsTest.testLang300(NumberUtilsTest.java:1351)

testIsParsable(org.apache.commons.lang3.math.NumberUtilsTest)  Time elapsed: 0 sec  <<< ERROR!
java.lang.NullPointerException: null
	at org.apache.commons.lang3.StringUtils.isEmpty(StringUtils.java:25)
	at org.apache.commons.lang3.StringUtils.replace(StringUtils.java:596)
	at org.apache.commons.lang3.StringUtils.replaceOnce(StringUtils.java:592)
	at org.apache.commons.lang3.math.NumberUtils.isParsable(NumberUtils.java:1522)
	at org.apache.commons.lang3.math.NumberUtilsTest.testIsParsable(NumberUtilsTest.java:1276)

testIsDigits(org.apache.commons.lang3.math.NumberUtilsTest)  Time elapsed: 0 sec  <<< ERROR!
java.lang.NullPointerException: null
	at org.apache.commons.lang3.StringUtils.isEmpty(StringUtils.java:25)
	at org.apache.commons.lang3.math.NumberUtils.isDigits(NumberUtils.java:1352)
	at org.apache.commons.lang3.math.NumberUtilsTest.testIsDigits(NumberUtilsTest.java:1178)

testIsNumber(org.apache.commons.lang3.math.NumberUtilsTest)  Time elapsed: 0 sec  <<< FAILURE!
java.lang.AssertionError: Expecting true for isNumber/createNumber using "12345" but got false and true
	at org.junit.Assert.fail(Assert.java:88)
	at org.apache.commons.lang3.math.NumberUtilsTest.compareIsNumberWithCreateNumber(NumberUtilsTest.java:1271)
	at org.apache.commons.lang3.math.NumberUtilsTest.testIsNumber(NumberUtilsTest.java:1192)

Running org.apache.commons.lang3.math.IEEE754rUtilsTest
Tests run: 3, Failures: 0, Errors: 0, Skipped: 0, Time elapsed: 0 sec - in org.apache.commons.lang3.math.IEEE754rUtilsTest
Running org.apache.commons.lang3.math.FractionTest
Tests run: 25, Failures: 0, Errors: 0, Skipped: 0, Time elapsed: 0.108 sec - in org.apache.commons.lang3.math.FractionTest
Running org.apache.commons.lang3.BooleanUtilsTest
Tests run: 72, Failures: 0, Errors: 0, Skipped: 0, Time elapsed: 0.016 sec - in org.apache.commons.lang3.BooleanUtilsTest
Running org.apache.commons.lang3.CharSequenceUtilsTest
Tests run: 2, Failures: 0, Errors: 0, Skipped: 0, Time elapsed: 0 sec - in org.apache.commons.lang3.CharSequenceUtilsTest
Running org.apache.commons.lang3.CharSetUtilsTest
Tests run: 11, Failures: 0, Errors: 10, Skipped: 0, Time elapsed: 0.001 sec <<< FAILURE! - in org.apache.commons.lang3.CharSetUtilsTest
testSqueeze_StringString(org.apache.commons.lang3.CharSetUtilsTest)  Time elapsed: 0.001 sec  <<< ERROR!
java.lang.NullPointerException: null
	at org.apache.commons.lang3.StringUtils.isEmpty(StringUtils.java:25)
	at org.apache.commons.lang3.CharSetUtils.squeeze(CharSetUtils.java:65)
	at org.apache.commons.lang3.CharSetUtilsTest.testSqueeze_StringString(CharSetUtilsTest.java:50)

testDelete_StringString(org.apache.commons.lang3.CharSetUtilsTest)  Time elapsed: 0 sec  <<< ERROR!
java.lang.NullPointerException: null
	at org.apache.commons.lang3.StringUtils.isEmpty(StringUtils.java:25)
	at org.apache.commons.lang3.CharSetUtils.delete(CharSetUtils.java:206)
	at org.apache.commons.lang3.CharSetUtilsTest.testDelete_StringString(CharSetUtilsTest.java:214)

testKeep_StringString(org.apache.commons.lang3.CharSetUtilsTest)  Time elapsed: 0 sec  <<< ERROR!
java.lang.NullPointerException: null
	at org.apache.commons.lang3.StringUtils.isEmpty(StringUtils.java:25)
	at org.apache.commons.lang3.StringUtils.isNotEmpty(StringUtils.java:26)
	at org.apache.commons.lang3.CharSetUtils.deepEmpty(CharSetUtils.java:244)
	at org.apache.commons.lang3.CharSetUtils.keep(CharSetUtils.java:179)
	at org.apache.commons.lang3.CharSetUtilsTest.testKeep_StringString(CharSetUtilsTest.java:178)

testDelete_StringStringarray(org.apache.commons.lang3.CharSetUtilsTest)  Time elapsed: 0 sec  <<< ERROR!
java.lang.NullPointerException: null
	at org.apache.commons.lang3.StringUtils.isEmpty(StringUtils.java:25)
	at org.apache.commons.lang3.CharSetUtils.delete(CharSetUtils.java:206)
	at org.apache.commons.lang3.CharSetUtilsTest.testDelete_StringStringarray(CharSetUtilsTest.java:230)

testCount_StringStringarray(org.apache.commons.lang3.CharSetUtilsTest)  Time elapsed: 0 sec  <<< ERROR!
java.lang.NullPointerException: null
	at org.apache.commons.lang3.StringUtils.isEmpty(StringUtils.java:25)
	at org.apache.commons.lang3.CharSetUtils.count(CharSetUtils.java:141)
	at org.apache.commons.lang3.CharSetUtilsTest.testCount_StringStringarray(CharSetUtilsTest.java:146)

testContainsAny_StringString(org.apache.commons.lang3.CharSetUtilsTest)  Time elapsed: 0 sec  <<< ERROR!
java.lang.NullPointerException: null
	at org.apache.commons.lang3.StringUtils.isEmpty(StringUtils.java:25)
	at org.apache.commons.lang3.CharSetUtils.containsAny(CharSetUtils.java:108)
	at org.apache.commons.lang3.CharSetUtilsTest.testContainsAny_StringString(CharSetUtilsTest.java:91)

testKeep_StringStringarray(org.apache.commons.lang3.CharSetUtilsTest)  Time elapsed: 0 sec  <<< ERROR!
java.lang.NullPointerException: null
	at org.apache.commons.lang3.StringUtils.isEmpty(StringUtils.java:25)
	at org.apache.commons.lang3.StringUtils.isNotEmpty(StringUtils.java:26)
	at org.apache.commons.lang3.CharSetUtils.deepEmpty(CharSetUtils.java:244)
	at org.apache.commons.lang3.CharSetUtils.keep(CharSetUtils.java:179)
	at org.apache.commons.lang3.CharSetUtilsTest.testKeep_StringStringarray(CharSetUtilsTest.java:200)

testCount_StringString(org.apache.commons.lang3.CharSetUtilsTest)  Time elapsed: 0 sec  <<< ERROR!
java.lang.NullPointerException: null
	at org.apache.commons.lang3.StringUtils.isEmpty(StringUtils.java:25)
	at org.apache.commons.lang3.CharSetUtils.count(CharSetUtils.java:141)
	at org.apache.commons.lang3.CharSetUtilsTest.testCount_StringString(CharSetUtilsTest.java:131)

testContainsAny_StringStringarray(org.apache.commons.lang3.CharSetUtilsTest)  Time elapsed: 0 sec  <<< ERROR!
java.lang.NullPointerException: null
	at org.apache.commons.lang3.StringUtils.isEmpty(StringUtils.java:25)
	at org.apache.commons.lang3.CharSetUtils.containsAny(CharSetUtils.java:108)
	at org.apache.commons.lang3.CharSetUtilsTest.testContainsAny_StringStringarray(CharSetUtilsTest.java:106)

testSqueeze_StringStringarray(org.apache.commons.lang3.CharSetUtilsTest)  Time elapsed: 0 sec  <<< ERROR!
java.lang.NullPointerException: null
	at org.apache.commons.lang3.StringUtils.isEmpty(StringUtils.java:25)
	at org.apache.commons.lang3.CharSetUtils.squeeze(CharSetUtils.java:65)
	at org.apache.commons.lang3.CharSetUtilsTest.testSqueeze_StringStringarray(CharSetUtilsTest.java:67)

Running org.apache.commons.lang3.ArrayUtilsAddTest
Tests run: 13, Failures: 0, Errors: 0, Skipped: 0, Time elapsed: 0.001 sec - in org.apache.commons.lang3.ArrayUtilsAddTest
Running org.apache.commons.lang3.CharEncodingTest
Tests run: 6, Failures: 0, Errors: 0, Skipped: 0, Time elapsed: 0.018 sec - in org.apache.commons.lang3.CharEncodingTest
Running org.apache.commons.lang3.ClassUtilsTest
Tests run: 57, Failures: 14, Errors: 1, Skipped: 0, Time elapsed: 0.029 sec <<< FAILURE! - in org.apache.commons.lang3.ClassUtilsTest
test_getShortClassName_Class(org.apache.commons.lang3.ClassUtilsTest)  Time elapsed: 0 sec  <<< FAILURE!
org.junit.ComparisonFailure: expected:<[ClassUtils]> but was:<[]>
	at org.junit.Assert.assertEquals(Assert.java:115)
	at org.junit.Assert.assertEquals(Assert.java:144)
	at org.apache.commons.lang3.ClassUtilsTest.test_getShortClassName_Class(ClassUtilsTest.java:88)

test_getPackageCanonicalName_Object(org.apache.commons.lang3.ClassUtilsTest)  Time elapsed: 0.001 sec  <<< FAILURE!
org.junit.ComparisonFailure: expected:<[org.apache.commons.lang3]> but was:<[]>
	at org.junit.Assert.assertEquals(Assert.java:115)
	at org.junit.Assert.assertEquals(Assert.java:144)
	at org.apache.commons.lang3.ClassUtilsTest.test_getPackageCanonicalName_Object(ClassUtilsTest.java:1207)

test_getPackageCanonicalName_String(org.apache.commons.lang3.ClassUtilsTest)  Time elapsed: 0 sec  <<< FAILURE!
org.junit.ComparisonFailure: expected:<[org.apache.commons.lang3]> but was:<[]>
	at org.junit.Assert.assertEquals(Assert.java:115)
	at org.junit.Assert.assertEquals(Assert.java:144)
	at org.apache.commons.lang3.ClassUtilsTest.test_getPackageCanonicalName_String(ClassUtilsTest.java:1237)

test_getPackageCanonicalName_Class(org.apache.commons.lang3.ClassUtilsTest)  Time elapsed: 0 sec  <<< FAILURE!
org.junit.ComparisonFailure: expected:<[org.apache.commons.lang3]> but was:<[]>
	at org.junit.Assert.assertEquals(Assert.java:115)
	at org.junit.Assert.assertEquals(Assert.java:144)
	at org.apache.commons.lang3.ClassUtilsTest.test_getPackageCanonicalName_Class(ClassUtilsTest.java:1222)

test_getShortClassName_Object(org.apache.commons.lang3.ClassUtilsTest)  Time elapsed: 0.001 sec  <<< FAILURE!
org.junit.ComparisonFailure: expected:<[ClassUtils]> but was:<[]>
	at org.junit.Assert.assertEquals(Assert.java:115)
	at org.junit.Assert.assertEquals(Assert.java:144)
	at org.apache.commons.lang3.ClassUtilsTest.test_getShortClassName_Object(ClassUtilsTest.java:74)

test_getShortClassName_String(org.apache.commons.lang3.ClassUtilsTest)  Time elapsed: 0 sec  <<< FAILURE!
org.junit.ComparisonFailure: expected:<[ClassUtils]> but was:<[]>
	at org.junit.Assert.assertEquals(Assert.java:115)
	at org.junit.Assert.assertEquals(Assert.java:144)
	at org.apache.commons.lang3.ClassUtilsTest.test_getShortClassName_String(ClassUtilsTest.java:132)

test_getAbbreviatedName_String(org.apache.commons.lang3.ClassUtilsTest)  Time elapsed: 0 sec  <<< FAILURE!
org.junit.ComparisonFailure: expected:<[j.l.]String> but was:<[]String>
	at org.junit.Assert.assertEquals(Assert.java:115)
	at org.junit.Assert.assertEquals(Assert.java:144)
	at org.apache.commons.lang3.ClassUtilsTest.test_getAbbreviatedName_String(ClassUtilsTest.java:259)

test_getPackageName_Object(org.apache.commons.lang3.ClassUtilsTest)  Time elapsed: 0.001 sec  <<< FAILURE!
org.junit.ComparisonFailure: expected:<[org.apache.commons.lang3]> but was:<[]>
	at org.junit.Assert.assertEquals(Assert.java:115)
	at org.junit.Assert.assertEquals(Assert.java:144)
	at org.apache.commons.lang3.ClassUtilsTest.test_getPackageName_Object(ClassUtilsTest.java:190)

test_getAbbreviatedName_Class(org.apache.commons.lang3.ClassUtilsTest)  Time elapsed: 0 sec  <<< FAILURE!
org.junit.ComparisonFailure: expected:<[j.l.]String> but was:<[]String>
	at org.junit.Assert.assertEquals(Assert.java:115)
	at org.junit.Assert.assertEquals(Assert.java:144)
	at org.apache.commons.lang3.ClassUtilsTest.test_getAbbreviatedName_Class(ClassUtilsTest.java:238)

test_getPackageName_String(org.apache.commons.lang3.ClassUtilsTest)  Time elapsed: 0 sec  <<< FAILURE!
org.junit.ComparisonFailure: expected:<[org.apache.commons.lang3]> but was:<[]>
	at org.junit.Assert.assertEquals(Assert.java:115)
	at org.junit.Assert.assertEquals(Assert.java:144)
	at org.apache.commons.lang3.ClassUtilsTest.test_getPackageName_String(ClassUtilsTest.java:228)

testWithInterleavingWhitespace(org.apache.commons.lang3.ClassUtilsTest)  Time elapsed: 0 sec  <<< ERROR!
java.lang.ClassNotFoundException:  int [ ] 
	at java.lang.Class.forName0(Native Method)
	at java.lang.Class.forName(Class.java:274)
	at org.apache.commons.lang3.ClassUtils.getClass(ClassUtils.java:909)
	at org.apache.commons.lang3.ClassUtils.getClass(ClassUtils.java:975)
	at org.apache.commons.lang3.ClassUtils.getClass(ClassUtils.java:958)
	at org.apache.commons.lang3.ClassUtilsTest.testWithInterleavingWhitespace(ClassUtilsTest.java:999)

test_getPackageName_Class(org.apache.commons.lang3.ClassUtilsTest)  Time elapsed: 0 sec  <<< FAILURE!
org.junit.ComparisonFailure: expected:<[java.lang]> but was:<[]>
	at org.junit.Assert.assertEquals(Assert.java:115)
	at org.junit.Assert.assertEquals(Assert.java:144)
	at org.apache.commons.lang3.ClassUtilsTest.test_getPackageName_Class(ClassUtilsTest.java:197)

test_getShortCanonicalName_Object(org.apache.commons.lang3.ClassUtilsTest)  Time elapsed: 0 sec  <<< FAILURE!
org.junit.ComparisonFailure: expected:<[ClassUtils]> but was:<[]>
	at org.junit.Assert.assertEquals(Assert.java:115)
	at org.junit.Assert.assertEquals(Assert.java:144)
	at org.apache.commons.lang3.ClassUtilsTest.test_getShortCanonicalName_Object(ClassUtilsTest.java:1158)

test_getShortCanonicalName_String(org.apache.commons.lang3.ClassUtilsTest)  Time elapsed: 0.001 sec  <<< FAILURE!
org.junit.ComparisonFailure: expected:<[ClassUtils]> but was:<[]>
	at org.junit.Assert.assertEquals(Assert.java:115)
	at org.junit.Assert.assertEquals(Assert.java:144)
	at org.apache.commons.lang3.ClassUtilsTest.test_getShortCanonicalName_String(ClassUtilsTest.java:1188)

test_getShortCanonicalName_Class(org.apache.commons.lang3.ClassUtilsTest)  Time elapsed: 0 sec  <<< FAILURE!
org.junit.ComparisonFailure: expected:<[ClassUtils]> but was:<[]>
	at org.junit.Assert.assertEquals(Assert.java:115)
	at org.junit.Assert.assertEquals(Assert.java:144)
	at org.apache.commons.lang3.ClassUtilsTest.test_getShortCanonicalName_Class(ClassUtilsTest.java:1173)

Running org.apache.commons.lang3.RangeTest
Tests run: 24, Failures: 0, Errors: 0, Skipped: 0, Time elapsed: 0.008 sec - in org.apache.commons.lang3.RangeTest
Running org.apache.commons.lang3.event.EventUtilsTest
Tests run: 8, Failures: 0, Errors: 0, Skipped: 0, Time elapsed: 0.015 sec - in org.apache.commons.lang3.event.EventUtilsTest
Running org.apache.commons.lang3.event.EventListenerSupportTest
Tests run: 9, Failures: 0, Errors: 0, Skipped: 0, Time elapsed: 0.021 sec - in org.apache.commons.lang3.event.EventListenerSupportTest
Running org.apache.commons.lang3.ArrayUtilsTest
Tests run: 205, Failures: 0, Errors: 0, Skipped: 0, Time elapsed: 0.051 sec - in org.apache.commons.lang3.ArrayUtilsTest
Running org.apache.commons.lang3.CharUtilsTest
Tests run: 24, Failures: 2, Errors: 2, Skipped: 0, Time elapsed: 0.001 sec <<< FAILURE! - in org.apache.commons.lang3.CharUtilsTest
testToChar_String(org.apache.commons.lang3.CharUtilsTest)  Time elapsed: 0 sec  <<< ERROR!
java.lang.IllegalArgumentException: The String must not be empty
	at org.apache.commons.lang3.CharUtils.toChar(CharUtils.java:176)
	at org.apache.commons.lang3.CharUtilsTest.testToChar_String(CharUtilsTest.java:101)

testToChar_String_char(org.apache.commons.lang3.CharUtilsTest)  Time elapsed: 0 sec  <<< FAILURE!
java.lang.AssertionError: expected:<65> but was:<88>
	at org.junit.Assert.fail(Assert.java:88)
	at org.junit.Assert.failNotEquals(Assert.java:834)
	at org.junit.Assert.assertEquals(Assert.java:645)
	at org.junit.Assert.assertEquals(Assert.java:631)
	at org.apache.commons.lang3.CharUtilsTest.testToChar_String_char(CharUtilsTest.java:113)

testToCharacterObject_String(org.apache.commons.lang3.CharUtilsTest)  Time elapsed: 0 sec  <<< ERROR!
java.lang.NullPointerException: null
	at org.apache.commons.lang3.StringUtils.isEmpty(StringUtils.java:25)
	at org.apache.commons.lang3.CharUtils.toCharacterObject(CharUtils.java:111)
	at org.apache.commons.lang3.CharUtilsTest.testToCharacterObject_String(CharUtilsTest.java:76)

testToCharacterObject_char(org.apache.commons.lang3.CharUtilsTest)  Time elapsed: 0 sec  <<< FAILURE!
java.lang.AssertionError: expected same:<null> was not:<a>
	at org.junit.Assert.fail(Assert.java:88)
	at org.junit.Assert.failNotSame(Assert.java:828)
	at org.junit.Assert.assertSame(Assert.java:771)
	at org.junit.Assert.assertSame(Assert.java:782)
	at org.apache.commons.lang3.CharUtilsTest.testToCharacterObject_char(CharUtilsTest.java:71)

Running org.apache.commons.lang3.NotImplementedExceptionTest
Tests run: 1, Failures: 0, Errors: 0, Skipped: 0, Time elapsed: 0.001 sec - in org.apache.commons.lang3.NotImplementedExceptionTest
Running org.apache.commons.lang3.StringUtilsEqualsIndexOfTest
Tests run: 50, Failures: 11, Errors: 12, Skipped: 0, Time elapsed: 0.002 sec <<< FAILURE! - in org.apache.commons.lang3.StringUtilsEqualsIndexOfTest
testContainsAny_StringCharArrayWithSupplementaryChars(org.apache.commons.lang3.StringUtilsEqualsIndexOfTest)  Time elapsed: 0 sec  <<< FAILURE!
java.lang.AssertionError: null
	at org.junit.Assert.fail(Assert.java:86)
	at org.junit.Assert.assertTrue(Assert.java:41)
	at org.junit.Assert.assertTrue(Assert.java:52)
	at org.apache.commons.lang3.StringUtilsEqualsIndexOfTest.testContainsAny_StringCharArrayWithSupplementaryChars(StringUtilsEqualsIndexOfTest.java:154)

testContainsOnly_String(org.apache.commons.lang3.StringUtilsEqualsIndexOfTest)  Time elapsed: 0 sec  <<< FAILURE!
java.lang.AssertionError: null
	at org.junit.Assert.fail(Assert.java:86)
	at org.junit.Assert.assertTrue(Assert.java:41)
	at org.junit.Assert.assertFalse(Assert.java:64)
	at org.junit.Assert.assertFalse(Assert.java:74)
	at org.apache.commons.lang3.StringUtilsEqualsIndexOfTest.testContainsOnly_String(StringUtilsEqualsIndexOfTest.java:457)

testContainsAny_StringCharArrayWithBadSupplementaryChars(org.apache.commons.lang3.StringUtilsEqualsIndexOfTest)  Time elapsed: 0 sec  <<< FAILURE!
java.lang.AssertionError: null
	at org.junit.Assert.fail(Assert.java:86)
	at org.junit.Assert.assertTrue(Assert.java:41)
	at org.junit.Assert.assertTrue(Assert.java:52)
	at org.apache.commons.lang3.StringUtilsEqualsIndexOfTest.testContainsAny_StringCharArrayWithBadSupplementaryChars(StringUtilsEqualsIndexOfTest.java:146)

testIndexOfAnyBut_StringStringWithSupplementaryChars(org.apache.commons.lang3.StringUtilsEqualsIndexOfTest)  Time elapsed: 0 sec  <<< FAILURE!
java.lang.AssertionError: expected:<2> but was:<-1>
	at org.junit.Assert.fail(Assert.java:88)
	at org.junit.Assert.failNotEquals(Assert.java:834)
	at org.junit.Assert.assertEquals(Assert.java:645)
	at org.junit.Assert.assertEquals(Assert.java:631)
	at org.apache.commons.lang3.StringUtilsEqualsIndexOfTest.testIndexOfAnyBut_StringStringWithSupplementaryChars(StringUtilsEqualsIndexOfTest.java:766)

testContainsAny_StringWithBadSupplementaryChars(org.apache.commons.lang3.StringUtilsEqualsIndexOfTest)  Time elapsed: 0.001 sec  <<< FAILURE!
java.lang.AssertionError: null
	at org.junit.Assert.fail(Assert.java:86)
	at org.junit.Assert.assertTrue(Assert.java:41)
	at org.junit.Assert.assertTrue(Assert.java:52)
	at org.apache.commons.lang3.StringUtilsEqualsIndexOfTest.testContainsAny_StringWithBadSupplementaryChars(StringUtilsEqualsIndexOfTest.java:197)

testIndexOfAny_StringString(org.apache.commons.lang3.StringUtilsEqualsIndexOfTest)  Time elapsed: 0 sec  <<< ERROR!
java.lang.NullPointerException: null
	at org.apache.commons.lang3.StringUtils.isEmpty(StringUtils.java:25)
	at org.apache.commons.lang3.StringUtils.indexOfAny(StringUtils.java:165)
	at org.apache.commons.lang3.StringUtilsEqualsIndexOfTest.testIndexOfAny_StringString(StringUtilsEqualsIndexOfTest.java:676)

testIndexOfAnyBut_StringString(org.apache.commons.lang3.StringUtilsEqualsIndexOfTest)  Time elapsed: 0 sec  <<< ERROR!
java.lang.NullPointerException: null
	at org.apache.commons.lang3.StringUtils.isEmpty(StringUtils.java:25)
	at org.apache.commons.lang3.StringUtils.indexOfAnyBut(StringUtils.java:200)
	at org.apache.commons.lang3.StringUtilsEqualsIndexOfTest.testIndexOfAnyBut_StringString(StringUtilsEqualsIndexOfTest.java:749)

testContains_Char(org.apache.commons.lang3.StringUtilsEqualsIndexOfTest)  Time elapsed: 0 sec  <<< ERROR!
java.lang.NullPointerException: null
	at org.apache.commons.lang3.StringUtils.isEmpty(StringUtils.java:25)
	at org.apache.commons.lang3.StringUtils.contains(StringUtils.java:135)
	at org.apache.commons.lang3.StringUtilsEqualsIndexOfTest.testContains_Char(StringUtilsEqualsIndexOfTest.java:66)

testIndexOf_char(org.apache.commons.lang3.StringUtilsEqualsIndexOfTest)  Time elapsed: 0 sec  <<< ERROR!
java.lang.NullPointerException: null
	at org.apache.commons.lang3.StringUtils.isEmpty(StringUtils.java:25)
	at org.apache.commons.lang3.StringUtils.indexOf(StringUtils.java:87)
	at org.apache.commons.lang3.StringUtilsEqualsIndexOfTest.testIndexOf_char(StringUtilsEqualsIndexOfTest.java:578)

testIndexOfAny_StringCharArrayWithSupplementaryChars(org.apache.commons.lang3.StringUtilsEqualsIndexOfTest)  Time elapsed: 0 sec  <<< FAILURE!
java.lang.AssertionError: expected:<0> but was:<-1>
	at org.junit.Assert.fail(Assert.java:88)
	at org.junit.Assert.failNotEquals(Assert.java:834)
	at org.junit.Assert.assertEquals(Assert.java:645)
	at org.junit.Assert.assertEquals(Assert.java:631)
	at org.apache.commons.lang3.StringUtilsEqualsIndexOfTest.testIndexOfAny_StringCharArrayWithSupplementaryChars(StringUtilsEqualsIndexOfTest.java:668)

testIndexOf_charInt(org.apache.commons.lang3.StringUtilsEqualsIndexOfTest)  Time elapsed: 0 sec  <<< ERROR!
java.lang.NullPointerException: null
	at org.apache.commons.lang3.StringUtils.isEmpty(StringUtils.java:25)
	at org.apache.commons.lang3.StringUtils.indexOf(StringUtils.java:89)
	at org.apache.commons.lang3.StringUtilsEqualsIndexOfTest.testIndexOf_charInt(StringUtilsEqualsIndexOfTest.java:588)

testContainsAny_StringString(org.apache.commons.lang3.StringUtilsEqualsIndexOfTest)  Time elapsed: 0 sec  <<< ERROR!
java.lang.NullPointerException: null
	at org.apache.commons.lang3.StringUtils.isEmpty(StringUtils.java:25)
	at org.apache.commons.lang3.StringUtils.containsAny(StringUtils.java:167)
	at org.apache.commons.lang3.StringUtils.containsAny(StringUtils.java:182)
	at org.apache.commons.lang3.StringUtilsEqualsIndexOfTest.testContainsAny_StringString(StringUtilsEqualsIndexOfTest.java:172)

testIndexOfAnyBut_StringCharArrayWithSupplementaryChars(org.apache.commons.lang3.StringUtilsEqualsIndexOfTest)  Time elapsed: 0 sec  <<< FAILURE!
java.lang.AssertionError: expected:<2> but was:<-1>
	at org.junit.Assert.fail(Assert.java:88)
	at org.junit.Assert.failNotEquals(Assert.java:834)
	at org.junit.Assert.assertEquals(Assert.java:645)
	at org.junit.Assert.assertEquals(Assert.java:631)
	at org.apache.commons.lang3.StringUtilsEqualsIndexOfTest.testIndexOfAnyBut_StringCharArrayWithSupplementaryChars(StringUtilsEqualsIndexOfTest.java:741)

testLastIndexOf_charInt(org.apache.commons.lang3.StringUtilsEqualsIndexOfTest)  Time elapsed: 0 sec  <<< ERROR!
java.lang.NullPointerException: null
	at org.apache.commons.lang3.StringUtils.isEmpty(StringUtils.java:25)
	at org.apache.commons.lang3.StringUtils.lastIndexOf(StringUtils.java:118)
	at org.apache.commons.lang3.StringUtilsEqualsIndexOfTest.testLastIndexOf_charInt(StringUtilsEqualsIndexOfTest.java:817)

testIndexOfAnyBut_StringCharArray(org.apache.commons.lang3.StringUtilsEqualsIndexOfTest)  Time elapsed: 0 sec  <<< ERROR!
java.lang.NullPointerException: null
	at org.apache.commons.lang3.StringUtils.isEmpty(StringUtils.java:25)
	at org.apache.commons.lang3.StringUtils.indexOfAnyBut(StringUtils.java:186)
	at org.apache.commons.lang3.StringUtilsEqualsIndexOfTest.testIndexOfAnyBut_StringCharArray(StringUtilsEqualsIndexOfTest.java:722)

testContainsAny_StringWithSupplementaryChars(org.apache.commons.lang3.StringUtilsEqualsIndexOfTest)  Time elapsed: 0 sec  <<< FAILURE!
java.lang.AssertionError: null
	at org.junit.Assert.fail(Assert.java:86)
	at org.junit.Assert.assertTrue(Assert.java:41)
	at org.junit.Assert.assertTrue(Assert.java:52)
	at org.apache.commons.lang3.StringUtilsEqualsIndexOfTest.testContainsAny_StringWithSupplementaryChars(StringUtilsEqualsIndexOfTest.java:205)

testLastIndexOf_char(org.apache.commons.lang3.StringUtilsEqualsIndexOfTest)  Time elapsed: 0 sec  <<< ERROR!
java.lang.NullPointerException: null
	at org.apache.commons.lang3.StringUtils.isEmpty(StringUtils.java:25)
	at org.apache.commons.lang3.StringUtils.lastIndexOf(StringUtils.java:116)
	at org.apache.commons.lang3.StringUtilsEqualsIndexOfTest.testLastIndexOf_char(StringUtilsEqualsIndexOfTest.java:807)

testContainsOnly_CharArray(org.apache.commons.lang3.StringUtilsEqualsIndexOfTest)  Time elapsed: 0 sec  <<< FAILURE!
java.lang.AssertionError: null
	at org.junit.Assert.fail(Assert.java:86)
	at org.junit.Assert.assertTrue(Assert.java:41)
	at org.junit.Assert.assertFalse(Assert.java:64)
	at org.junit.Assert.assertFalse(Assert.java:74)
	at org.apache.commons.lang3.StringUtilsEqualsIndexOfTest.testContainsOnly_CharArray(StringUtilsEqualsIndexOfTest.java:432)

testContainsWhitespace(org.apache.commons.lang3.StringUtilsEqualsIndexOfTest)  Time elapsed: 0 sec  <<< FAILURE!
java.lang.AssertionError: null
	at org.junit.Assert.fail(Assert.java:86)
	at org.junit.Assert.assertTrue(Assert.java:41)
	at org.junit.Assert.assertTrue(Assert.java:52)
	at org.apache.commons.lang3.StringUtilsEqualsIndexOfTest.testContainsWhitespace(StringUtilsEqualsIndexOfTest.java:471)

testIndexOfAny_StringStringWithSupplementaryChars(org.apache.commons.lang3.StringUtilsEqualsIndexOfTest)  Time elapsed: 0 sec  <<< FAILURE!
java.lang.AssertionError: expected:<0> but was:<-1>
	at org.junit.Assert.fail(Assert.java:88)
	at org.junit.Assert.failNotEquals(Assert.java:834)
	at org.junit.Assert.assertEquals(Assert.java:645)
	at org.junit.Assert.assertEquals(Assert.java:631)
	at org.apache.commons.lang3.StringUtilsEqualsIndexOfTest.testIndexOfAny_StringStringWithSupplementaryChars(StringUtilsEqualsIndexOfTest.java:714)

testContainsAny_StringCharArray(org.apache.commons.lang3.StringUtilsEqualsIndexOfTest)  Time elapsed: 0 sec  <<< ERROR!
java.lang.NullPointerException: null
	at org.apache.commons.lang3.StringUtils.isEmpty(StringUtils.java:25)
	at org.apache.commons.lang3.StringUtils.containsAny(StringUtils.java:167)
	at org.apache.commons.lang3.StringUtilsEqualsIndexOfTest.testContainsAny_StringCharArray(StringUtilsEqualsIndexOfTest.java:119)

testContainsAny_StringStringArray(org.apache.commons.lang3.StringUtilsEqualsIndexOfTest)  Time elapsed: 0 sec  <<< ERROR!
java.lang.NullPointerException: null
	at org.apache.commons.lang3.StringUtils.isEmpty(StringUtils.java:25)
	at org.apache.commons.lang3.StringUtils.containsAny(StringUtils.java:183)
	at org.apache.commons.lang3.StringUtilsEqualsIndexOfTest.testContainsAny_StringStringArray(StringUtilsEqualsIndexOfTest.java:219)

testIndexOfAny_StringCharArray(org.apache.commons.lang3.StringUtilsEqualsIndexOfTest)  Time elapsed: 0 sec  <<< ERROR!
java.lang.NullPointerException: null
	at org.apache.commons.lang3.StringUtils.isEmpty(StringUtils.java:25)
	at org.apache.commons.lang3.StringUtils.indexOfAny(StringUtils.java:152)
	at org.apache.commons.lang3.StringUtilsEqualsIndexOfTest.testIndexOfAny_StringCharArray(StringUtilsEqualsIndexOfTest.java:648)

Running org.apache.commons.lang3.RandomUtilsTest
Tests run: 23, Failures: 0, Errors: 0, Skipped: 0, Time elapsed: 0 sec - in org.apache.commons.lang3.RandomUtilsTest

Results :

Failed tests: 
  CharUtilsTest.testToChar_String_char:113 expected:<65> but was:<88>
  CharUtilsTest.testToCharacterObject_char:71 expected same:<null> was not:<a>
  ClassUtilsTest.test_getAbbreviatedName_Class:238 expected:<[j.l.]String> but was:<[]String>
  ClassUtilsTest.test_getAbbreviatedName_String:259 expected:<[j.l.]String> but was:<[]String>
  ClassUtilsTest.test_getPackageCanonicalName_Class:1222 expected:<[org.apache.commons.lang3]> but was:<[]>
  ClassUtilsTest.test_getPackageCanonicalName_Object:1207 expected:<[org.apache.commons.lang3]> but was:<[]>
  ClassUtilsTest.test_getPackageCanonicalName_String:1237 expected:<[org.apache.commons.lang3]> but was:<[]>
  ClassUtilsTest.test_getPackageName_Class:197 expected:<[java.lang]> but was:<[]>
  ClassUtilsTest.test_getPackageName_Object:190 expected:<[org.apache.commons.lang3]> but was:<[]>
  ClassUtilsTest.test_getPackageName_String:228 expected:<[org.apache.commons.lang3]> but was:<[]>
  ClassUtilsTest.test_getShortCanonicalName_Class:1173 expected:<[ClassUtils]> but was:<[]>
  ClassUtilsTest.test_getShortCanonicalName_Object:1158 expected:<[ClassUtils]> but was:<[]>
  ClassUtilsTest.test_getShortCanonicalName_String:1188 expected:<[ClassUtils]> but was:<[]>
  ClassUtilsTest.test_getShortClassName_Class:88 expected:<[ClassUtils]> but was:<[]>
  ClassUtilsTest.test_getShortClassName_Object:74 expected:<[ClassUtils]> but was:<[]>
  ClassUtilsTest.test_getShortClassName_String:132 expected:<[ClassUtils]> but was:<[]>
  StringEscapeUtilsTest.testEscapeCsvString:446 expected:<"foo"["]bar"> but was:<"foo"[]bar">
  StringEscapeUtilsTest.testEscapeCsvWriter:458->checkCsvEscapeWriter:468 expected:<"foo"["]bar"> but was:<"foo"[]bar">
  StringEscapeUtilsTest.testUnescapeCsvString:477 expected:<[foo,bar]> but was:<["foo,bar"]>
  StringEscapeUtilsTest.testUnescapeCsvWriter:491->checkCsvUnescapeWriter:506 expected:<[foo,bar]> but was:<["foo,bar"]>
  StringUtilsEqualsIndexOfTest.testContainsAny_StringCharArrayWithBadSupplementaryChars:146 null
  StringUtilsEqualsIndexOfTest.testContainsAny_StringCharArrayWithSupplementaryChars:154 null
  StringUtilsEqualsIndexOfTest.testContainsAny_StringWithBadSupplementaryChars:197 null
  StringUtilsEqualsIndexOfTest.testContainsAny_StringWithSupplementaryChars:205 null
  StringUtilsEqualsIndexOfTest.testContainsOnly_CharArray:432 null
  StringUtilsEqualsIndexOfTest.testContainsOnly_String:457 null
  StringUtilsEqualsIndexOfTest.testContainsWhitespace:471 null
  StringUtilsEqualsIndexOfTest.testIndexOfAnyBut_StringCharArrayWithSupplementaryChars:741 expected:<2> but was:<-1>
  StringUtilsEqualsIndexOfTest.testIndexOfAnyBut_StringStringWithSupplementaryChars:766 expected:<2> but was:<-1>
  StringUtilsEqualsIndexOfTest.testIndexOfAny_StringCharArrayWithSupplementaryChars:668 expected:<0> but was:<-1>
  StringUtilsEqualsIndexOfTest.testIndexOfAny_StringStringWithSupplementaryChars:714 expected:<0> but was:<-1>
  StringUtilsSubstringTest.testSubstringAfterLast_StringString:199 expected:<[]baz> but was:<[fooXXbarXX]baz>
  StringUtilsSubstringTest.testSubstringAfter_StringString:155 expected:<[]barXXbaz> but was:<[fooXX]barXXbaz>
  StringUtilsSubstringTest.testSubstringBeforeLast_StringString:175 expected:<fooXXbar[]> but was:<fooXXbar[XXbaz]>
  StringUtilsSubstringTest.testSubstringBefore_StringString:135 expected:<foo[]> but was:<foo[XXbarXXbaz]>
  StringUtilsTest.testCenter_StringIntString:1609 expected:<[yayz]> but was:<[ a  ]>
  StringUtilsTest.testChomp:1421 chomp(String) failed expected:<foo[]> but was:<foo[
]>
  StringUtilsTest.testDefaultIfEmpty_CharBuffers:1715 expected:<[abc]> but was:<[NULL]>
  StringUtilsTest.testDefaultIfEmpty_StringBuffers:1694 expected:<[abc]> but was:<[NULL]>
  StringUtilsTest.testDefaultIfEmpty_StringBuilders:1673 expected:<[abc]> but was:<[NULL]>
  StringUtilsTest.testIsAllLowerCase:2072 null
  StringUtilsTest.testIsAllUpperCase:2089 null
  StringUtilsTest.testLeftPad_StringIntString:1519 expected:<[-+-+]abc> but was:<[    ]abc>
  StringUtilsTest.testRepeat_StringStringInt:1367 expected:<xx[]> but was:<xx[x]>
  StringUtilsTest.testRightPad_StringIntString:1483 expected:<abc[-+-+]> but was:<abc[    ]>
  StringUtilsTrimEmptyTest.testStripToEmpty_String:138 expected:<[]> but was:<[        ]>
  StringUtilsTrimEmptyTest.testStripToNull_String:127 expected:<null> but was:<        >
  StringUtilsTrimEmptyTest.testTrimToNull:88 expected:<foo> but was:<null>
  SystemUtilsTest.testOSMatchesNameAndVersion:393 null
  DefaultToStringStyleTest.testObject:75 expected:<....Integer@1e46128[a=<[Integer]>]> but was:<....Integer@1e46128[a=<[]>]>
  DiffResultTest.testToStringOutput:95 expected:<[DiffResultTest.EmptyClass[test=false] differs from DiffResultTest.EmptyClass][test=true]> but was:<[[test=false] differs from ][test=true]>
  MultiLineToStringStyleTest.testObject:76 expected:<...teger@1e46128[
  a=<[Integer]>
]> but was:<...teger@1e46128[
  a=<[]>
]>
  NoClassNameToStringStyleTest.testObject:74 expected:<[a=<[Integer]>]> but was:<[a=<[]>]>
  NoFieldNamesToStringStyleTest.testObject:75 expected:<...ng.Integer@1e46128[<[Integer]>]> but was:<...ng.Integer@1e46128[<[]>]>
  RecursiveToStringStyleTest.testObject:74 expected:<....Integer@1e46128[a=<[Integer]>]> but was:<....Integer@1e46128[a=<[]>]>
  ShortPrefixToStringStyleTest.testAppendSuper:58 expected:<[Integer][]> but was:<[][]>
  ShortPrefixToStringStyleTest.testBlank:53 expected:<[Integer][]> but was:<[][]>
  ShortPrefixToStringStyleTest.testLong:96 expected:<[Integer][3]> but was:<[][3]>
  ShortPrefixToStringStyleTest.testLongArray:114 expected:<[Integer][{1,2,-3,4}]> but was:<[][{1,2,-3,4}]>
  ShortPrefixToStringStyleTest.testLongArrayArray:124 expected:<[Integer][{{1,2},<null>,{5}}]> but was:<[][{{1,2},<null>,{5}}]>
  ShortPrefixToStringStyleTest.testObject:70 expected:<[Integer][<null>]> but was:<[][<null>]>
  ShortPrefixToStringStyleTest.testObjectArray:104 expected:<[Integer][{<null>,5,{3,6}}]> but was:<[][{<null>,5,{3,6}}]>
  ShortPrefixToStringStyleTest.testPerson:91 expected:<[ToStringStyleTest.Person][name=John Q. Public...> but was:<[][name=John Q. Public...>
  SimpleToStringStyleTest.testObject:74 expected:<<[Integer]>> but was:<<[]>>
  StandardToStringStyleTest.testAppendSuper:73 expected:<[Integer][]> but was:<[][]>
  StandardToStringStyleTest.testBlank:68 expected:<[Integer][]> but was:<[][]>
  StandardToStringStyleTest.testLong:111 expected:<[Integer][3]> but was:<[][3]>
  StandardToStringStyleTest.testLongArray:129 expected:<[Integer][[1, 2, -3, 4]]> but was:<[][[1, 2, -3, 4]]>
  StandardToStringStyleTest.testLongArrayArray:139 expected:<[Integer][[[1, 2], %NULL%, [5...> but was:<[][[[1, 2], %NULL%, [5...>
  StandardToStringStyleTest.testObject:85 expected:<[Integer][%NULL%]> but was:<[][%NULL%]>
  StandardToStringStyleTest.testObjectArray:119 expected:<[Integer][[%NULL%, 5, [3, 6]]...> but was:<[][[%NULL%, 5, [3, 6]]...>
  StandardToStringStyleTest.testPerson:106 expected:<[ToStringStyleTest.Person][name=Suzy Queue,age...> but was:<[][name=Suzy Queue,age...>
  ToStringBuilderTest.testObject:628 expected:<....Integer@1e46128[a=<[Integer]>]> but was:<....Integer@1e46128[a=<[]>]>
  ToStringBuilderTest.testObjectBuild:646 expected:<....Integer@1e46128[a=<[Integer]>]> but was:<....Integer@1e46128[a=<[]>]>
  ExceptionUtilsTest.test_getMessage_Throwable:466 expected:<[IllegalArgumentException]: Base> but was:<[]: Base>
  ExceptionUtilsTest.test_getRootCauseMessage_Throwable:478 expected:<[IllegalArgumentException]: Base> but was:<[]: Base>
  NumberUtilsTest.testIsNumber:1192->compareIsNumberWithCreateNumber:1271 Expecting true for isNumber/createNumber using "12345" but got false and true
  NumberUtilsTest.testLANG971:1249->compareIsNumberWithCreateNumber:1271 Expecting true for isNumber/createNumber using "07" but got false and true
  NumberUtilsTest.testLANG972:1261->compareIsNumberWithCreateNumber:1271 Expecting true for isNumber/createNumber using "0xABCD" but got false and true
  NumberUtilsTest.testLANG992:1255->compareIsNumberWithCreateNumber:1271 Expecting true for isNumber/createNumber using "0.0" but got false and true
  StrBuilderTest.testAsTokenizer:1666 expected:<2> but was:<0>
  StrBuilderTest.testContains_StrMatcher:1323 null
  StrBuilderTest.testReplaceAll_StrMatcher_String:889 expected:<b[-c-]> but was:<b[cbccb]>
  StrBuilderTest.testReplaceFirst_StrMatcher_String:923 expected:<b[-]ccba> but was:<b[cb]ccba>
  StrBuilderTest.testReplace_StrMatcher_String_int_int_int_VaryCount:1102 expected:<[-x--y-]> but was:<[aaxaaaayaa]>
  StrBuilderTest.testReplace_StrMatcher_String_int_int_int_VaryEndIndex:1052 expected:<[-]xaaaayaa> but was:<[aa]xaaaayaa>
  StrBuilderTest.testReplace_StrMatcher_String_int_int_int_VaryMatcher:949 expected:<xb[xcx]x> but was:<xb[cbccb]x>
  StrBuilderTest.testReplace_StrMatcher_String_int_int_int_VaryReplace:968 expected:<ab[-c-]a> but was:<ab[cbccb]a>
  StrBuilderTest.testReplace_StrMatcher_String_int_int_int_VaryStartIndex:987 expected:<[-x--y-]> but was:<[aaxaaaayaa]>
  StrMatcherTest.testCharSetMatcher_String:165 expected:<1> but was:<0>
  StrMatcherTest.testMatcherIndices:212 expected:<2> but was:<0>
  StrMatcherTest.testStringMatcher_String:196 expected:<2> but was:<0>
  StrSubstitutorTest.testConstructorMapFull:452 expected:<Hi [< commons]> but was:<Hi [!< <name>]>
  StrSubstitutorTest.testConstructorMapPrefixSuffix:441 expected:<Hi [< commons]> but was:<Hi [$< <name>]>
  StrSubstitutorTest.testCyclicReplacement:252 Cyclic replacement was not detected!
  StrSubstitutorTest.testDefaultValueDelimiters:374 expected:<The [fox jumps over the lazy dog. 1234567890].> but was:<The [${animal} jumps over the lazy ${target}. ${undefined.number:-1234567890}].>
  StrSubstitutorTest.testGetSetPrefix:475 null
  StrSubstitutorTest.testGetSetSuffix:507 null
  StrSubstitutorTest.testGetSetValueDelimiter:539 null
  StrSubstitutorTest.testReplaceAdjacentAtEnd:136 expected:<Amount is [GBP12.50]> but was:<Amount is [${code}${amount}]>
  StrSubstitutorTest.testReplaceAdjacentAtStart:125 expected:<[GBP12.50] charged> but was:<[${code}${amount}] charged>
  StrSubstitutorTest.testReplaceChangedMap:105 expected:<The [quick brown fox jumps over the moon].> but was:<The [${animal} jumps over the ${target}].>
  StrSubstitutorTest.testReplaceComplexEscaping:179->doTestReplace:634 expected:<The $[{quick brown fox} jumps over the lazy dog].> but was:<The $[${${animal}} jumps over the ${target}].>
  StrSubstitutorTest.testReplaceEmptyKeys:220->doTestReplace:634 expected:<... ${} jumps over the [lazy dog].> but was:<... ${} jumps over the [${target}].>
  StrSubstitutorTest.testReplaceEscaping:163->doTestReplace:634 expected:<The $[{animal} jumps over the lazy dog].> but was:<The $[${animal} jumps over the ${target}].>
  StrSubstitutorTest.testReplaceInVariable:311 Wrong result (1) expected:<The [mouse jumps over the lazy dog].> but was:<The [${animal.${species}} jumps over the ${target}].>
  StrSubstitutorTest.testReplaceInVariableDisabled:335 Wrong result (1) expected:<...es}} jumps over the [lazy dog].> but was:<...es}} jumps over the [${target}].>
  StrSubstitutorTest.testReplaceInVariableRecursive:357 Wrong result (1) expected:<The [white mouse jumps over the lazy dog].> but was:<The [${animal.${species.${color}}} jumps over the ${target}].>
  StrSubstitutorTest.testReplaceIncompletePrefix:196->doTestReplace:634 expected:<...mal} jumps over the [lazy dog].> but was:<...mal} jumps over the [${target}].>
  StrSubstitutorTest.testReplaceNoPrefixNoSuffix:188->doTestReplace:634 expected:<...imal jumps over the [lazy dog].> but was:<...imal jumps over the [${target}].>
  StrSubstitutorTest.testReplaceNoPrefixSuffix:212->doTestReplace:634 expected:<...mal} jumps over the [lazy dog].> but was:<...mal} jumps over the [${target}].>
  StrSubstitutorTest.testReplacePrefixNoSuffix:204->doTestReplace:634 expected:<... over the ${target} [lazy dog].> but was:<... over the ${target} [${target}].>
  StrSubstitutorTest.testReplaceRecursive:152->doTestReplace:634 expected:<The [quick brown fox jumps over the lazy dog].> but was:<The [${animal} jumps over the ${target}].>
  StrSubstitutorTest.testReplaceSimple:63->doTestReplace:634 expected:<The [quick brown fox jumps over the lazy dog].> but was:<The [${animal} jumps over the ${target}].>
  StrSubstitutorTest.testReplaceSolo:71->doTestReplace:634 expected:<[quick brown fox]> but was:<[${animal}]>
  StrSubstitutorTest.testReplaceSoloEscaping:171->doTestReplace:634 expected:<$[]{animal}> but was:<$[$]{animal}>
  StrSubstitutorTest.testReplaceToIdentical:231->doTestReplace:673 null
  StrSubstitutorTest.testReplaceUnknownKey:113->doTestReplace:634 expected:<...son} jumps over the [lazy dog].> but was:<...son} jumps over the [${target}].>
  StrSubstitutorTest.testResolveVariable:420 expected:<Hi [jakarta]!> but was:<Hi [${name}]!>
  StrSubstitutorTest.testSamePrefixAndSuffix:624 expected:<Hi [commons]!> but was:<Hi [@name@]!>
  StrSubstitutorTest.testStaticReplace:563 expected:<Hi [commons]!> but was:<Hi [${name}]!>
  StrSubstitutorTest.testStaticReplacePrefixSuffix:573 expected:<Hi [commons]!> but was:<Hi [<name>]!>
  StrSubstitutorTest.testStaticReplaceSystemProperties:587 expected:<Hi [perham, you are working with HAL-9000, your home directory is /home/perham].> but was:<Hi [${user.name}, you are working with ${os.name}, your home directory is ${user.home}].>
  StrSubstitutorTest.testSubstituteDefaultProperties:615 expected:<[It works!]> but was:<[${doesnotwork}]>
  StrTokenizerTest.test4:123 {} expected:<5> but was:<0>
  StrTokenizerTest.test5:147 token[0] was 'null' but was expected to be 'a' expected:<a> but was:<null>
  StrTokenizerTest.test8:223 {} expected:<5> but was:<0>
  StrTokenizerTest.testBasicEmpty2:317 expected:<a> but was:<null>
  StrTokenizerTest.testBasicIgnoreTrimmed1:451 expected:<a> but was:<null>
  StrTokenizerTest.testBasicIgnoreTrimmed2:465 expected:<a> but was:<null>
  StrTokenizerTest.testBasicIgnoreTrimmed3:478 expected:<a> but was:<null>
  StrTokenizerTest.testBasicIgnoreTrimmed4:492 expected:<a> but was:<null>
  StrTokenizerTest.testBasicQuoted2:340 expected:<a> but was:<null>
  StrTokenizerTest.testBasicQuoted3:352 expected:<a> but was:<null>
  StrTokenizerTest.testBasicQuoted4:364 expected:<a> but was:<null>
  StrTokenizerTest.testBasicQuoted5:377 expected:<a> but was:<null>
  StrTokenizerTest.testBasicQuotedTrimmed1:411 expected:<a> but was:<null>
  StrTokenizerTest.testBasicTrimmed1:424 expected:<a> but was:<null>
  StrTokenizerTest.testBasicTrimmed2:437 expected:<a> but was:<null>
  StrTokenizerTest.testCloneReset:612 expected:<a> but was:<null>
  StrTokenizerTest.testIteration:808 null
  StrTokenizerTest.testListArray:507 expected:<3> but was:<0>
  DurationFormatUtilsTest.testFormatDurationPluralWords:126 expected:<...s 0 minutes 1 second[]> but was:<...s 0 minutes 1 second[s]>
  DurationFormatUtilsTest.testFormatDurationWords:56 expected:<[]50 seconds> but was:<[0 days 0 hours 0 minutes ]50 seconds>

Tests in error: 
  CharSetUtilsTest.testContainsAny_StringString:91 » NullPointer
  CharSetUtilsTest.testContainsAny_StringStringarray:106 » NullPointer
  CharSetUtilsTest.testCount_StringString:131 » NullPointer
  CharSetUtilsTest.testCount_StringStringarray:146 » NullPointer
  CharSetUtilsTest.testDelete_StringString:214 » NullPointer
  CharSetUtilsTest.testDelete_StringStringarray:230 » NullPointer
  CharSetUtilsTest.testKeep_StringString:178 » NullPointer
  CharSetUtilsTest.testKeep_StringStringarray:200 » NullPointer
  CharSetUtilsTest.testSqueeze_StringString:50 » NullPointer
  CharSetUtilsTest.testSqueeze_StringStringarray:67 » NullPointer
  CharUtilsTest.testToChar_String:101 » IllegalArgument The String must not be e...
  CharUtilsTest.testToCharacterObject_String:76 » NullPointer
  ClassUtilsTest.testWithInterleavingWhitespace:999 » ClassNotFound  int [ ] 
  LocaleUtilsTest.testLang328:506->assertValidToLocale:118 » IllegalArgument Inv...
  LocaleUtilsTest.testParseAllLocales:580 » IllegalArgument Invalid locale forma...
  LocaleUtilsTest.testThreeCharsLocale:382 » IllegalArgument Invalid locale form...
  LocaleUtilsTest.testToLocale_1Part:132->assertValidToLocale:83 » IllegalArgument
  LocaleUtilsTest.testToLocale_2Part:174->assertValidToLocale:99 » IllegalArgument
  LocaleUtilsTest.testToLocale_3Part:209->assertValidToLocale:118 » IllegalArgument
  StringUtilsEqualsIndexOfTest.testContainsAny_StringCharArray:119 » NullPointer
  StringUtilsEqualsIndexOfTest.testContainsAny_StringString:172 » NullPointer
  StringUtilsEqualsIndexOfTest.testContainsAny_StringStringArray:219 » NullPointer
  StringUtilsEqualsIndexOfTest.testContains_Char:66 » NullPointer
  StringUtilsEqualsIndexOfTest.testIndexOfAnyBut_StringCharArray:722 » NullPointer
  StringUtilsEqualsIndexOfTest.testIndexOfAnyBut_StringString:749 » NullPointer
  StringUtilsEqualsIndexOfTest.testIndexOfAny_StringCharArray:648 » NullPointer
  StringUtilsEqualsIndexOfTest.testIndexOfAny_StringString:676 » NullPointer
  StringUtilsEqualsIndexOfTest.testIndexOf_char:578 » NullPointer
  StringUtilsEqualsIndexOfTest.testIndexOf_charInt:588 » NullPointer
  StringUtilsEqualsIndexOfTest.testLastIndexOf_char:807 » NullPointer
  StringUtilsEqualsIndexOfTest.testLastIndexOf_charInt:817 » NullPointer
  StringUtilsIsTest.testIsAlpha:35 » NullPointer
  StringUtilsIsTest.testIsAlphanumeric:50 » NullPointer
  StringUtilsIsTest.testIsNumeric:137 » NullPointer
  StringUtilsStartsEndsWithTest.testEndsWithAny:170 » NullPointer
  StringUtilsStartsEndsWithTest.testStartsWithAny:88 » NullPointer
  StringUtilsSubstringTest.testCountMatches_String:310 » NullPointer
  StringUtilsSubstringTest.testCountMatches_char:327 » NullPointer
  StringUtilsSubstringTest.testSubstringsBetween_StringStringString:253 NullPointer
  StringUtilsTest.testAbbreviateMiddle:1827 » NullPointer
  StringUtilsTest.testAppendIfMissing:2387 » NullPointer
  StringUtilsTest.testAppendIfMissingIgnoreCase:2411 » NullPointer
  StringUtilsTest.testDefaultIfEmpty_StringString:1649 » NullPointer
  StringUtilsTest.testDeleteWhitespace_String:1106 » NullPointer
  StringUtilsTest.testIsAnyEmpty:147 » NullPointer
  StringUtilsTest.testIsEmpty:129 » NullPointer
  StringUtilsTest.testIsNoneEmpty:159 » NullPointer
  StringUtilsTest.testIsNotEmpty:138 » NullPointer
  StringUtilsTest.testNormalizeSpace:2275 » NullPointer
  StringUtilsTest.testPrependIfMissing:2435 » NullPointer
  StringUtilsTest.testPrependIfMissingIgnoreCase:2459 » NullPointer
  StringUtilsTest.testRemoveEnd:2142 » NullPointer
  StringUtilsTest.testRemoveEndIgnoreCase:2162 » NullPointer
  StringUtilsTest.testRemoveStart:2101 » NullPointer
  StringUtilsTest.testRemoveStartIgnoreCase:2120 » NullPointer
  StringUtilsTest.testRemove_String:2186 » NullPointer
  StringUtilsTest.testRemove_char:2215 » NullPointer
  StringUtilsTest.testReplaceChars_StringStringString:1273 » NullPointer
  StringUtilsTest.testReplaceOnce_StringStringString:1184 » NullPointer
  StringUtilsTest.testReplace_StringStringString:1126 » NullPointer
  StringUtilsTest.testReplace_StringStringStringInt:1158 » NullPointer
  StringUtilsTest.testSwapCase_String:274 » NullPointer
  StringUtilsTest.testWrap_StringChar:2501 » NullPointer
  StringUtilsTest.testWrap_StringString:2518 » NullPointer
  StringUtilsTrimEmptyTest.testIsEmpty:38 » NullPointer
  StringUtilsTrimEmptyTest.testIsNotEmpty:47 » NullPointer
  StringUtilsTrimEmptyTest.testStripAll:252 » NullPointer
  StringUtilsTrimEmptyTest.testStrip_String:115 » NullPointer
  StringUtilsTrimEmptyTest.testStrip_StringString:148 » NullPointer
  SystemUtilsTest.testOsVersionMatches:408 » NullPointer
  NumberUtilsTest.testCreateNumber:206 » NumberFormat 12345L is not a valid numb...
  NumberUtilsTest.testIsDigits:1178 » NullPointer
  NumberUtilsTest.testIsParsable:1276 » NullPointer
  NumberUtilsTest.testLang300:1351 » NumberFormat -1l is not a valid number.
  StrTokenizerTest.testBasic1:235 » NoSuchElement
  StrTokenizerTest.testBasic2:245 » NoSuchElement
  StrTokenizerTest.testBasic3:255 » NoSuchElement
  StrTokenizerTest.testBasic4:265 » NoSuchElement
  StrTokenizerTest.testBasic5:275 » NoSuchElement
  StrTokenizerTest.testBasicDelim1:285 » NoSuchElement
  StrTokenizerTest.testBasicDelim2:295 » NoSuchElement
  StrTokenizerTest.testBasicQuoted1:328 » NoSuchElement
  StrTokenizerTest.testBasicQuoted6:388 » NoSuchElement
  StrTokenizerTest.testBasicQuoted7:398 » NoSuchElement
  StrTokenizerTest.testConstructor_String:627 » NoSuchElement
  StrTokenizerTest.testConstructor_String_char:643 » NoSuchElement
  StrTokenizerTest.testConstructor_String_char_char:660 » NoSuchElement
  StrTokenizerTest.testConstructor_charArray:675 » NoSuchElement
  StrTokenizerTest.testConstructor_charArray_char:691 » NoSuchElement
  StrTokenizerTest.testConstructor_charArray_char_char:708 » NoSuchElement
  StrTokenizerTest.testReset:723 » NoSuchElement
  StrTokenizerTest.testReset_String:740 » NoSuchElement
  StrTokenizerTest.testReset_charArray:755 » NoSuchElement
  StrTokenizerTest.testToString:876 » NoSuchElement
  StrTokenizerTest.testTokenizeSubclassInputChange:851 » NoSuchElement
  StrTokenizerTest.testTokenizeSubclassOutputChange:866 » NoSuchElement
  WordUtilsTest.testCapitalizeFullyWithDelimiters_String:208 » NullPointer
  WordUtilsTest.testCapitalizeFully_String:194 » NullPointer
  WordUtilsTest.testCapitalizeWithDelimiters_String:176 » NullPointer
  WordUtilsTest.testCapitalize_String:162 » NullPointer
  WordUtilsTest.testInitials_String:259 » NullPointer
  WordUtilsTest.testInitials_String_charArray:275 » NullPointer
  WordUtilsTest.testSwapCase_String:356 » NullPointer
  WordUtilsTest.testUncapitalizeWithDelimiters_String:240 » NullPointer
  WordUtilsTest.testUncapitalize_String:226 » NullPointer


Tests run: 3526, Failures: 144, Errors: 105, Skipped: 97

[INFO] ------------------------------------------------------------------------
[INFO] BUILD FAILURE
[INFO] ------------------------------------------------------------------------
[INFO] Total time: 35.594s
[INFO] Finished at: Tue Aug 04 00:46:37 BST 2015
[INFO] Final Memory: 27M/501M
[INFO] ------------------------------------------------------------------------
[ERROR] Failed to execute goal org.apache.maven.plugins:maven-surefire-plugin:2.18:test (default-test) on project commons-lang3: There are test failures.
[ERROR] 
[ERROR] Please refer to /home/perham/Study/LittleDarwin/Cases/commons-lang3-3.4-src/target/surefire-reports for the individual test results.
[ERROR] -> [Help 1]
[ERROR] 
[ERROR] To see the full stack trace of the errors, re-run Maven with the -e switch.
[ERROR] Re-run Maven using the -X switch to enable full debug logging.
[ERROR] 
[ERROR] For more information about the errors and possible solutions, please read the following articles:
[ERROR] [Help 1] http://cwiki.apache.org/confluence/display/MAVEN/MojoFailureException
