[INFO] Scanning for projects...
[INFO]                                                                         
[INFO] ------------------------------------------------------------------------
[INFO] Building Apache Commons Lang 3.4
[INFO] ------------------------------------------------------------------------
[INFO] 
[INFO] --- maven-enforcer-plugin:1.3.1:enforce (enforce-maven-3) @ commons-lang3 ---
[INFO] 
[INFO] --- build-helper-maven-plugin:1.8:parse-version (parse-version) @ commons-lang3 ---
[INFO] 
[INFO] --- maven-antrun-plugin:1.8:run (javadoc.resources) @ commons-lang3 ---
[INFO] Executing tasks

main:
[INFO] Executed tasks
[INFO] 
[INFO] --- maven-remote-resources-plugin:1.5:process (default) @ commons-lang3 ---
[INFO] 
[INFO] --- buildnumber-maven-plugin:1.3:create (default) @ commons-lang3 ---
[INFO] Executing: /bin/sh -c cd /home/perham/Study/LittleDarwin/Cases/commons-lang3-3.4-src && svn --non-interactive info
[INFO] Working directory: /home/perham/Study/LittleDarwin/Cases/commons-lang3-3.4-src
[INFO] Storing buildNumber: ?????? at timestamp: 1438645416949
[INFO] Executing: /bin/sh -c cd /home/perham/Study/LittleDarwin/Cases/commons-lang3-3.4-src && svn --non-interactive info
[INFO] Working directory: /home/perham/Study/LittleDarwin/Cases/commons-lang3-3.4-src
[INFO] Storing buildScmBranch: UNKNOWN_BRANCH
[INFO] 
[INFO] --- maven-resources-plugin:2.7:resources (default-resources) @ commons-lang3 ---
[INFO] Using 'ISO-8859-1' encoding to copy filtered resources.
[INFO] Copying 0 resource
[INFO] Copying 2 resources to META-INF
[INFO] 
[INFO] --- maven-compiler-plugin:3.2:compile (default-compile) @ commons-lang3 ---
[INFO] Changes detected - recompiling the module!
[INFO] Compiling 133 source files to /home/perham/Study/LittleDarwin/Cases/commons-lang3-3.4-src/target/classes
[INFO] /home/perham/Study/LittleDarwin/Cases/commons-lang3-3.4-src/src/main/java/org/apache/commons/lang3/SerializationUtils.java: /home/perham/Study/LittleDarwin/Cases/commons-lang3-3.4-src/src/main/java/org/apache/commons/lang3/SerializationUtils.java uses unchecked or unsafe operations.
[INFO] /home/perham/Study/LittleDarwin/Cases/commons-lang3-3.4-src/src/main/java/org/apache/commons/lang3/SerializationUtils.java: Recompile with -Xlint:unchecked for details.
[INFO] 
[INFO] --- maven-bundle-plugin:2.5.3:manifest (bundle-manifest) @ commons-lang3 ---
[INFO] 
[INFO] --- animal-sniffer-maven-plugin:1.13:check (checkAPIcompatibility) @ commons-lang3 ---
[INFO] Checking unresolved references to org.codehaus.mojo.signature:java16:1.0
[INFO] 
[INFO] --- maven-resources-plugin:2.7:testResources (default-testResources) @ commons-lang3 ---
[INFO] Using 'ISO-8859-1' encoding to copy filtered resources.
[INFO] Copying 2 resources
[INFO] Copying 2 resources to META-INF
[INFO] 
[INFO] --- maven-compiler-plugin:3.2:testCompile (default-testCompile) @ commons-lang3 ---
[INFO] Nothing to compile - all classes are up to date
[INFO] 
[INFO] --- maven-surefire-plugin:2.18:test (default-test) @ commons-lang3 ---
[INFO] Surefire report directory: /home/perham/Study/LittleDarwin/Cases/commons-lang3-3.4-src/target/surefire-reports

-------------------------------------------------------
 T E S T S
-------------------------------------------------------
Running org.apache.commons.lang3.ValidateTest
Tests run: 63, Failures: 0, Errors: 8, Skipped: 0, Time elapsed: 0.056 sec <<< FAILURE! - in org.apache.commons.lang3.ValidateTest
testNotBlankNotBlankStringWithNewlinesShouldNotThrow(org.apache.commons.lang3.ValidateTest)  Time elapsed: 0.005 sec  <<< ERROR!
java.lang.IllegalArgumentException: The validated character sequence is blank
	at org.apache.commons.lang3.Validate.notBlank(Validate.java:451)
	at org.apache.commons.lang3.Validate.notBlank(Validate.java:476)
	at org.apache.commons.lang3.ValidateTest.testNotBlankNotBlankStringWithNewlinesShouldNotThrow(ValidateTest.java:486)

testNotBlankReturnValues1(org.apache.commons.lang3.ValidateTest)  Time elapsed: 0.004 sec  <<< ERROR!
java.lang.IllegalArgumentException: The validated character sequence is blank
	at org.apache.commons.lang3.Validate.notBlank(Validate.java:451)
	at org.apache.commons.lang3.Validate.notBlank(Validate.java:476)
	at org.apache.commons.lang3.ValidateTest.testNotBlankReturnValues1(ValidateTest.java:531)

testNotBlankReturnValues2(org.apache.commons.lang3.ValidateTest)  Time elapsed: 0.001 sec  <<< ERROR!
java.lang.IllegalArgumentException: Message
	at org.apache.commons.lang3.Validate.notBlank(Validate.java:451)
	at org.apache.commons.lang3.ValidateTest.testNotBlankReturnValues2(ValidateTest.java:538)

testNotBlankMsgNotBlankStringWithWhitespacesShouldNotThrow(org.apache.commons.lang3.ValidateTest)  Time elapsed: 0 sec  <<< ERROR!
java.lang.IllegalArgumentException: Message
	at org.apache.commons.lang3.Validate.notBlank(Validate.java:451)
	at org.apache.commons.lang3.ValidateTest.testNotBlankMsgNotBlankStringWithWhitespacesShouldNotThrow(ValidateTest.java:510)

testNotBlankNotBlankStringShouldNotThrow(org.apache.commons.lang3.ValidateTest)  Time elapsed: 0 sec  <<< ERROR!
java.lang.IllegalArgumentException: The validated character sequence is blank
	at org.apache.commons.lang3.Validate.notBlank(Validate.java:451)
	at org.apache.commons.lang3.Validate.notBlank(Validate.java:476)
	at org.apache.commons.lang3.ValidateTest.testNotBlankNotBlankStringShouldNotThrow(ValidateTest.java:462)

testNotBlankMsgNotBlankStringShouldNotThrow(org.apache.commons.lang3.ValidateTest)  Time elapsed: 0 sec  <<< ERROR!
java.lang.IllegalArgumentException: Message
	at org.apache.commons.lang3.Validate.notBlank(Validate.java:451)
	at org.apache.commons.lang3.ValidateTest.testNotBlankMsgNotBlankStringShouldNotThrow(ValidateTest.java:498)

testNotBlankMsgNotBlankStringWithNewlinesShouldNotThrow(org.apache.commons.lang3.ValidateTest)  Time elapsed: 0 sec  <<< ERROR!
java.lang.IllegalArgumentException: Message
	at org.apache.commons.lang3.Validate.notBlank(Validate.java:451)
	at org.apache.commons.lang3.ValidateTest.testNotBlankMsgNotBlankStringWithNewlinesShouldNotThrow(ValidateTest.java:522)

testNotBlankNotBlankStringWithWhitespacesShouldNotThrow(org.apache.commons.lang3.ValidateTest)  Time elapsed: 0.001 sec  <<< ERROR!
java.lang.IllegalArgumentException: The validated character sequence is blank
	at org.apache.commons.lang3.Validate.notBlank(Validate.java:451)
	at org.apache.commons.lang3.Validate.notBlank(Validate.java:476)
	at org.apache.commons.lang3.ValidateTest.testNotBlankNotBlankStringWithWhitespacesShouldNotThrow(ValidateTest.java:474)

Running org.apache.commons.lang3.LocaleUtilsTest
Tests run: 15, Failures: 0, Errors: 0, Skipped: 0, Time elapsed: 0.028 sec - in org.apache.commons.lang3.LocaleUtilsTest
Running org.apache.commons.lang3.tuple.MutableTripleTest
Tests run: 8, Failures: 0, Errors: 0, Skipped: 0, Time elapsed: 0.026 sec - in org.apache.commons.lang3.tuple.MutableTripleTest
Running org.apache.commons.lang3.tuple.TripleTest
Tests run: 10, Failures: 0, Errors: 0, Skipped: 0, Time elapsed: 0.009 sec - in org.apache.commons.lang3.tuple.TripleTest
Running org.apache.commons.lang3.tuple.ImmutablePairTest
Tests run: 6, Failures: 0, Errors: 0, Skipped: 0, Time elapsed: 0.006 sec - in org.apache.commons.lang3.tuple.ImmutablePairTest
Running org.apache.commons.lang3.tuple.MutablePairTest
Tests run: 8, Failures: 0, Errors: 0, Skipped: 0, Time elapsed: 0.004 sec - in org.apache.commons.lang3.tuple.MutablePairTest
Running org.apache.commons.lang3.tuple.ImmutableTripleTest
Tests run: 6, Failures: 0, Errors: 0, Skipped: 0, Time elapsed: 0.001 sec - in org.apache.commons.lang3.tuple.ImmutableTripleTest
Running org.apache.commons.lang3.tuple.PairTest
Tests run: 9, Failures: 0, Errors: 0, Skipped: 0, Time elapsed: 0.001 sec - in org.apache.commons.lang3.tuple.PairTest
Running org.apache.commons.lang3.StringUtilsIsTest
Tests run: 8, Failures: 0, Errors: 0, Skipped: 0, Time elapsed: 0.011 sec - in org.apache.commons.lang3.StringUtilsIsTest
Running org.apache.commons.lang3.JavaVersionTest
Tests run: 3, Failures: 0, Errors: 0, Skipped: 0, Time elapsed: 0 sec - in org.apache.commons.lang3.JavaVersionTest
Running org.apache.commons.lang3.builder.NoFieldNamesToStringStyleTest
Tests run: 8, Failures: 0, Errors: 0, Skipped: 0, Time elapsed: 0.001 sec - in org.apache.commons.lang3.builder.NoFieldNamesToStringStyleTest
Running org.apache.commons.lang3.builder.ShortPrefixToStringStyleTest
Tests run: 8, Failures: 0, Errors: 0, Skipped: 0, Time elapsed: 0.001 sec - in org.apache.commons.lang3.builder.ShortPrefixToStringStyleTest
Running org.apache.commons.lang3.builder.DiffResultTest
Tests run: 9, Failures: 0, Errors: 0, Skipped: 0, Time elapsed: 0 sec - in org.apache.commons.lang3.builder.DiffResultTest
Running org.apache.commons.lang3.builder.CompareToBuilderTest
Tests run: 48, Failures: 0, Errors: 0, Skipped: 0, Time elapsed: 0.017 sec - in org.apache.commons.lang3.builder.CompareToBuilderTest
Running org.apache.commons.lang3.builder.MultilineRecursiveToStringStyleTest
Tests run: 10, Failures: 0, Errors: 0, Skipped: 0, Time elapsed: 0.005 sec - in org.apache.commons.lang3.builder.MultilineRecursiveToStringStyleTest
Running org.apache.commons.lang3.builder.RecursiveToStringStyleTest
Tests run: 8, Failures: 0, Errors: 0, Skipped: 0, Time elapsed: 0.005 sec - in org.apache.commons.lang3.builder.RecursiveToStringStyleTest
Running org.apache.commons.lang3.builder.DefaultToStringStyleTest
Tests run: 8, Failures: 0, Errors: 0, Skipped: 0, Time elapsed: 0.006 sec - in org.apache.commons.lang3.builder.DefaultToStringStyleTest
Running org.apache.commons.lang3.builder.ReflectionToStringBuilderExcludeTest
Tests run: 11, Failures: 0, Errors: 0, Skipped: 0, Time elapsed: 0.004 sec - in org.apache.commons.lang3.builder.ReflectionToStringBuilderExcludeTest
Running org.apache.commons.lang3.builder.StandardToStringStyleTest
Tests run: 8, Failures: 0, Errors: 0, Skipped: 0, Time elapsed: 0.007 sec - in org.apache.commons.lang3.builder.StandardToStringStyleTest
Running org.apache.commons.lang3.builder.ToStringStyleTest
Tests run: 12, Failures: 0, Errors: 0, Skipped: 0, Time elapsed: 0.004 sec - in org.apache.commons.lang3.builder.ToStringStyleTest
Running org.apache.commons.lang3.builder.DiffTest
Tests run: 4, Failures: 0, Errors: 0, Skipped: 0, Time elapsed: 0 sec - in org.apache.commons.lang3.builder.DiffTest
Running org.apache.commons.lang3.builder.SimpleToStringStyleTest
Tests run: 8, Failures: 0, Errors: 0, Skipped: 0, Time elapsed: 0.004 sec - in org.apache.commons.lang3.builder.SimpleToStringStyleTest
Running org.apache.commons.lang3.builder.MultiLineToStringStyleTest
Tests run: 8, Failures: 0, Errors: 0, Skipped: 0, Time elapsed: 0.004 sec - in org.apache.commons.lang3.builder.MultiLineToStringStyleTest
Running org.apache.commons.lang3.builder.ToStringStyleConcurrencyTest
Tests run: 3, Failures: 0, Errors: 0, Skipped: 0, Time elapsed: 5.603 sec - in org.apache.commons.lang3.builder.ToStringStyleConcurrencyTest
Running org.apache.commons.lang3.builder.ReflectionToStringBuilderMutateInspectConcurrencyTest
Tests run: 1, Failures: 0, Errors: 0, Skipped: 1, Time elapsed: 0 sec - in org.apache.commons.lang3.builder.ReflectionToStringBuilderMutateInspectConcurrencyTest
Running org.apache.commons.lang3.builder.ToStringBuilderTest
Tests run: 74, Failures: 0, Errors: 0, Skipped: 1, Time elapsed: 0.066 sec - in org.apache.commons.lang3.builder.ToStringBuilderTest
Running org.apache.commons.lang3.builder.EqualsBuilderTest
Tests run: 48, Failures: 0, Errors: 0, Skipped: 0, Time elapsed: 0.026 sec - in org.apache.commons.lang3.builder.EqualsBuilderTest
Running org.apache.commons.lang3.builder.HashCodeBuilderAndEqualsBuilderTest
Tests run: 4, Failures: 0, Errors: 0, Skipped: 0, Time elapsed: 0.008 sec - in org.apache.commons.lang3.builder.HashCodeBuilderAndEqualsBuilderTest
Running org.apache.commons.lang3.builder.ReflectionToStringBuilderConcurrencyTest
Tests run: 3, Failures: 0, Errors: 0, Skipped: 3, Time elapsed: 0.001 sec - in org.apache.commons.lang3.builder.ReflectionToStringBuilderConcurrencyTest
Running org.apache.commons.lang3.builder.JsonToStringStyleTest
Tests run: 9, Failures: 0, Errors: 0, Skipped: 0, Time elapsed: 0.002 sec - in org.apache.commons.lang3.builder.JsonToStringStyleTest
Running org.apache.commons.lang3.builder.NoClassNameToStringStyleTest
Tests run: 8, Failures: 0, Errors: 0, Skipped: 0, Time elapsed: 0.002 sec - in org.apache.commons.lang3.builder.NoClassNameToStringStyleTest
Running org.apache.commons.lang3.builder.DiffBuilderTest
Tests run: 30, Failures: 0, Errors: 0, Skipped: 0, Time elapsed: 0.027 sec - in org.apache.commons.lang3.builder.DiffBuilderTest
Running org.apache.commons.lang3.builder.HashCodeBuilderTest
Tests run: 44, Failures: 0, Errors: 0, Skipped: 0, Time elapsed: 0.02 sec - in org.apache.commons.lang3.builder.HashCodeBuilderTest
Running org.apache.commons.lang3.concurrent.AtomicInitializerTest
Tests run: 3, Failures: 0, Errors: 0, Skipped: 0, Time elapsed: 0.015 sec - in org.apache.commons.lang3.concurrent.AtomicInitializerTest
Running org.apache.commons.lang3.concurrent.CallableBackgroundInitializerTest
Tests run: 4, Failures: 0, Errors: 0, Skipped: 0, Time elapsed: 0.002 sec - in org.apache.commons.lang3.concurrent.CallableBackgroundInitializerTest
Running org.apache.commons.lang3.concurrent.BackgroundInitializerTest
Tests run: 15, Failures: 0, Errors: 0, Skipped: 0, Time elapsed: 0.034 sec - in org.apache.commons.lang3.concurrent.BackgroundInitializerTest
Running org.apache.commons.lang3.concurrent.LazyInitializerTest
Tests run: 3, Failures: 0, Errors: 0, Skipped: 0, Time elapsed: 0.03 sec - in org.apache.commons.lang3.concurrent.LazyInitializerTest
Running org.apache.commons.lang3.concurrent.BasicThreadFactoryTest
Tests run: 15, Failures: 0, Errors: 0, Skipped: 0, Time elapsed: 0.034 sec - in org.apache.commons.lang3.concurrent.BasicThreadFactoryTest
Running org.apache.commons.lang3.concurrent.ConstantInitializerTest
Tests run: 7, Failures: 0, Errors: 0, Skipped: 0, Time elapsed: 0 sec - in org.apache.commons.lang3.concurrent.ConstantInitializerTest
Running org.apache.commons.lang3.concurrent.MultiBackgroundInitializerTest
Tests run: 17, Failures: 0, Errors: 0, Skipped: 0, Time elapsed: 0.183 sec - in org.apache.commons.lang3.concurrent.MultiBackgroundInitializerTest
Running org.apache.commons.lang3.concurrent.AtomicSafeInitializerTest
Tests run: 4, Failures: 0, Errors: 0, Skipped: 0, Time elapsed: 0.024 sec - in org.apache.commons.lang3.concurrent.AtomicSafeInitializerTest
Running org.apache.commons.lang3.concurrent.ConcurrentUtilsTest
Tests run: 40, Failures: 0, Errors: 0, Skipped: 0, Time elapsed: 0.016 sec - in org.apache.commons.lang3.concurrent.ConcurrentUtilsTest
Running org.apache.commons.lang3.concurrent.TimedSemaphoreTest
Tests run: 15, Failures: 0, Errors: 0, Skipped: 0, Time elapsed: 1.181 sec - in org.apache.commons.lang3.concurrent.TimedSemaphoreTest
Running org.apache.commons.lang3.StringUtilsSubstringTest
Tests run: 14, Failures: 0, Errors: 0, Skipped: 0, Time elapsed: 0.004 sec - in org.apache.commons.lang3.StringUtilsSubstringTest
Running org.apache.commons.lang3.SystemUtilsTest
Tests run: 12, Failures: 0, Errors: 0, Skipped: 0, Time elapsed: 0.005 sec - in org.apache.commons.lang3.SystemUtilsTest
Running org.apache.commons.lang3.CharRangeTest
Tests run: 16, Failures: 0, Errors: 0, Skipped: 0, Time elapsed: 0.038 sec - in org.apache.commons.lang3.CharRangeTest
Running org.apache.commons.lang3.CharSetTest
Tests run: 14, Failures: 0, Errors: 0, Skipped: 0, Time elapsed: 0.012 sec - in org.apache.commons.lang3.CharSetTest
Running org.apache.commons.lang3.StringUtilsStartsEndsWithTest
Tests run: 6, Failures: 0, Errors: 0, Skipped: 0, Time elapsed: 0.003 sec - in org.apache.commons.lang3.StringUtilsStartsEndsWithTest
Running org.apache.commons.lang3.RandomStringUtilsTest
Tests run: 11, Failures: 0, Errors: 0, Skipped: 0, Time elapsed: 0.041 sec - in org.apache.commons.lang3.RandomStringUtilsTest
Running org.apache.commons.lang3.SerializationUtilsTest
Tests run: 26, Failures: 0, Errors: 0, Skipped: 0, Time elapsed: 0.054 sec - in org.apache.commons.lang3.SerializationUtilsTest
Running org.apache.commons.lang3.time.StopWatchTest
Tests run: 8, Failures: 0, Errors: 0, Skipped: 0, Time elapsed: 4.754 sec - in org.apache.commons.lang3.time.StopWatchTest
Running org.apache.commons.lang3.time.DateUtilsRoundingTest
Tests run: 22, Failures: 0, Errors: 0, Skipped: 0, Time elapsed: 0.173 sec - in org.apache.commons.lang3.time.DateUtilsRoundingTest
Running org.apache.commons.lang3.time.FastDateParserTest
Tests run: 33, Failures: 0, Errors: 0, Skipped: 0, Time elapsed: 2.614 sec - in org.apache.commons.lang3.time.FastDateParserTest
Running org.apache.commons.lang3.time.FastDateFormat_ParserTest
Tests run: 33, Failures: 0, Errors: 0, Skipped: 0, Time elapsed: 0.862 sec - in org.apache.commons.lang3.time.FastDateFormat_ParserTest
Running org.apache.commons.lang3.time.DurationFormatUtilsTest
Tests run: 25, Failures: 0, Errors: 0, Skipped: 0, Time elapsed: 0.696 sec - in org.apache.commons.lang3.time.DurationFormatUtilsTest
Running org.apache.commons.lang3.time.DateFormatUtilsTest
Tests run: 10, Failures: 0, Errors: 0, Skipped: 0, Time elapsed: 0.002 sec - in org.apache.commons.lang3.time.DateFormatUtilsTest
Running org.apache.commons.lang3.time.DateUtilsFragmentTest
Tests run: 57, Failures: 0, Errors: 0, Skipped: 0, Time elapsed: 0.013 sec - in org.apache.commons.lang3.time.DateUtilsFragmentTest
Running org.apache.commons.lang3.time.FastDatePrinterTimeZonesTest
Tests run: 617, Failures: 0, Errors: 0, Skipped: 0, Time elapsed: 0.246 sec - in org.apache.commons.lang3.time.FastDatePrinterTimeZonesTest
Running org.apache.commons.lang3.time.FastDateFormatTest
>>FastDateFormatTest: FastDateParser:19147  SimpleDateFormat:3955
Tests run: 14, Failures: 0, Errors: 0, Skipped: 0, Time elapsed: 2.594 sec - in org.apache.commons.lang3.time.FastDateFormatTest
Running org.apache.commons.lang3.time.FastDateFormat_PrinterTest
Tests run: 17, Failures: 0, Errors: 0, Skipped: 0, Time elapsed: 0.011 sec - in org.apache.commons.lang3.time.FastDateFormat_PrinterTest
Running org.apache.commons.lang3.time.FastDatePrinterTest
Tests run: 17, Failures: 0, Errors: 0, Skipped: 0, Time elapsed: 0.004 sec - in org.apache.commons.lang3.time.FastDatePrinterTest
Running org.apache.commons.lang3.time.FastDateParserSDFTest
Tests run: 276, Failures: 0, Errors: 0, Skipped: 92, Time elapsed: 0.085 sec - in org.apache.commons.lang3.time.FastDateParserSDFTest
Running org.apache.commons.lang3.time.DateUtilsTest
DateUtilsTest: Default Locale=en_US
Tests run: 38, Failures: 0, Errors: 0, Skipped: 0, Time elapsed: 0.014 sec - in org.apache.commons.lang3.time.DateUtilsTest
Running org.apache.commons.lang3.reflect.InheritanceUtilsTest
Tests run: 9, Failures: 0, Errors: 0, Skipped: 0, Time elapsed: 0.003 sec - in org.apache.commons.lang3.reflect.InheritanceUtilsTest
Running org.apache.commons.lang3.reflect.MethodUtilsTest
Tests run: 23, Failures: 0, Errors: 0, Skipped: 0, Time elapsed: 0.054 sec - in org.apache.commons.lang3.reflect.MethodUtilsTest
Running org.apache.commons.lang3.reflect.ConstructorUtilsTest
Tests run: 7, Failures: 0, Errors: 0, Skipped: 0, Time elapsed: 0.016 sec - in org.apache.commons.lang3.reflect.ConstructorUtilsTest
Running org.apache.commons.lang3.reflect.FieldUtilsTest
Tests run: 64, Failures: 0, Errors: 24, Skipped: 0, Time elapsed: 0.016 sec <<< FAILURE! - in org.apache.commons.lang3.reflect.FieldUtilsTest
testReadStaticFieldForceAccess(org.apache.commons.lang3.reflect.FieldUtilsTest)  Time elapsed: 0 sec  <<< ERROR!
java.lang.IllegalArgumentException: The field name must not be blank/empty
	at org.apache.commons.lang3.Validate.isTrue(Validate.java:155)
	at org.apache.commons.lang3.reflect.FieldUtils.getField(FieldUtils.java:87)
	at org.apache.commons.lang3.reflect.FieldUtils.getField(FieldUtils.java:63)
	at org.apache.commons.lang3.reflect.FieldUtilsTest.testReadStaticFieldForceAccess(FieldUtilsTest.java:322)

testReadDeclaredNamedField(org.apache.commons.lang3.reflect.FieldUtilsTest)  Time elapsed: 0 sec  <<< ERROR!
java.lang.IllegalArgumentException: The field name must not be blank/empty
	at org.apache.commons.lang3.Validate.isTrue(Validate.java:155)
	at org.apache.commons.lang3.reflect.FieldUtils.getDeclaredField(FieldUtils.java:170)
	at org.apache.commons.lang3.reflect.FieldUtils.readDeclaredField(FieldUtils.java:511)
	at org.apache.commons.lang3.reflect.FieldUtils.readDeclaredField(FieldUtils.java:488)
	at org.apache.commons.lang3.reflect.FieldUtilsTest.testReadDeclaredNamedField(FieldUtilsTest.java:692)

testReadNamedStaticField(org.apache.commons.lang3.reflect.FieldUtilsTest)  Time elapsed: 0 sec  <<< ERROR!
java.lang.IllegalArgumentException: The field name must not be blank/empty
	at org.apache.commons.lang3.Validate.isTrue(Validate.java:155)
	at org.apache.commons.lang3.reflect.FieldUtils.getField(FieldUtils.java:87)
	at org.apache.commons.lang3.reflect.FieldUtils.readStaticField(FieldUtils.java:338)
	at org.apache.commons.lang3.reflect.FieldUtils.readStaticField(FieldUtils.java:316)
	at org.apache.commons.lang3.reflect.FieldUtilsTest.testReadNamedStaticField(FieldUtilsTest.java:340)

testReadDeclaredNamedStaticFieldForceAccess(org.apache.commons.lang3.reflect.FieldUtilsTest)  Time elapsed: 0 sec  <<< ERROR!
java.lang.IllegalArgumentException: The field name must not be blank/empty
	at org.apache.commons.lang3.Validate.isTrue(Validate.java:155)
	at org.apache.commons.lang3.reflect.FieldUtils.getDeclaredField(FieldUtils.java:170)
	at org.apache.commons.lang3.reflect.FieldUtils.readDeclaredStaticField(FieldUtils.java:382)
	at org.apache.commons.lang3.reflect.FieldUtilsTest.testReadDeclaredNamedStaticFieldForceAccess(FieldUtilsTest.java:463)

testReadDeclaredNamedFieldForceAccess(org.apache.commons.lang3.reflect.FieldUtilsTest)  Time elapsed: 0 sec  <<< ERROR!
java.lang.IllegalArgumentException: The field name must not be blank/empty
	at org.apache.commons.lang3.Validate.isTrue(Validate.java:155)
	at org.apache.commons.lang3.reflect.FieldUtils.getDeclaredField(FieldUtils.java:170)
	at org.apache.commons.lang3.reflect.FieldUtils.readDeclaredField(FieldUtils.java:511)
	at org.apache.commons.lang3.reflect.FieldUtilsTest.testReadDeclaredNamedFieldForceAccess(FieldUtilsTest.java:776)

testGetField(org.apache.commons.lang3.reflect.FieldUtilsTest)  Time elapsed: 0 sec  <<< ERROR!
java.lang.IllegalArgumentException: The field name must not be blank/empty
	at org.apache.commons.lang3.Validate.isTrue(Validate.java:155)
	at org.apache.commons.lang3.reflect.FieldUtils.getField(FieldUtils.java:87)
	at org.apache.commons.lang3.reflect.FieldUtils.getField(FieldUtils.java:63)
	at org.apache.commons.lang3.reflect.FieldUtilsTest.testGetField(FieldUtilsTest.java:73)

testReadDeclaredNamedStaticField(org.apache.commons.lang3.reflect.FieldUtilsTest)  Time elapsed: 0 sec  <<< ERROR!
java.lang.IllegalArgumentException: The field name must not be blank/empty
	at org.apache.commons.lang3.Validate.isTrue(Validate.java:155)
	at org.apache.commons.lang3.reflect.FieldUtils.getDeclaredField(FieldUtils.java:170)
	at org.apache.commons.lang3.reflect.FieldUtils.readDeclaredStaticField(FieldUtils.java:382)
	at org.apache.commons.lang3.reflect.FieldUtils.readDeclaredStaticField(FieldUtils.java:360)
	at org.apache.commons.lang3.reflect.FieldUtilsTest.testReadDeclaredNamedStaticField(FieldUtilsTest.java:440)

testWriteNamedStaticFieldForceAccess(org.apache.commons.lang3.reflect.FieldUtilsTest)  Time elapsed: 0 sec  <<< ERROR!
java.lang.IllegalArgumentException: The field name must not be blank/empty
	at org.apache.commons.lang3.Validate.isTrue(Validate.java:155)
	at org.apache.commons.lang3.reflect.FieldUtils.getField(FieldUtils.java:87)
	at org.apache.commons.lang3.reflect.FieldUtils.writeStaticField(FieldUtils.java:596)
	at org.apache.commons.lang3.reflect.FieldUtilsTest.testWriteNamedStaticFieldForceAccess(FieldUtilsTest.java:954)

testWriteNamedField(org.apache.commons.lang3.reflect.FieldUtilsTest)  Time elapsed: 0 sec  <<< ERROR!
java.lang.IllegalArgumentException: The field name must not be blank/empty
	at org.apache.commons.lang3.Validate.isTrue(Validate.java:155)
	at org.apache.commons.lang3.reflect.FieldUtils.getField(FieldUtils.java:87)
	at org.apache.commons.lang3.reflect.FieldUtils.writeField(FieldUtils.java:787)
	at org.apache.commons.lang3.reflect.FieldUtils.writeField(FieldUtils.java:761)
	at org.apache.commons.lang3.reflect.FieldUtilsTest.testWriteNamedField(FieldUtilsTest.java:1118)

testWriteDeclaredNamedFieldForceAccess(org.apache.commons.lang3.reflect.FieldUtilsTest)  Time elapsed: 0 sec  <<< ERROR!
java.lang.IllegalArgumentException: The field name must not be blank/empty
	at org.apache.commons.lang3.Validate.isTrue(Validate.java:155)
	at org.apache.commons.lang3.reflect.FieldUtils.getDeclaredField(FieldUtils.java:170)
	at org.apache.commons.lang3.reflect.FieldUtils.writeDeclaredField(FieldUtils.java:835)
	at org.apache.commons.lang3.reflect.FieldUtilsTest.testWriteDeclaredNamedFieldForceAccess(FieldUtilsTest.java:1289)

testWriteDeclaredNamedStaticField(org.apache.commons.lang3.reflect.FieldUtilsTest)  Time elapsed: 0 sec  <<< ERROR!
java.lang.IllegalArgumentException: The field name must not be blank/empty
	at org.apache.commons.lang3.Validate.isTrue(Validate.java:155)
	at org.apache.commons.lang3.reflect.FieldUtils.getField(FieldUtils.java:87)
	at org.apache.commons.lang3.reflect.FieldUtils.writeStaticField(FieldUtils.java:596)
	at org.apache.commons.lang3.reflect.FieldUtils.writeStaticField(FieldUtils.java:572)
	at org.apache.commons.lang3.reflect.FieldUtilsTest.testWriteDeclaredNamedStaticField(FieldUtilsTest.java:990)

testReadNamedField(org.apache.commons.lang3.reflect.FieldUtilsTest)  Time elapsed: 0 sec  <<< ERROR!
java.lang.IllegalArgumentException: The field name must not be blank/empty
	at org.apache.commons.lang3.Validate.isTrue(Validate.java:155)
	at org.apache.commons.lang3.reflect.FieldUtils.getField(FieldUtils.java:87)
	at org.apache.commons.lang3.reflect.FieldUtils.readField(FieldUtils.java:468)
	at org.apache.commons.lang3.reflect.FieldUtils.readField(FieldUtils.java:445)
	at org.apache.commons.lang3.reflect.FieldUtilsTest.testReadNamedField(FieldUtilsTest.java:539)

testGetFieldForceAccess(org.apache.commons.lang3.reflect.FieldUtilsTest)  Time elapsed: 0 sec  <<< ERROR!
java.lang.IllegalArgumentException: The field name must not be blank/empty
	at org.apache.commons.lang3.Validate.isTrue(Validate.java:155)
	at org.apache.commons.lang3.reflect.FieldUtils.getField(FieldUtils.java:87)
	at org.apache.commons.lang3.reflect.FieldUtilsTest.testGetFieldForceAccess(FieldUtilsTest.java:112)

testReadField(org.apache.commons.lang3.reflect.FieldUtilsTest)  Time elapsed: 0 sec  <<< ERROR!
java.lang.IllegalArgumentException: The field name must not be blank/empty
	at org.apache.commons.lang3.Validate.isTrue(Validate.java:155)
	at org.apache.commons.lang3.reflect.FieldUtils.getDeclaredField(FieldUtils.java:170)
	at org.apache.commons.lang3.reflect.FieldUtils.getDeclaredField(FieldUtils.java:149)
	at org.apache.commons.lang3.reflect.FieldUtilsTest.testReadField(FieldUtilsTest.java:481)

testWriteNamedStaticField(org.apache.commons.lang3.reflect.FieldUtilsTest)  Time elapsed: 0 sec  <<< ERROR!
java.lang.IllegalArgumentException: The field name must not be blank/empty
	at org.apache.commons.lang3.Validate.isTrue(Validate.java:155)
	at org.apache.commons.lang3.reflect.FieldUtils.getField(FieldUtils.java:87)
	at org.apache.commons.lang3.reflect.FieldUtils.writeStaticField(FieldUtils.java:596)
	at org.apache.commons.lang3.reflect.FieldUtils.writeStaticField(FieldUtils.java:572)
	at org.apache.commons.lang3.reflect.FieldUtilsTest.testWriteNamedStaticField(FieldUtilsTest.java:906)

testWriteNamedFieldForceAccess(org.apache.commons.lang3.reflect.FieldUtilsTest)  Time elapsed: 0.001 sec  <<< ERROR!
java.lang.IllegalArgumentException: The field name must not be blank/empty
	at org.apache.commons.lang3.Validate.isTrue(Validate.java:155)
	at org.apache.commons.lang3.reflect.FieldUtils.getField(FieldUtils.java:87)
	at org.apache.commons.lang3.reflect.FieldUtils.writeField(FieldUtils.java:787)
	at org.apache.commons.lang3.reflect.FieldUtilsTest.testWriteNamedFieldForceAccess(FieldUtilsTest.java:1172)

testReadNamedStaticFieldForceAccess(org.apache.commons.lang3.reflect.FieldUtilsTest)  Time elapsed: 0 sec  <<< ERROR!
java.lang.IllegalArgumentException: The field name must not be blank/empty
	at org.apache.commons.lang3.Validate.isTrue(Validate.java:155)
	at org.apache.commons.lang3.reflect.FieldUtils.getField(FieldUtils.java:87)
	at org.apache.commons.lang3.reflect.FieldUtils.readStaticField(FieldUtils.java:338)
	at org.apache.commons.lang3.reflect.FieldUtilsTest.testReadNamedStaticFieldForceAccess(FieldUtilsTest.java:390)

testReadStaticField(org.apache.commons.lang3.reflect.FieldUtilsTest)  Time elapsed: 0 sec  <<< ERROR!
java.lang.IllegalArgumentException: The field name must not be blank/empty
	at org.apache.commons.lang3.Validate.isTrue(Validate.java:155)
	at org.apache.commons.lang3.reflect.FieldUtils.getField(FieldUtils.java:87)
	at org.apache.commons.lang3.reflect.FieldUtils.getField(FieldUtils.java:63)
	at org.apache.commons.lang3.reflect.FieldUtilsTest.testReadStaticField(FieldUtilsTest.java:304)

testWriteDeclaredNamedStaticFieldForceAccess(org.apache.commons.lang3.reflect.FieldUtilsTest)  Time elapsed: 0 sec  <<< ERROR!
java.lang.IllegalArgumentException: The field name must not be blank/empty
	at org.apache.commons.lang3.Validate.isTrue(Validate.java:155)
	at org.apache.commons.lang3.reflect.FieldUtils.getDeclaredField(FieldUtils.java:170)
	at org.apache.commons.lang3.reflect.FieldUtils.writeDeclaredStaticField(FieldUtils.java:641)
	at org.apache.commons.lang3.reflect.FieldUtilsTest.testWriteDeclaredNamedStaticFieldForceAccess(FieldUtilsTest.java:1038)

testWriteDeclaredNamedField(org.apache.commons.lang3.reflect.FieldUtilsTest)  Time elapsed: 0.001 sec  <<< ERROR!
java.lang.IllegalArgumentException: The field name must not be blank/empty
	at org.apache.commons.lang3.Validate.isTrue(Validate.java:155)
	at org.apache.commons.lang3.reflect.FieldUtils.getDeclaredField(FieldUtils.java:170)
	at org.apache.commons.lang3.reflect.FieldUtils.writeDeclaredField(FieldUtils.java:835)
	at org.apache.commons.lang3.reflect.FieldUtils.writeDeclaredField(FieldUtils.java:809)
	at org.apache.commons.lang3.reflect.FieldUtilsTest.testWriteDeclaredNamedField(FieldUtilsTest.java:1227)

testGetDeclaredField(org.apache.commons.lang3.reflect.FieldUtilsTest)  Time elapsed: 0 sec  <<< ERROR!
java.lang.IllegalArgumentException: The field name must not be blank/empty
	at org.apache.commons.lang3.Validate.isTrue(Validate.java:155)
	at org.apache.commons.lang3.reflect.FieldUtils.getDeclaredField(FieldUtils.java:170)
	at org.apache.commons.lang3.reflect.FieldUtils.getDeclaredField(FieldUtils.java:149)
	at org.apache.commons.lang3.reflect.FieldUtilsTest.testGetDeclaredField(FieldUtilsTest.java:226)

testGetDeclaredFieldForceAccess(org.apache.commons.lang3.reflect.FieldUtilsTest)  Time elapsed: 0.001 sec  <<< ERROR!
java.lang.IllegalArgumentException: The field name must not be blank/empty
	at org.apache.commons.lang3.Validate.isTrue(Validate.java:155)
	at org.apache.commons.lang3.reflect.FieldUtils.getDeclaredField(FieldUtils.java:170)
	at org.apache.commons.lang3.reflect.FieldUtilsTest.testGetDeclaredFieldForceAccess(FieldUtilsTest.java:265)

testReadFieldForceAccess(org.apache.commons.lang3.reflect.FieldUtilsTest)  Time elapsed: 0.001 sec  <<< ERROR!
java.lang.IllegalArgumentException: The field name must not be blank/empty
	at org.apache.commons.lang3.Validate.isTrue(Validate.java:155)
	at org.apache.commons.lang3.reflect.FieldUtils.getDeclaredField(FieldUtils.java:170)
	at org.apache.commons.lang3.reflect.FieldUtils.getDeclaredField(FieldUtils.java:149)
	at org.apache.commons.lang3.reflect.FieldUtilsTest.testReadFieldForceAccess(FieldUtilsTest.java:508)

testReadNamedFieldForceAccess(org.apache.commons.lang3.reflect.FieldUtilsTest)  Time elapsed: 0 sec  <<< ERROR!
java.lang.IllegalArgumentException: The field name must not be blank/empty
	at org.apache.commons.lang3.Validate.isTrue(Validate.java:155)
	at org.apache.commons.lang3.reflect.FieldUtils.getField(FieldUtils.java:87)
	at org.apache.commons.lang3.reflect.FieldUtils.readField(FieldUtils.java:468)
	at org.apache.commons.lang3.reflect.FieldUtilsTest.testReadNamedFieldForceAccess(FieldUtilsTest.java:614)

Running org.apache.commons.lang3.reflect.TypeLiteralTest
Tests run: 4, Failures: 0, Errors: 0, Skipped: 0, Time elapsed: 0.027 sec - in org.apache.commons.lang3.reflect.TypeLiteralTest
Running org.apache.commons.lang3.reflect.TypeUtilsTest
Tests run: 19, Failures: 0, Errors: 0, Skipped: 0, Time elapsed: 0.087 sec - in org.apache.commons.lang3.reflect.TypeUtilsTest
Running org.apache.commons.lang3.mutable.MutableByteTest
Tests run: 17, Failures: 0, Errors: 0, Skipped: 0, Time elapsed: 0.006 sec - in org.apache.commons.lang3.mutable.MutableByteTest
Running org.apache.commons.lang3.mutable.MutableShortTest
Tests run: 14, Failures: 0, Errors: 0, Skipped: 0, Time elapsed: 0.028 sec - in org.apache.commons.lang3.mutable.MutableShortTest
Running org.apache.commons.lang3.mutable.MutableIntTest
Tests run: 17, Failures: 0, Errors: 0, Skipped: 0, Time elapsed: 0.009 sec - in org.apache.commons.lang3.mutable.MutableIntTest
Running org.apache.commons.lang3.mutable.MutableDoubleTest
Tests run: 18, Failures: 0, Errors: 0, Skipped: 0, Time elapsed: 0.005 sec - in org.apache.commons.lang3.mutable.MutableDoubleTest
Running org.apache.commons.lang3.mutable.MutableFloatTest
Tests run: 18, Failures: 0, Errors: 0, Skipped: 0, Time elapsed: 0.003 sec - in org.apache.commons.lang3.mutable.MutableFloatTest
Running org.apache.commons.lang3.mutable.MutableLongTest
Tests run: 17, Failures: 0, Errors: 0, Skipped: 0, Time elapsed: 0.004 sec - in org.apache.commons.lang3.mutable.MutableLongTest
Running org.apache.commons.lang3.mutable.MutableBooleanTest
Tests run: 9, Failures: 0, Errors: 0, Skipped: 0, Time elapsed: 0.004 sec - in org.apache.commons.lang3.mutable.MutableBooleanTest
Running org.apache.commons.lang3.mutable.MutableObjectTest
Tests run: 5, Failures: 0, Errors: 0, Skipped: 0, Time elapsed: 0 sec - in org.apache.commons.lang3.mutable.MutableObjectTest
Running org.apache.commons.lang3.text.translate.UnicodeEscaperTest
Tests run: 3, Failures: 0, Errors: 0, Skipped: 0, Time elapsed: 0 sec - in org.apache.commons.lang3.text.translate.UnicodeEscaperTest
Running org.apache.commons.lang3.text.translate.EntityArraysTest
Tests run: 3, Failures: 0, Errors: 0, Skipped: 0, Time elapsed: 0.001 sec - in org.apache.commons.lang3.text.translate.EntityArraysTest
Running org.apache.commons.lang3.text.translate.UnicodeUnpairedSurrogateRemoverTest
Tests run: 2, Failures: 0, Errors: 0, Skipped: 0, Time elapsed: 0.001 sec - in org.apache.commons.lang3.text.translate.UnicodeUnpairedSurrogateRemoverTest
Running org.apache.commons.lang3.text.translate.NumericEntityUnescaperTest
Tests run: 3, Failures: 0, Errors: 0, Skipped: 0, Time elapsed: 0.001 sec - in org.apache.commons.lang3.text.translate.NumericEntityUnescaperTest
Running org.apache.commons.lang3.text.translate.NumericEntityEscaperTest
Tests run: 4, Failures: 0, Errors: 0, Skipped: 0, Time elapsed: 0 sec - in org.apache.commons.lang3.text.translate.NumericEntityEscaperTest
Running org.apache.commons.lang3.text.translate.LookupTranslatorTest
Tests run: 2, Failures: 0, Errors: 0, Skipped: 0, Time elapsed: 0 sec - in org.apache.commons.lang3.text.translate.LookupTranslatorTest
Running org.apache.commons.lang3.text.translate.UnicodeUnescaperTest
Tests run: 3, Failures: 0, Errors: 0, Skipped: 0, Time elapsed: 0 sec - in org.apache.commons.lang3.text.translate.UnicodeUnescaperTest
Running org.apache.commons.lang3.text.translate.OctalUnescaperTest
Tests run: 1, Failures: 0, Errors: 0, Skipped: 0, Time elapsed: 0 sec - in org.apache.commons.lang3.text.translate.OctalUnescaperTest
Running org.apache.commons.lang3.text.StrMatcherTest
Tests run: 14, Failures: 0, Errors: 0, Skipped: 0, Time elapsed: 0 sec - in org.apache.commons.lang3.text.StrMatcherTest
Running org.apache.commons.lang3.text.StrTokenizerTest
Tests run: 55, Failures: 0, Errors: 0, Skipped: 0, Time elapsed: 0.014 sec - in org.apache.commons.lang3.text.StrTokenizerTest
Running org.apache.commons.lang3.text.FormattableUtilsTest
Tests run: 5, Failures: 0, Errors: 0, Skipped: 0, Time elapsed: 0.001 sec - in org.apache.commons.lang3.text.FormattableUtilsTest
Running org.apache.commons.lang3.text.CompositeFormatTest
Tests run: 2, Failures: 0, Errors: 0, Skipped: 0, Time elapsed: 0 sec - in org.apache.commons.lang3.text.CompositeFormatTest
Running org.apache.commons.lang3.text.WordUtilsTest
Tests run: 12, Failures: 0, Errors: 0, Skipped: 0, Time elapsed: 0.004 sec - in org.apache.commons.lang3.text.WordUtilsTest
Running org.apache.commons.lang3.text.StrLookupTest
Tests run: 5, Failures: 0, Errors: 0, Skipped: 0, Time elapsed: 0.004 sec - in org.apache.commons.lang3.text.StrLookupTest
Running org.apache.commons.lang3.text.StrBuilderAppendInsertTest
Tests run: 51, Failures: 0, Errors: 0, Skipped: 0, Time elapsed: 0.026 sec - in org.apache.commons.lang3.text.StrBuilderAppendInsertTest
Running org.apache.commons.lang3.text.ExtendedMessageFormatTest
Tests run: 10, Failures: 0, Errors: 0, Skipped: 0, Time elapsed: 1.139 sec - in org.apache.commons.lang3.text.ExtendedMessageFormatTest
Running org.apache.commons.lang3.text.StrSubstitutorTest
Tests run: 40, Failures: 0, Errors: 0, Skipped: 0, Time elapsed: 0.037 sec - in org.apache.commons.lang3.text.StrSubstitutorTest
Running org.apache.commons.lang3.text.StrBuilderTest
Tests run: 90, Failures: 0, Errors: 0, Skipped: 0, Time elapsed: 0.063 sec - in org.apache.commons.lang3.text.StrBuilderTest
Running org.apache.commons.lang3.StringEscapeUtilsTest
Tests run: 28, Failures: 0, Errors: 0, Skipped: 0, Time elapsed: 0.634 sec - in org.apache.commons.lang3.StringEscapeUtilsTest
Running org.apache.commons.lang3.AnnotationUtilsTest
Tests run: 10, Failures: 0, Errors: 0, Skipped: 0, Time elapsed: 0.051 sec - in org.apache.commons.lang3.AnnotationUtilsTest
Running org.apache.commons.lang3.ConversionTest
Tests run: 42, Failures: 0, Errors: 0, Skipped: 0, Time elapsed: 0.022 sec - in org.apache.commons.lang3.ConversionTest
Running org.apache.commons.lang3.StringUtilsTrimEmptyTest
Tests run: 15, Failures: 2, Errors: 0, Skipped: 0, Time elapsed: 0.015 sec <<< FAILURE! - in org.apache.commons.lang3.StringUtilsTrimEmptyTest
testIsNotBlank(org.apache.commons.lang3.StringUtilsTrimEmptyTest)  Time elapsed: 0 sec  <<< FAILURE!
java.lang.AssertionError: null
	at org.junit.Assert.fail(Assert.java:86)
	at org.junit.Assert.assertTrue(Assert.java:41)
	at org.junit.Assert.assertTrue(Assert.java:52)
	at org.apache.commons.lang3.StringUtilsTrimEmptyTest.testIsNotBlank(StringUtilsTrimEmptyTest.java:68)

testIsBlank(org.apache.commons.lang3.StringUtilsTrimEmptyTest)  Time elapsed: 0 sec  <<< FAILURE!
java.lang.AssertionError: null
	at org.junit.Assert.fail(Assert.java:86)
	at org.junit.Assert.assertTrue(Assert.java:41)
	at org.junit.Assert.assertFalse(Assert.java:64)
	at org.junit.Assert.assertFalse(Assert.java:74)
	at org.apache.commons.lang3.StringUtilsTrimEmptyTest.testIsBlank(StringUtilsTrimEmptyTest.java:59)

Running org.apache.commons.lang3.EnumUtilsTest
Tests run: 34, Failures: 0, Errors: 0, Skipped: 0, Time elapsed: 0.02 sec - in org.apache.commons.lang3.EnumUtilsTest
Running org.apache.commons.lang3.exception.ExceptionUtilsTest
Tests run: 28, Failures: 0, Errors: 0, Skipped: 0, Time elapsed: 0.046 sec - in org.apache.commons.lang3.exception.ExceptionUtilsTest
Running org.apache.commons.lang3.exception.DefaultExceptionContextTest
Tests run: 8, Failures: 0, Errors: 0, Skipped: 0, Time elapsed: 0.01 sec - in org.apache.commons.lang3.exception.DefaultExceptionContextTest
Running org.apache.commons.lang3.exception.ContextedExceptionTest
Tests run: 14, Failures: 0, Errors: 0, Skipped: 0, Time elapsed: 0.019 sec - in org.apache.commons.lang3.exception.ContextedExceptionTest
Running org.apache.commons.lang3.exception.ContextedRuntimeExceptionTest
Tests run: 14, Failures: 0, Errors: 0, Skipped: 0, Time elapsed: 0.019 sec - in org.apache.commons.lang3.exception.ContextedRuntimeExceptionTest
Running org.apache.commons.lang3.BitFieldTest
Tests run: 15, Failures: 0, Errors: 0, Skipped: 0, Time elapsed: 0.007 sec - in org.apache.commons.lang3.BitFieldTest
Running org.apache.commons.lang3.ArrayUtilsRemoveMultipleTest
Tests run: 55, Failures: 0, Errors: 0, Skipped: 0, Time elapsed: 0.03 sec - in org.apache.commons.lang3.ArrayUtilsRemoveMultipleTest
Running org.apache.commons.lang3.HashSetvBitSetTest
Ratio=8% array=100 count=1 extract=23965201 bitset=2025600
Ratio=10% array=100 count=10 extract=9771809 bitset=1061099
Ratio=3% array=100 count=50 extract=23680360 bitset=856545
Ratio=3% array=100 count=100 extract=16342764 bitset=635290
Ratio=93% array=1000 count=10 extract=9131422 bitset=8554620
Ratio=101% array=1000 count=100 extract=19947251 bitset=20324874
Ratio=7% array=1000 count=500 extract=48304748 bitset=3678062
Ratio=1% array=1000 count=1000 extract=76177722 bitset=790693
Ratio=21% count=0 hash=4670096 bits=982178
Ratio=6% count=5 hash=4484270 bits=295952
Ratio=28% count=10 hash=1030643 bits=297489
Ratio=24% count=200 hash=20568714 bits=5008529
Ratio=14% count=50 hash=8829623 bits=1308628
Ratio=17% count=100 hash=18825448 bits=3387188
Ratio=21% count=1000 hash=85816380 bits=18072323
Ratio=20% count=2000 hash=175438259 bits=35487223
Tests run: 2, Failures: 0, Errors: 0, Skipped: 0, Time elapsed: 0.819 sec - in org.apache.commons.lang3.HashSetvBitSetTest
Running org.apache.commons.lang3.StringUtilsTest
Tests run: 124, Failures: 8, Errors: 0, Skipped: 0, Time elapsed: 0.186 sec <<< FAILURE! - in org.apache.commons.lang3.StringUtilsTest
testIsAnyBlank(org.apache.commons.lang3.StringUtilsTest)  Time elapsed: 0.001 sec  <<< FAILURE!
java.lang.AssertionError: null
	at org.junit.Assert.fail(Assert.java:86)
	at org.junit.Assert.assertTrue(Assert.java:41)
	at org.junit.Assert.assertFalse(Assert.java:64)
	at org.junit.Assert.assertFalse(Assert.java:74)
	at org.apache.commons.lang3.StringUtilsTest.testIsAnyBlank(StringUtilsTest.java:197)

testDefaultIfBlank_StringString(org.apache.commons.lang3.StringUtilsTest)  Time elapsed: 0.002 sec  <<< FAILURE!
org.junit.ComparisonFailure: expected:<[abc]> but was:<[NULL]>
	at org.junit.Assert.assertEquals(Assert.java:115)
	at org.junit.Assert.assertEquals(Assert.java:144)
	at org.apache.commons.lang3.StringUtilsTest.testDefaultIfBlank_StringString(StringUtilsTest.java:1663)

testDefaultIfBlank_StringBuffers(org.apache.commons.lang3.StringUtilsTest)  Time elapsed: 0 sec  <<< FAILURE!
org.junit.ComparisonFailure: expected:<[abc]> but was:<[NULL]>
	at org.junit.Assert.assertEquals(Assert.java:115)
	at org.junit.Assert.assertEquals(Assert.java:144)
	at org.apache.commons.lang3.StringUtilsTest.testDefaultIfBlank_StringBuffers(StringUtilsTest.java:1705)

testIsNotBlank(org.apache.commons.lang3.StringUtilsTest)  Time elapsed: 0.001 sec  <<< FAILURE!
java.lang.AssertionError: null
	at org.junit.Assert.fail(Assert.java:86)
	at org.junit.Assert.assertTrue(Assert.java:41)
	at org.junit.Assert.assertTrue(Assert.java:52)
	at org.apache.commons.lang3.StringUtilsTest.testIsNotBlank(StringUtilsTest.java:183)

testDefaultIfBlank_StringBuilders(org.apache.commons.lang3.StringUtilsTest)  Time elapsed: 0.001 sec  <<< FAILURE!
org.junit.ComparisonFailure: expected:<[abc]> but was:<[NULL]>
	at org.junit.Assert.assertEquals(Assert.java:115)
	at org.junit.Assert.assertEquals(Assert.java:144)
	at org.apache.commons.lang3.StringUtilsTest.testDefaultIfBlank_StringBuilders(StringUtilsTest.java:1684)

testIsNoneBlank(org.apache.commons.lang3.StringUtilsTest)  Time elapsed: 0.001 sec  <<< FAILURE!
java.lang.AssertionError: null
	at org.junit.Assert.fail(Assert.java:86)
	at org.junit.Assert.assertTrue(Assert.java:41)
	at org.junit.Assert.assertTrue(Assert.java:52)
	at org.apache.commons.lang3.StringUtilsTest.testIsNoneBlank(StringUtilsTest.java:210)

testDefaultIfBlank_CharBuffers(org.apache.commons.lang3.StringUtilsTest)  Time elapsed: 0 sec  <<< FAILURE!
org.junit.ComparisonFailure: expected:<[abc]> but was:<[NULL]>
	at org.junit.Assert.assertEquals(Assert.java:115)
	at org.junit.Assert.assertEquals(Assert.java:144)
	at org.apache.commons.lang3.StringUtilsTest.testDefaultIfBlank_CharBuffers(StringUtilsTest.java:1726)

testIsBlank(org.apache.commons.lang3.StringUtilsTest)  Time elapsed: 0 sec  <<< FAILURE!
java.lang.AssertionError: null
	at org.junit.Assert.fail(Assert.java:86)
	at org.junit.Assert.assertTrue(Assert.java:41)
	at org.junit.Assert.assertFalse(Assert.java:64)
	at org.junit.Assert.assertFalse(Assert.java:74)
	at org.apache.commons.lang3.StringUtilsTest.testIsBlank(StringUtilsTest.java:174)

Running org.apache.commons.lang3.ArrayUtilsRemoveTest
Tests run: 19, Failures: 0, Errors: 0, Skipped: 0, Time elapsed: 0.003 sec - in org.apache.commons.lang3.ArrayUtilsRemoveTest
Running org.apache.commons.lang3.ObjectUtilsTest
Tests run: 36, Failures: 0, Errors: 0, Skipped: 0, Time elapsed: 0.013 sec - in org.apache.commons.lang3.ObjectUtilsTest
Running org.apache.commons.lang3.ClassPathUtilsTest
Tests run: 13, Failures: 0, Errors: 0, Skipped: 0, Time elapsed: 0.003 sec - in org.apache.commons.lang3.ClassPathUtilsTest
Running org.apache.commons.lang3.math.NumberUtilsTest
Tests run: 91, Failures: 4, Errors: 7, Skipped: 0, Time elapsed: 0.042 sec <<< FAILURE! - in org.apache.commons.lang3.math.NumberUtilsTest
testCreateNumber(org.apache.commons.lang3.math.NumberUtilsTest)  Time elapsed: 0 sec  <<< ERROR!
java.lang.NumberFormatException: A blank string is not a valid number
	at org.apache.commons.lang3.math.NumberUtils.createNumber(NumberUtils.java:456)
	at org.apache.commons.lang3.math.NumberUtilsTest.testCreateNumber(NumberUtilsTest.java:198)

testLANG971(org.apache.commons.lang3.math.NumberUtilsTest)  Time elapsed: 0 sec  <<< FAILURE!
java.lang.AssertionError: Expecting true for isNumber/createNumber using "07" but got true and false
	at org.junit.Assert.fail(Assert.java:88)
	at org.apache.commons.lang3.math.NumberUtilsTest.compareIsNumberWithCreateNumber(NumberUtilsTest.java:1271)
	at org.apache.commons.lang3.math.NumberUtilsTest.testLANG971(NumberUtilsTest.java:1249)

testLANG972(org.apache.commons.lang3.math.NumberUtilsTest)  Time elapsed: 0 sec  <<< FAILURE!
java.lang.AssertionError: Expecting true for isNumber/createNumber using "0xABCD" but got true and false
	at org.junit.Assert.fail(Assert.java:88)
	at org.apache.commons.lang3.math.NumberUtilsTest.compareIsNumberWithCreateNumber(NumberUtilsTest.java:1271)
	at org.apache.commons.lang3.math.NumberUtilsTest.testLANG972(NumberUtilsTest.java:1261)

testLANG992(org.apache.commons.lang3.math.NumberUtilsTest)  Time elapsed: 0 sec  <<< FAILURE!
java.lang.AssertionError: Expecting true for isNumber/createNumber using "0.0" but got true and false
	at org.junit.Assert.fail(Assert.java:88)
	at org.apache.commons.lang3.math.NumberUtilsTest.compareIsNumberWithCreateNumber(NumberUtilsTest.java:1271)
	at org.apache.commons.lang3.math.NumberUtilsTest.testLANG992(NumberUtilsTest.java:1255)

testLang1087(org.apache.commons.lang3.math.NumberUtilsTest)  Time elapsed: 0 sec  <<< ERROR!
java.lang.NumberFormatException: A blank string is not a valid number
	at org.apache.commons.lang3.math.NumberUtils.createNumber(NumberUtils.java:456)
	at org.apache.commons.lang3.math.NumberUtilsTest.testLang1087(NumberUtilsTest.java:252)

testCreateNumberMagnitude(org.apache.commons.lang3.math.NumberUtilsTest)  Time elapsed: 0 sec  <<< ERROR!
java.lang.NumberFormatException: A blank string is not a valid number
	at org.apache.commons.lang3.math.NumberUtils.createNumber(NumberUtils.java:456)
	at org.apache.commons.lang3.math.NumberUtilsTest.testCreateNumberMagnitude(NumberUtilsTest.java:328)

testLang300(org.apache.commons.lang3.math.NumberUtilsTest)  Time elapsed: 0 sec  <<< ERROR!
java.lang.NumberFormatException: A blank string is not a valid number
	at org.apache.commons.lang3.math.NumberUtils.createNumber(NumberUtils.java:456)
	at org.apache.commons.lang3.math.NumberUtilsTest.testLang300(NumberUtilsTest.java:1351)

testCreateBigDecimal(org.apache.commons.lang3.math.NumberUtilsTest)  Time elapsed: 0.001 sec  <<< ERROR!
java.lang.NumberFormatException: A blank string is not a valid number
	at org.apache.commons.lang3.math.NumberUtils.createBigDecimal(NumberUtils.java:795)
	at org.apache.commons.lang3.math.NumberUtilsTest.testCreateBigDecimal(NumberUtilsTest.java:468)

testIsNumber(org.apache.commons.lang3.math.NumberUtilsTest)  Time elapsed: 0.001 sec  <<< FAILURE!
java.lang.AssertionError: Expecting true for isNumber/createNumber using "12345" but got true and false
	at org.junit.Assert.fail(Assert.java:88)
	at org.apache.commons.lang3.math.NumberUtilsTest.compareIsNumberWithCreateNumber(NumberUtilsTest.java:1271)
	at org.apache.commons.lang3.math.NumberUtilsTest.testIsNumber(NumberUtilsTest.java:1192)

TestLang747(org.apache.commons.lang3.math.NumberUtilsTest)  Time elapsed: 0 sec  <<< ERROR!
java.lang.NumberFormatException: A blank string is not a valid number
	at org.apache.commons.lang3.math.NumberUtils.createNumber(NumberUtils.java:456)
	at org.apache.commons.lang3.math.NumberUtilsTest.TestLang747(NumberUtilsTest.java:264)

testStringCreateNumberEnsureNoPrecisionLoss(org.apache.commons.lang3.math.NumberUtilsTest)  Time elapsed: 0 sec  <<< ERROR!
java.lang.NumberFormatException: A blank string is not a valid number
	at org.apache.commons.lang3.math.NumberUtils.createNumber(NumberUtils.java:456)
	at org.apache.commons.lang3.math.NumberUtilsTest.testStringCreateNumberEnsureNoPrecisionLoss(NumberUtilsTest.java:128)

Running org.apache.commons.lang3.math.IEEE754rUtilsTest
Tests run: 3, Failures: 0, Errors: 0, Skipped: 0, Time elapsed: 0.002 sec - in org.apache.commons.lang3.math.IEEE754rUtilsTest
Running org.apache.commons.lang3.math.FractionTest
Tests run: 25, Failures: 0, Errors: 0, Skipped: 0, Time elapsed: 0.121 sec - in org.apache.commons.lang3.math.FractionTest
Running org.apache.commons.lang3.BooleanUtilsTest
Tests run: 72, Failures: 0, Errors: 0, Skipped: 0, Time elapsed: 0.027 sec - in org.apache.commons.lang3.BooleanUtilsTest
Running org.apache.commons.lang3.CharSequenceUtilsTest
Tests run: 2, Failures: 0, Errors: 0, Skipped: 0, Time elapsed: 0.009 sec - in org.apache.commons.lang3.CharSequenceUtilsTest
Running org.apache.commons.lang3.CharSetUtilsTest
Tests run: 11, Failures: 0, Errors: 0, Skipped: 0, Time elapsed: 0.003 sec - in org.apache.commons.lang3.CharSetUtilsTest
Running org.apache.commons.lang3.ArrayUtilsAddTest
Tests run: 13, Failures: 0, Errors: 0, Skipped: 0, Time elapsed: 0.002 sec - in org.apache.commons.lang3.ArrayUtilsAddTest
Running org.apache.commons.lang3.CharEncodingTest
Tests run: 6, Failures: 0, Errors: 0, Skipped: 0, Time elapsed: 0.06 sec - in org.apache.commons.lang3.CharEncodingTest
Running org.apache.commons.lang3.ClassUtilsTest
Tests run: 57, Failures: 0, Errors: 0, Skipped: 0, Time elapsed: 0.05 sec - in org.apache.commons.lang3.ClassUtilsTest
Running org.apache.commons.lang3.RangeTest
Tests run: 24, Failures: 0, Errors: 0, Skipped: 0, Time elapsed: 0.04 sec - in org.apache.commons.lang3.RangeTest
Running org.apache.commons.lang3.event.EventUtilsTest
Tests run: 8, Failures: 0, Errors: 0, Skipped: 0, Time elapsed: 0.032 sec - in org.apache.commons.lang3.event.EventUtilsTest
Running org.apache.commons.lang3.event.EventListenerSupportTest
Tests run: 9, Failures: 0, Errors: 0, Skipped: 0, Time elapsed: 0.025 sec - in org.apache.commons.lang3.event.EventListenerSupportTest
Running org.apache.commons.lang3.ArrayUtilsTest
Tests run: 205, Failures: 0, Errors: 0, Skipped: 0, Time elapsed: 0.096 sec - in org.apache.commons.lang3.ArrayUtilsTest
Running org.apache.commons.lang3.CharUtilsTest
Tests run: 24, Failures: 0, Errors: 0, Skipped: 0, Time elapsed: 0.011 sec - in org.apache.commons.lang3.CharUtilsTest
Running org.apache.commons.lang3.NotImplementedExceptionTest
Tests run: 1, Failures: 0, Errors: 0, Skipped: 0, Time elapsed: 0.002 sec - in org.apache.commons.lang3.NotImplementedExceptionTest
Running org.apache.commons.lang3.StringUtilsEqualsIndexOfTest
Tests run: 50, Failures: 0, Errors: 0, Skipped: 0, Time elapsed: 0.023 sec - in org.apache.commons.lang3.StringUtilsEqualsIndexOfTest
Running org.apache.commons.lang3.RandomUtilsTest
Tests run: 23, Failures: 0, Errors: 0, Skipped: 0, Time elapsed: 0.01 sec - in org.apache.commons.lang3.RandomUtilsTest

Results :

Failed tests: 
  StringUtilsTest.testDefaultIfBlank_CharBuffers:1726 expected:<[abc]> but was:<[NULL]>
  StringUtilsTest.testDefaultIfBlank_StringBuffers:1705 expected:<[abc]> but was:<[NULL]>
  StringUtilsTest.testDefaultIfBlank_StringBuilders:1684 expected:<[abc]> but was:<[NULL]>
  StringUtilsTest.testDefaultIfBlank_StringString:1663 expected:<[abc]> but was:<[NULL]>
  StringUtilsTest.testIsAnyBlank:197 null
  StringUtilsTest.testIsBlank:174 null
  StringUtilsTest.testIsNoneBlank:210 null
  StringUtilsTest.testIsNotBlank:183 null
  StringUtilsTrimEmptyTest.testIsBlank:59 null
  StringUtilsTrimEmptyTest.testIsNotBlank:68 null
  NumberUtilsTest.testIsNumber:1192->compareIsNumberWithCreateNumber:1271 Expecting true for isNumber/createNumber using "12345" but got true and false
  NumberUtilsTest.testLANG971:1249->compareIsNumberWithCreateNumber:1271 Expecting true for isNumber/createNumber using "07" but got true and false
  NumberUtilsTest.testLANG972:1261->compareIsNumberWithCreateNumber:1271 Expecting true for isNumber/createNumber using "0xABCD" but got true and false
  NumberUtilsTest.testLANG992:1255->compareIsNumberWithCreateNumber:1271 Expecting true for isNumber/createNumber using "0.0" but got true and false

Tests in error: 
  ValidateTest.testNotBlankMsgNotBlankStringShouldNotThrow:498 » IllegalArgument
  ValidateTest.testNotBlankMsgNotBlankStringWithNewlinesShouldNotThrow:522 » IllegalArgument
  ValidateTest.testNotBlankMsgNotBlankStringWithWhitespacesShouldNotThrow:510 » IllegalArgument
  ValidateTest.testNotBlankNotBlankStringShouldNotThrow:462 » IllegalArgument Th...
  ValidateTest.testNotBlankNotBlankStringWithNewlinesShouldNotThrow:486 » IllegalArgument
  ValidateTest.testNotBlankNotBlankStringWithWhitespacesShouldNotThrow:474 » IllegalArgument
  ValidateTest.testNotBlankReturnValues1:531 » IllegalArgument The validated cha...
  ValidateTest.testNotBlankReturnValues2:538 » IllegalArgument Message
  NumberUtilsTest.TestLang747:264 » NumberFormat A blank string is not a valid n...
  NumberUtilsTest.testCreateBigDecimal:468 » NumberFormat A blank string is not ...
  NumberUtilsTest.testCreateNumber:198 » NumberFormat A blank string is not a va...
  NumberUtilsTest.testCreateNumberMagnitude:328 » NumberFormat A blank string is...
  NumberUtilsTest.testLang1087:252 » NumberFormat A blank string is not a valid ...
  NumberUtilsTest.testLang300:1351 » NumberFormat A blank string is not a valid ...
  NumberUtilsTest.testStringCreateNumberEnsureNoPrecisionLoss:128 » NumberFormat
  FieldUtilsTest.testGetDeclaredField:226 » IllegalArgument The field name must ...
  FieldUtilsTest.testGetDeclaredFieldForceAccess:265 » IllegalArgument The field...
  FieldUtilsTest.testGetField:73 » IllegalArgument The field name must not be bl...
  FieldUtilsTest.testGetFieldForceAccess:112 » IllegalArgument The field name mu...
  FieldUtilsTest.testReadDeclaredNamedField:692 » IllegalArgument The field name...
  FieldUtilsTest.testReadDeclaredNamedFieldForceAccess:776 » IllegalArgument The...
  FieldUtilsTest.testReadDeclaredNamedStaticField:440 » IllegalArgument The fiel...
  FieldUtilsTest.testReadDeclaredNamedStaticFieldForceAccess:463 » IllegalArgument
  FieldUtilsTest.testReadField:481 » IllegalArgument The field name must not be ...
  FieldUtilsTest.testReadFieldForceAccess:508 » IllegalArgument The field name m...
  FieldUtilsTest.testReadNamedField:539 » IllegalArgument The field name must no...
  FieldUtilsTest.testReadNamedFieldForceAccess:614 » IllegalArgument The field n...
  FieldUtilsTest.testReadNamedStaticField:340 » IllegalArgument The field name m...
  FieldUtilsTest.testReadNamedStaticFieldForceAccess:390 » IllegalArgument The f...
  FieldUtilsTest.testReadStaticField:304 » IllegalArgument The field name must n...
  FieldUtilsTest.testReadStaticFieldForceAccess:322 » IllegalArgument The field ...
  FieldUtilsTest.testWriteDeclaredNamedField:1227 » IllegalArgument The field na...
  FieldUtilsTest.testWriteDeclaredNamedFieldForceAccess:1289 » IllegalArgument T...
  FieldUtilsTest.testWriteDeclaredNamedStaticField:990 » IllegalArgument The fie...
  FieldUtilsTest.testWriteDeclaredNamedStaticFieldForceAccess:1038 » IllegalArgument
  FieldUtilsTest.testWriteNamedField:1118 » IllegalArgument The field name must ...
  FieldUtilsTest.testWriteNamedFieldForceAccess:1172 » IllegalArgument The field...
  FieldUtilsTest.testWriteNamedStaticField:906 » IllegalArgument The field name ...
  FieldUtilsTest.testWriteNamedStaticFieldForceAccess:954 » IllegalArgument The ...


Tests run: 3526, Failures: 14, Errors: 39, Skipped: 97

[INFO] ------------------------------------------------------------------------
[INFO] BUILD FAILURE
[INFO] ------------------------------------------------------------------------
[INFO] Total time: 44.124s
[INFO] Finished at: Tue Aug 04 00:44:17 BST 2015
[INFO] Final Memory: 25M/500M
[INFO] ------------------------------------------------------------------------
[ERROR] Failed to execute goal org.apache.maven.plugins:maven-surefire-plugin:2.18:test (default-test) on project commons-lang3: There are test failures.
[ERROR] 
[ERROR] Please refer to /home/perham/Study/LittleDarwin/Cases/commons-lang3-3.4-src/target/surefire-reports for the individual test results.
[ERROR] -> [Help 1]
[ERROR] 
[ERROR] To see the full stack trace of the errors, re-run Maven with the -e switch.
[ERROR] Re-run Maven using the -X switch to enable full debug logging.
[ERROR] 
[ERROR] For more information about the errors and possible solutions, please read the following articles:
[ERROR] [Help 1] http://cwiki.apache.org/confluence/display/MAVEN/MojoFailureException
