[INFO] Scanning for projects...
[INFO]                                                                         
[INFO] ------------------------------------------------------------------------
[INFO] Building Apache Commons Lang 3.4
[INFO] ------------------------------------------------------------------------
[INFO] 
[INFO] --- maven-enforcer-plugin:1.3.1:enforce (enforce-maven-3) @ commons-lang3 ---
[INFO] 
[INFO] --- build-helper-maven-plugin:1.8:parse-version (parse-version) @ commons-lang3 ---
[INFO] 
[INFO] --- maven-antrun-plugin:1.8:run (javadoc.resources) @ commons-lang3 ---
[INFO] Executing tasks

main:
[INFO] Executed tasks
[INFO] 
[INFO] --- maven-remote-resources-plugin:1.5:process (default) @ commons-lang3 ---
[INFO] 
[INFO] --- buildnumber-maven-plugin:1.3:create (default) @ commons-lang3 ---
[INFO] Executing: /bin/sh -c cd /home/perham/Study/LittleDarwin/Cases/commons-lang3-3.4-src && svn --non-interactive info
[INFO] Working directory: /home/perham/Study/LittleDarwin/Cases/commons-lang3-3.4-src
[INFO] Storing buildNumber: ?????? at timestamp: 1438625415614
[INFO] Executing: /bin/sh -c cd /home/perham/Study/LittleDarwin/Cases/commons-lang3-3.4-src && svn --non-interactive info
[INFO] Working directory: /home/perham/Study/LittleDarwin/Cases/commons-lang3-3.4-src
[INFO] Storing buildScmBranch: UNKNOWN_BRANCH
[INFO] 
[INFO] --- maven-resources-plugin:2.7:resources (default-resources) @ commons-lang3 ---
[INFO] Using 'ISO-8859-1' encoding to copy filtered resources.
[INFO] Copying 0 resource
[INFO] Copying 2 resources to META-INF
[INFO] 
[INFO] --- maven-compiler-plugin:3.2:compile (default-compile) @ commons-lang3 ---
[INFO] Changes detected - recompiling the module!
[INFO] Compiling 133 source files to /home/perham/Study/LittleDarwin/Cases/commons-lang3-3.4-src/target/classes
[INFO] /home/perham/Study/LittleDarwin/Cases/commons-lang3-3.4-src/src/main/java/org/apache/commons/lang3/SerializationUtils.java: /home/perham/Study/LittleDarwin/Cases/commons-lang3-3.4-src/src/main/java/org/apache/commons/lang3/SerializationUtils.java uses unchecked or unsafe operations.
[INFO] /home/perham/Study/LittleDarwin/Cases/commons-lang3-3.4-src/src/main/java/org/apache/commons/lang3/SerializationUtils.java: Recompile with -Xlint:unchecked for details.
[INFO] 
[INFO] --- maven-bundle-plugin:2.5.3:manifest (bundle-manifest) @ commons-lang3 ---
[INFO] 
[INFO] --- animal-sniffer-maven-plugin:1.13:check (checkAPIcompatibility) @ commons-lang3 ---
[INFO] Checking unresolved references to org.codehaus.mojo.signature:java16:1.0
[INFO] 
[INFO] --- maven-resources-plugin:2.7:testResources (default-testResources) @ commons-lang3 ---
[INFO] Using 'ISO-8859-1' encoding to copy filtered resources.
[INFO] Copying 2 resources
[INFO] Copying 2 resources to META-INF
[INFO] 
[INFO] --- maven-compiler-plugin:3.2:testCompile (default-testCompile) @ commons-lang3 ---
[INFO] Nothing to compile - all classes are up to date
[INFO] 
[INFO] --- maven-surefire-plugin:2.18:test (default-test) @ commons-lang3 ---
[INFO] Surefire report directory: /home/perham/Study/LittleDarwin/Cases/commons-lang3-3.4-src/target/surefire-reports

-------------------------------------------------------
 T E S T S
-------------------------------------------------------
Running org.apache.commons.lang3.ValidateTest
Tests run: 63, Failures: 0, Errors: 8, Skipped: 0, Time elapsed: 0.041 sec <<< FAILURE! - in org.apache.commons.lang3.ValidateTest
testNotBlankNotBlankStringWithNewlinesShouldNotThrow(org.apache.commons.lang3.ValidateTest)  Time elapsed: 0.005 sec  <<< ERROR!
java.lang.StringIndexOutOfBoundsException: String index out of range: -1
	at java.lang.String.charAt(String.java:658)
	at org.apache.commons.lang3.StringUtils.isBlank(StringUtils.java:35)
	at org.apache.commons.lang3.Validate.notBlank(Validate.java:450)
	at org.apache.commons.lang3.Validate.notBlank(Validate.java:476)
	at org.apache.commons.lang3.ValidateTest.testNotBlankNotBlankStringWithNewlinesShouldNotThrow(ValidateTest.java:486)

testNotBlankMsgBlankStringShouldThrow(org.apache.commons.lang3.ValidateTest)  Time elapsed: 0.001 sec  <<< ERROR!
java.lang.StringIndexOutOfBoundsException: String index out of range: -1
	at java.lang.String.charAt(String.java:658)
	at org.apache.commons.lang3.StringUtils.isBlank(StringUtils.java:35)
	at org.apache.commons.lang3.Validate.notBlank(Validate.java:450)
	at org.apache.commons.lang3.ValidateTest.testNotBlankMsgBlankStringShouldThrow(ValidateTest.java:415)

testNotBlankBlankStringWithNewlinesShouldThrow(org.apache.commons.lang3.ValidateTest)  Time elapsed: 0.002 sec  <<< ERROR!
java.lang.StringIndexOutOfBoundsException: String index out of range: -1
	at java.lang.String.charAt(String.java:658)
	at org.apache.commons.lang3.StringUtils.isBlank(StringUtils.java:35)
	at org.apache.commons.lang3.Validate.notBlank(Validate.java:450)
	at org.apache.commons.lang3.Validate.notBlank(Validate.java:476)
	at org.apache.commons.lang3.ValidateTest.testNotBlankBlankStringWithNewlinesShouldThrow(ValidateTest.java:399)

testNotBlankMsgNotBlankStringWithWhitespacesShouldNotThrow(org.apache.commons.lang3.ValidateTest)  Time elapsed: 0.001 sec  <<< ERROR!
java.lang.StringIndexOutOfBoundsException: String index out of range: -1
	at java.lang.String.charAt(String.java:658)
	at org.apache.commons.lang3.StringUtils.isBlank(StringUtils.java:35)
	at org.apache.commons.lang3.Validate.notBlank(Validate.java:450)
	at org.apache.commons.lang3.ValidateTest.testNotBlankMsgNotBlankStringWithWhitespacesShouldNotThrow(ValidateTest.java:510)

testNotBlankMsgNotBlankStringWithNewlinesShouldNotThrow(org.apache.commons.lang3.ValidateTest)  Time elapsed: 0 sec  <<< ERROR!
java.lang.StringIndexOutOfBoundsException: String index out of range: -1
	at java.lang.String.charAt(String.java:658)
	at org.apache.commons.lang3.StringUtils.isBlank(StringUtils.java:35)
	at org.apache.commons.lang3.Validate.notBlank(Validate.java:450)
	at org.apache.commons.lang3.ValidateTest.testNotBlankMsgNotBlankStringWithNewlinesShouldNotThrow(ValidateTest.java:522)

testNotBlankMsgBlankStringWithWhitespacesShouldThrow(org.apache.commons.lang3.ValidateTest)  Time elapsed: 0 sec  <<< ERROR!
java.lang.StringIndexOutOfBoundsException: String index out of range: -1
	at java.lang.String.charAt(String.java:658)
	at org.apache.commons.lang3.StringUtils.isBlank(StringUtils.java:35)
	at org.apache.commons.lang3.Validate.notBlank(Validate.java:450)
	at org.apache.commons.lang3.ValidateTest.testNotBlankMsgBlankStringWithWhitespacesShouldThrow(ValidateTest.java:431)

testNotBlankNotBlankStringWithWhitespacesShouldNotThrow(org.apache.commons.lang3.ValidateTest)  Time elapsed: 0.001 sec  <<< ERROR!
java.lang.StringIndexOutOfBoundsException: String index out of range: -1
	at java.lang.String.charAt(String.java:658)
	at org.apache.commons.lang3.StringUtils.isBlank(StringUtils.java:35)
	at org.apache.commons.lang3.Validate.notBlank(Validate.java:450)
	at org.apache.commons.lang3.Validate.notBlank(Validate.java:476)
	at org.apache.commons.lang3.ValidateTest.testNotBlankNotBlankStringWithWhitespacesShouldNotThrow(ValidateTest.java:474)

testNotBlankBlankStringWithWhitespacesShouldThrow(org.apache.commons.lang3.ValidateTest)  Time elapsed: 0.001 sec  <<< ERROR!
java.lang.StringIndexOutOfBoundsException: String index out of range: -1
	at java.lang.String.charAt(String.java:658)
	at org.apache.commons.lang3.StringUtils.isBlank(StringUtils.java:35)
	at org.apache.commons.lang3.Validate.notBlank(Validate.java:450)
	at org.apache.commons.lang3.Validate.notBlank(Validate.java:476)
	at org.apache.commons.lang3.ValidateTest.testNotBlankBlankStringWithWhitespacesShouldThrow(ValidateTest.java:383)

Running org.apache.commons.lang3.LocaleUtilsTest
Tests run: 15, Failures: 0, Errors: 0, Skipped: 0, Time elapsed: 0.014 sec - in org.apache.commons.lang3.LocaleUtilsTest
Running org.apache.commons.lang3.tuple.MutableTripleTest
Tests run: 8, Failures: 0, Errors: 0, Skipped: 0, Time elapsed: 0.008 sec - in org.apache.commons.lang3.tuple.MutableTripleTest
Running org.apache.commons.lang3.tuple.TripleTest
Tests run: 10, Failures: 0, Errors: 0, Skipped: 0, Time elapsed: 0.008 sec - in org.apache.commons.lang3.tuple.TripleTest
Running org.apache.commons.lang3.tuple.ImmutablePairTest
Tests run: 6, Failures: 0, Errors: 0, Skipped: 0, Time elapsed: 0 sec - in org.apache.commons.lang3.tuple.ImmutablePairTest
Running org.apache.commons.lang3.tuple.MutablePairTest
Tests run: 8, Failures: 0, Errors: 0, Skipped: 0, Time elapsed: 0.001 sec - in org.apache.commons.lang3.tuple.MutablePairTest
Running org.apache.commons.lang3.tuple.ImmutableTripleTest
Tests run: 6, Failures: 0, Errors: 0, Skipped: 0, Time elapsed: 0.001 sec - in org.apache.commons.lang3.tuple.ImmutableTripleTest
Running org.apache.commons.lang3.tuple.PairTest
Tests run: 9, Failures: 0, Errors: 0, Skipped: 0, Time elapsed: 0.001 sec - in org.apache.commons.lang3.tuple.PairTest
Running org.apache.commons.lang3.StringUtilsIsTest
Tests run: 8, Failures: 0, Errors: 0, Skipped: 0, Time elapsed: 0.004 sec - in org.apache.commons.lang3.StringUtilsIsTest
Running org.apache.commons.lang3.JavaVersionTest
Tests run: 3, Failures: 0, Errors: 0, Skipped: 0, Time elapsed: 0 sec - in org.apache.commons.lang3.JavaVersionTest
Running org.apache.commons.lang3.builder.NoFieldNamesToStringStyleTest
Tests run: 8, Failures: 0, Errors: 0, Skipped: 0, Time elapsed: 0.01 sec - in org.apache.commons.lang3.builder.NoFieldNamesToStringStyleTest
Running org.apache.commons.lang3.builder.ShortPrefixToStringStyleTest
Tests run: 8, Failures: 0, Errors: 0, Skipped: 0, Time elapsed: 0.001 sec - in org.apache.commons.lang3.builder.ShortPrefixToStringStyleTest
Running org.apache.commons.lang3.builder.DiffResultTest
Tests run: 9, Failures: 0, Errors: 0, Skipped: 0, Time elapsed: 0.005 sec - in org.apache.commons.lang3.builder.DiffResultTest
Running org.apache.commons.lang3.builder.CompareToBuilderTest
Tests run: 48, Failures: 0, Errors: 0, Skipped: 0, Time elapsed: 0.023 sec - in org.apache.commons.lang3.builder.CompareToBuilderTest
Running org.apache.commons.lang3.builder.MultilineRecursiveToStringStyleTest
Tests run: 10, Failures: 0, Errors: 0, Skipped: 0, Time elapsed: 0.005 sec - in org.apache.commons.lang3.builder.MultilineRecursiveToStringStyleTest
Running org.apache.commons.lang3.builder.RecursiveToStringStyleTest
Tests run: 8, Failures: 0, Errors: 0, Skipped: 0, Time elapsed: 0.001 sec - in org.apache.commons.lang3.builder.RecursiveToStringStyleTest
Running org.apache.commons.lang3.builder.DefaultToStringStyleTest
Tests run: 8, Failures: 0, Errors: 0, Skipped: 0, Time elapsed: 0.003 sec - in org.apache.commons.lang3.builder.DefaultToStringStyleTest
Running org.apache.commons.lang3.builder.ReflectionToStringBuilderExcludeTest
Tests run: 11, Failures: 0, Errors: 0, Skipped: 0, Time elapsed: 0 sec - in org.apache.commons.lang3.builder.ReflectionToStringBuilderExcludeTest
Running org.apache.commons.lang3.builder.StandardToStringStyleTest
Tests run: 8, Failures: 0, Errors: 0, Skipped: 0, Time elapsed: 0.001 sec - in org.apache.commons.lang3.builder.StandardToStringStyleTest
Running org.apache.commons.lang3.builder.ToStringStyleTest
Tests run: 12, Failures: 0, Errors: 0, Skipped: 0, Time elapsed: 0.003 sec - in org.apache.commons.lang3.builder.ToStringStyleTest
Running org.apache.commons.lang3.builder.DiffTest
Tests run: 4, Failures: 0, Errors: 0, Skipped: 0, Time elapsed: 0.001 sec - in org.apache.commons.lang3.builder.DiffTest
Running org.apache.commons.lang3.builder.SimpleToStringStyleTest
Tests run: 8, Failures: 0, Errors: 0, Skipped: 0, Time elapsed: 0.003 sec - in org.apache.commons.lang3.builder.SimpleToStringStyleTest
Running org.apache.commons.lang3.builder.MultiLineToStringStyleTest
Tests run: 8, Failures: 0, Errors: 0, Skipped: 0, Time elapsed: 0.004 sec - in org.apache.commons.lang3.builder.MultiLineToStringStyleTest
Running org.apache.commons.lang3.builder.ToStringStyleConcurrencyTest
Tests run: 3, Failures: 0, Errors: 0, Skipped: 0, Time elapsed: 4.225 sec - in org.apache.commons.lang3.builder.ToStringStyleConcurrencyTest
Running org.apache.commons.lang3.builder.ReflectionToStringBuilderMutateInspectConcurrencyTest
Tests run: 1, Failures: 0, Errors: 0, Skipped: 1, Time elapsed: 0 sec - in org.apache.commons.lang3.builder.ReflectionToStringBuilderMutateInspectConcurrencyTest
Running org.apache.commons.lang3.builder.ToStringBuilderTest
Tests run: 74, Failures: 0, Errors: 0, Skipped: 1, Time elapsed: 0.059 sec - in org.apache.commons.lang3.builder.ToStringBuilderTest
Running org.apache.commons.lang3.builder.EqualsBuilderTest
Tests run: 48, Failures: 0, Errors: 0, Skipped: 0, Time elapsed: 0.034 sec - in org.apache.commons.lang3.builder.EqualsBuilderTest
Running org.apache.commons.lang3.builder.HashCodeBuilderAndEqualsBuilderTest
Tests run: 4, Failures: 0, Errors: 0, Skipped: 0, Time elapsed: 0 sec - in org.apache.commons.lang3.builder.HashCodeBuilderAndEqualsBuilderTest
Running org.apache.commons.lang3.builder.ReflectionToStringBuilderConcurrencyTest
Tests run: 3, Failures: 0, Errors: 0, Skipped: 3, Time elapsed: 0 sec - in org.apache.commons.lang3.builder.ReflectionToStringBuilderConcurrencyTest
Running org.apache.commons.lang3.builder.JsonToStringStyleTest
Tests run: 9, Failures: 0, Errors: 0, Skipped: 0, Time elapsed: 0.001 sec - in org.apache.commons.lang3.builder.JsonToStringStyleTest
Running org.apache.commons.lang3.builder.NoClassNameToStringStyleTest
Tests run: 8, Failures: 0, Errors: 0, Skipped: 0, Time elapsed: 0 sec - in org.apache.commons.lang3.builder.NoClassNameToStringStyleTest
Running org.apache.commons.lang3.builder.DiffBuilderTest
Tests run: 30, Failures: 0, Errors: 0, Skipped: 0, Time elapsed: 0.025 sec - in org.apache.commons.lang3.builder.DiffBuilderTest
Running org.apache.commons.lang3.builder.HashCodeBuilderTest
Tests run: 44, Failures: 0, Errors: 0, Skipped: 0, Time elapsed: 0.018 sec - in org.apache.commons.lang3.builder.HashCodeBuilderTest
Running org.apache.commons.lang3.concurrent.AtomicInitializerTest
Tests run: 3, Failures: 0, Errors: 0, Skipped: 0, Time elapsed: 0.008 sec - in org.apache.commons.lang3.concurrent.AtomicInitializerTest
Running org.apache.commons.lang3.concurrent.CallableBackgroundInitializerTest
Tests run: 4, Failures: 0, Errors: 0, Skipped: 0, Time elapsed: 0.001 sec - in org.apache.commons.lang3.concurrent.CallableBackgroundInitializerTest
Running org.apache.commons.lang3.concurrent.BackgroundInitializerTest
Tests run: 15, Failures: 0, Errors: 0, Skipped: 0, Time elapsed: 0.018 sec - in org.apache.commons.lang3.concurrent.BackgroundInitializerTest
Running org.apache.commons.lang3.concurrent.LazyInitializerTest
Tests run: 3, Failures: 0, Errors: 0, Skipped: 0, Time elapsed: 0.009 sec - in org.apache.commons.lang3.concurrent.LazyInitializerTest
Running org.apache.commons.lang3.concurrent.BasicThreadFactoryTest
Tests run: 15, Failures: 0, Errors: 0, Skipped: 0, Time elapsed: 0.033 sec - in org.apache.commons.lang3.concurrent.BasicThreadFactoryTest
Running org.apache.commons.lang3.concurrent.ConstantInitializerTest
Tests run: 7, Failures: 0, Errors: 0, Skipped: 0, Time elapsed: 0.001 sec - in org.apache.commons.lang3.concurrent.ConstantInitializerTest
Running org.apache.commons.lang3.concurrent.MultiBackgroundInitializerTest
Tests run: 17, Failures: 0, Errors: 0, Skipped: 0, Time elapsed: 0.077 sec - in org.apache.commons.lang3.concurrent.MultiBackgroundInitializerTest
Running org.apache.commons.lang3.concurrent.AtomicSafeInitializerTest
Tests run: 4, Failures: 0, Errors: 0, Skipped: 0, Time elapsed: 0.008 sec - in org.apache.commons.lang3.concurrent.AtomicSafeInitializerTest
Running org.apache.commons.lang3.concurrent.ConcurrentUtilsTest
Tests run: 40, Failures: 0, Errors: 0, Skipped: 0, Time elapsed: 0.018 sec - in org.apache.commons.lang3.concurrent.ConcurrentUtilsTest
Running org.apache.commons.lang3.concurrent.TimedSemaphoreTest
Tests run: 15, Failures: 0, Errors: 0, Skipped: 0, Time elapsed: 1.19 sec - in org.apache.commons.lang3.concurrent.TimedSemaphoreTest
Running org.apache.commons.lang3.StringUtilsSubstringTest
Tests run: 14, Failures: 0, Errors: 0, Skipped: 0, Time elapsed: 0.007 sec - in org.apache.commons.lang3.StringUtilsSubstringTest
Running org.apache.commons.lang3.SystemUtilsTest
Tests run: 12, Failures: 0, Errors: 0, Skipped: 0, Time elapsed: 0.001 sec - in org.apache.commons.lang3.SystemUtilsTest
Running org.apache.commons.lang3.CharRangeTest
Tests run: 16, Failures: 0, Errors: 0, Skipped: 0, Time elapsed: 0.03 sec - in org.apache.commons.lang3.CharRangeTest
Running org.apache.commons.lang3.CharSetTest
Tests run: 14, Failures: 0, Errors: 0, Skipped: 0, Time elapsed: 0.007 sec - in org.apache.commons.lang3.CharSetTest
Running org.apache.commons.lang3.StringUtilsStartsEndsWithTest
Tests run: 6, Failures: 0, Errors: 0, Skipped: 0, Time elapsed: 0.002 sec - in org.apache.commons.lang3.StringUtilsStartsEndsWithTest
Running org.apache.commons.lang3.RandomStringUtilsTest
Tests run: 11, Failures: 0, Errors: 0, Skipped: 0, Time elapsed: 0.039 sec - in org.apache.commons.lang3.RandomStringUtilsTest
Running org.apache.commons.lang3.SerializationUtilsTest
Tests run: 26, Failures: 0, Errors: 0, Skipped: 0, Time elapsed: 0.048 sec - in org.apache.commons.lang3.SerializationUtilsTest
Running org.apache.commons.lang3.time.StopWatchTest
Tests run: 8, Failures: 0, Errors: 0, Skipped: 0, Time elapsed: 4.766 sec - in org.apache.commons.lang3.time.StopWatchTest
Running org.apache.commons.lang3.time.DateUtilsRoundingTest
Tests run: 22, Failures: 0, Errors: 0, Skipped: 0, Time elapsed: 0.154 sec - in org.apache.commons.lang3.time.DateUtilsRoundingTest
Running org.apache.commons.lang3.time.FastDateParserTest
Tests run: 33, Failures: 0, Errors: 0, Skipped: 0, Time elapsed: 1.996 sec - in org.apache.commons.lang3.time.FastDateParserTest
Running org.apache.commons.lang3.time.FastDateFormat_ParserTest
Tests run: 33, Failures: 0, Errors: 0, Skipped: 0, Time elapsed: 0.671 sec - in org.apache.commons.lang3.time.FastDateFormat_ParserTest
Running org.apache.commons.lang3.time.DurationFormatUtilsTest
Tests run: 25, Failures: 0, Errors: 0, Skipped: 0, Time elapsed: 0.836 sec - in org.apache.commons.lang3.time.DurationFormatUtilsTest
Running org.apache.commons.lang3.time.DateFormatUtilsTest
Tests run: 10, Failures: 0, Errors: 0, Skipped: 0, Time elapsed: 0.002 sec - in org.apache.commons.lang3.time.DateFormatUtilsTest
Running org.apache.commons.lang3.time.DateUtilsFragmentTest
Tests run: 57, Failures: 0, Errors: 0, Skipped: 0, Time elapsed: 0.009 sec - in org.apache.commons.lang3.time.DateUtilsFragmentTest
Running org.apache.commons.lang3.time.FastDatePrinterTimeZonesTest
Tests run: 617, Failures: 0, Errors: 0, Skipped: 0, Time elapsed: 0.211 sec - in org.apache.commons.lang3.time.FastDatePrinterTimeZonesTest
Running org.apache.commons.lang3.time.FastDateFormatTest
>>FastDateFormatTest: FastDateParser:34184  SimpleDateFormat:3708
Tests run: 14, Failures: 0, Errors: 0, Skipped: 0, Time elapsed: 4.083 sec - in org.apache.commons.lang3.time.FastDateFormatTest
Running org.apache.commons.lang3.time.FastDateFormat_PrinterTest
Tests run: 17, Failures: 0, Errors: 0, Skipped: 0, Time elapsed: 0.01 sec - in org.apache.commons.lang3.time.FastDateFormat_PrinterTest
Running org.apache.commons.lang3.time.FastDatePrinterTest
Tests run: 17, Failures: 0, Errors: 0, Skipped: 0, Time elapsed: 0.003 sec - in org.apache.commons.lang3.time.FastDatePrinterTest
Running org.apache.commons.lang3.time.FastDateParserSDFTest
Tests run: 276, Failures: 0, Errors: 0, Skipped: 92, Time elapsed: 0.065 sec - in org.apache.commons.lang3.time.FastDateParserSDFTest
Running org.apache.commons.lang3.time.DateUtilsTest
DateUtilsTest: Default Locale=en_US
Tests run: 38, Failures: 0, Errors: 0, Skipped: 0, Time elapsed: 0.021 sec - in org.apache.commons.lang3.time.DateUtilsTest
Running org.apache.commons.lang3.reflect.InheritanceUtilsTest
Tests run: 9, Failures: 0, Errors: 0, Skipped: 0, Time elapsed: 0.003 sec - in org.apache.commons.lang3.reflect.InheritanceUtilsTest
Running org.apache.commons.lang3.reflect.MethodUtilsTest
Tests run: 23, Failures: 0, Errors: 0, Skipped: 0, Time elapsed: 0.033 sec - in org.apache.commons.lang3.reflect.MethodUtilsTest
Running org.apache.commons.lang3.reflect.ConstructorUtilsTest
Tests run: 7, Failures: 0, Errors: 0, Skipped: 0, Time elapsed: 0.004 sec - in org.apache.commons.lang3.reflect.ConstructorUtilsTest
Running org.apache.commons.lang3.reflect.FieldUtilsTest
Tests run: 64, Failures: 0, Errors: 10, Skipped: 0, Time elapsed: 0.031 sec <<< FAILURE! - in org.apache.commons.lang3.reflect.FieldUtilsTest
testReadDeclaredNamedField(org.apache.commons.lang3.reflect.FieldUtilsTest)  Time elapsed: 0.001 sec  <<< ERROR!
java.lang.StringIndexOutOfBoundsException: String index out of range: -1
	at java.lang.String.charAt(String.java:658)
	at org.apache.commons.lang3.StringUtils.isBlank(StringUtils.java:35)
	at org.apache.commons.lang3.StringUtils.isNotBlank(StringUtils.java:37)
	at org.apache.commons.lang3.reflect.FieldUtils.getDeclaredField(FieldUtils.java:170)
	at org.apache.commons.lang3.reflect.FieldUtils.readDeclaredField(FieldUtils.java:511)
	at org.apache.commons.lang3.reflect.FieldUtils.readDeclaredField(FieldUtils.java:488)
	at org.apache.commons.lang3.reflect.FieldUtilsTest.testReadDeclaredNamedField(FieldUtilsTest.java:673)

testReadNamedStaticField(org.apache.commons.lang3.reflect.FieldUtilsTest)  Time elapsed: 0.001 sec  <<< ERROR!
java.lang.StringIndexOutOfBoundsException: String index out of range: -1
	at java.lang.String.charAt(String.java:658)
	at org.apache.commons.lang3.StringUtils.isBlank(StringUtils.java:35)
	at org.apache.commons.lang3.StringUtils.isNotBlank(StringUtils.java:37)
	at org.apache.commons.lang3.reflect.FieldUtils.getField(FieldUtils.java:87)
	at org.apache.commons.lang3.reflect.FieldUtils.readStaticField(FieldUtils.java:338)
	at org.apache.commons.lang3.reflect.FieldUtils.readStaticField(FieldUtils.java:316)
	at org.apache.commons.lang3.reflect.FieldUtilsTest.testReadNamedStaticField(FieldUtilsTest.java:367)

testReadDeclaredNamedFieldForceAccess(org.apache.commons.lang3.reflect.FieldUtilsTest)  Time elapsed: 0 sec  <<< ERROR!
java.lang.StringIndexOutOfBoundsException: String index out of range: -1
	at java.lang.String.charAt(String.java:658)
	at org.apache.commons.lang3.StringUtils.isBlank(StringUtils.java:35)
	at org.apache.commons.lang3.StringUtils.isNotBlank(StringUtils.java:37)
	at org.apache.commons.lang3.reflect.FieldUtils.getDeclaredField(FieldUtils.java:170)
	at org.apache.commons.lang3.reflect.FieldUtils.readDeclaredField(FieldUtils.java:511)
	at org.apache.commons.lang3.reflect.FieldUtilsTest.testReadDeclaredNamedFieldForceAccess(FieldUtilsTest.java:757)

testGetFieldIllegalArgumentException4(org.apache.commons.lang3.reflect.FieldUtilsTest)  Time elapsed: 0.001 sec  <<< ERROR!
java.lang.Exception: Unexpected exception, expected<java.lang.IllegalArgumentException> but was<java.lang.StringIndexOutOfBoundsException>
	at java.lang.String.charAt(String.java:658)
	at org.apache.commons.lang3.StringUtils.isBlank(StringUtils.java:35)
	at org.apache.commons.lang3.StringUtils.isNotBlank(StringUtils.java:37)
	at org.apache.commons.lang3.reflect.FieldUtils.getField(FieldUtils.java:87)
	at org.apache.commons.lang3.reflect.FieldUtils.getField(FieldUtils.java:63)
	at org.apache.commons.lang3.reflect.FieldUtilsTest.testGetFieldIllegalArgumentException4(FieldUtilsTest.java:107)

testGetDeclaredFieldForceAccessIllegalArgumentException4(org.apache.commons.lang3.reflect.FieldUtilsTest)  Time elapsed: 0 sec  <<< ERROR!
java.lang.Exception: Unexpected exception, expected<java.lang.IllegalArgumentException> but was<java.lang.StringIndexOutOfBoundsException>
	at java.lang.String.charAt(String.java:658)
	at org.apache.commons.lang3.StringUtils.isBlank(StringUtils.java:35)
	at org.apache.commons.lang3.StringUtils.isNotBlank(StringUtils.java:37)
	at org.apache.commons.lang3.reflect.FieldUtils.getDeclaredField(FieldUtils.java:170)
	at org.apache.commons.lang3.reflect.FieldUtilsTest.testGetDeclaredFieldForceAccessIllegalArgumentException4(FieldUtilsTest.java:299)

testReadNamedField(org.apache.commons.lang3.reflect.FieldUtilsTest)  Time elapsed: 0.001 sec  <<< ERROR!
java.lang.StringIndexOutOfBoundsException: String index out of range: -1
	at java.lang.String.charAt(String.java:658)
	at org.apache.commons.lang3.StringUtils.isBlank(StringUtils.java:35)
	at org.apache.commons.lang3.StringUtils.isNotBlank(StringUtils.java:37)
	at org.apache.commons.lang3.reflect.FieldUtils.getField(FieldUtils.java:87)
	at org.apache.commons.lang3.reflect.FieldUtils.readField(FieldUtils.java:468)
	at org.apache.commons.lang3.reflect.FieldUtils.readField(FieldUtils.java:445)
	at org.apache.commons.lang3.reflect.FieldUtilsTest.testReadNamedField(FieldUtilsTest.java:558)

testGetFieldForceAccessIllegalArgumentException4(org.apache.commons.lang3.reflect.FieldUtilsTest)  Time elapsed: 0 sec  <<< ERROR!
java.lang.Exception: Unexpected exception, expected<java.lang.IllegalArgumentException> but was<java.lang.StringIndexOutOfBoundsException>
	at java.lang.String.charAt(String.java:658)
	at org.apache.commons.lang3.StringUtils.isBlank(StringUtils.java:35)
	at org.apache.commons.lang3.StringUtils.isNotBlank(StringUtils.java:37)
	at org.apache.commons.lang3.reflect.FieldUtils.getField(FieldUtils.java:87)
	at org.apache.commons.lang3.reflect.FieldUtilsTest.testGetFieldForceAccessIllegalArgumentException4(FieldUtilsTest.java:146)

testReadNamedStaticFieldForceAccess(org.apache.commons.lang3.reflect.FieldUtilsTest)  Time elapsed: 0.001 sec  <<< ERROR!
java.lang.StringIndexOutOfBoundsException: String index out of range: -1
	at java.lang.String.charAt(String.java:658)
	at org.apache.commons.lang3.StringUtils.isBlank(StringUtils.java:35)
	at org.apache.commons.lang3.StringUtils.isNotBlank(StringUtils.java:37)
	at org.apache.commons.lang3.reflect.FieldUtils.getField(FieldUtils.java:87)
	at org.apache.commons.lang3.reflect.FieldUtils.readStaticField(FieldUtils.java:338)
	at org.apache.commons.lang3.reflect.FieldUtilsTest.testReadNamedStaticFieldForceAccess(FieldUtilsTest.java:417)

testGetDeclaredFieldAccessIllegalArgumentException4(org.apache.commons.lang3.reflect.FieldUtilsTest)  Time elapsed: 0 sec  <<< ERROR!
java.lang.Exception: Unexpected exception, expected<java.lang.IllegalArgumentException> but was<java.lang.StringIndexOutOfBoundsException>
	at java.lang.String.charAt(String.java:658)
	at org.apache.commons.lang3.StringUtils.isBlank(StringUtils.java:35)
	at org.apache.commons.lang3.StringUtils.isNotBlank(StringUtils.java:37)
	at org.apache.commons.lang3.reflect.FieldUtils.getDeclaredField(FieldUtils.java:170)
	at org.apache.commons.lang3.reflect.FieldUtils.getDeclaredField(FieldUtils.java:149)
	at org.apache.commons.lang3.reflect.FieldUtilsTest.testGetDeclaredFieldAccessIllegalArgumentException4(FieldUtilsTest.java:260)

testReadNamedFieldForceAccess(org.apache.commons.lang3.reflect.FieldUtilsTest)  Time elapsed: 0.001 sec  <<< ERROR!
java.lang.StringIndexOutOfBoundsException: String index out of range: -1
	at java.lang.String.charAt(String.java:658)
	at org.apache.commons.lang3.StringUtils.isBlank(StringUtils.java:35)
	at org.apache.commons.lang3.StringUtils.isNotBlank(StringUtils.java:37)
	at org.apache.commons.lang3.reflect.FieldUtils.getField(FieldUtils.java:87)
	at org.apache.commons.lang3.reflect.FieldUtils.readField(FieldUtils.java:468)
	at org.apache.commons.lang3.reflect.FieldUtilsTest.testReadNamedFieldForceAccess(FieldUtilsTest.java:642)

Running org.apache.commons.lang3.reflect.TypeLiteralTest
Tests run: 4, Failures: 0, Errors: 0, Skipped: 0, Time elapsed: 0 sec - in org.apache.commons.lang3.reflect.TypeLiteralTest
Running org.apache.commons.lang3.reflect.TypeUtilsTest
Tests run: 19, Failures: 0, Errors: 0, Skipped: 0, Time elapsed: 0.033 sec - in org.apache.commons.lang3.reflect.TypeUtilsTest
Running org.apache.commons.lang3.mutable.MutableByteTest
Tests run: 17, Failures: 0, Errors: 0, Skipped: 0, Time elapsed: 0.002 sec - in org.apache.commons.lang3.mutable.MutableByteTest
Running org.apache.commons.lang3.mutable.MutableShortTest
Tests run: 14, Failures: 0, Errors: 0, Skipped: 0, Time elapsed: 0.002 sec - in org.apache.commons.lang3.mutable.MutableShortTest
Running org.apache.commons.lang3.mutable.MutableIntTest
Tests run: 17, Failures: 0, Errors: 0, Skipped: 0, Time elapsed: 0.003 sec - in org.apache.commons.lang3.mutable.MutableIntTest
Running org.apache.commons.lang3.mutable.MutableDoubleTest
Tests run: 18, Failures: 0, Errors: 0, Skipped: 0, Time elapsed: 0.005 sec - in org.apache.commons.lang3.mutable.MutableDoubleTest
Running org.apache.commons.lang3.mutable.MutableFloatTest
Tests run: 18, Failures: 0, Errors: 0, Skipped: 0, Time elapsed: 0.005 sec - in org.apache.commons.lang3.mutable.MutableFloatTest
Running org.apache.commons.lang3.mutable.MutableLongTest
Tests run: 17, Failures: 0, Errors: 0, Skipped: 0, Time elapsed: 0.004 sec - in org.apache.commons.lang3.mutable.MutableLongTest
Running org.apache.commons.lang3.mutable.MutableBooleanTest
Tests run: 9, Failures: 0, Errors: 0, Skipped: 0, Time elapsed: 0 sec - in org.apache.commons.lang3.mutable.MutableBooleanTest
Running org.apache.commons.lang3.mutable.MutableObjectTest
Tests run: 5, Failures: 0, Errors: 0, Skipped: 0, Time elapsed: 0 sec - in org.apache.commons.lang3.mutable.MutableObjectTest
Running org.apache.commons.lang3.text.translate.UnicodeEscaperTest
Tests run: 3, Failures: 0, Errors: 0, Skipped: 0, Time elapsed: 0 sec - in org.apache.commons.lang3.text.translate.UnicodeEscaperTest
Running org.apache.commons.lang3.text.translate.EntityArraysTest
Tests run: 3, Failures: 0, Errors: 0, Skipped: 0, Time elapsed: 0 sec - in org.apache.commons.lang3.text.translate.EntityArraysTest
Running org.apache.commons.lang3.text.translate.UnicodeUnpairedSurrogateRemoverTest
Tests run: 2, Failures: 0, Errors: 0, Skipped: 0, Time elapsed: 0 sec - in org.apache.commons.lang3.text.translate.UnicodeUnpairedSurrogateRemoverTest
Running org.apache.commons.lang3.text.translate.NumericEntityUnescaperTest
Tests run: 3, Failures: 0, Errors: 0, Skipped: 0, Time elapsed: 0 sec - in org.apache.commons.lang3.text.translate.NumericEntityUnescaperTest
Running org.apache.commons.lang3.text.translate.NumericEntityEscaperTest
Tests run: 4, Failures: 0, Errors: 0, Skipped: 0, Time elapsed: 0.001 sec - in org.apache.commons.lang3.text.translate.NumericEntityEscaperTest
Running org.apache.commons.lang3.text.translate.LookupTranslatorTest
Tests run: 2, Failures: 0, Errors: 0, Skipped: 0, Time elapsed: 0 sec - in org.apache.commons.lang3.text.translate.LookupTranslatorTest
Running org.apache.commons.lang3.text.translate.UnicodeUnescaperTest
Tests run: 3, Failures: 0, Errors: 0, Skipped: 0, Time elapsed: 0 sec - in org.apache.commons.lang3.text.translate.UnicodeUnescaperTest
Running org.apache.commons.lang3.text.translate.OctalUnescaperTest
Tests run: 1, Failures: 0, Errors: 0, Skipped: 0, Time elapsed: 0 sec - in org.apache.commons.lang3.text.translate.OctalUnescaperTest
Running org.apache.commons.lang3.text.StrMatcherTest
Tests run: 14, Failures: 0, Errors: 0, Skipped: 0, Time elapsed: 0.001 sec - in org.apache.commons.lang3.text.StrMatcherTest
Running org.apache.commons.lang3.text.StrTokenizerTest
Tests run: 55, Failures: 0, Errors: 0, Skipped: 0, Time elapsed: 0.002 sec - in org.apache.commons.lang3.text.StrTokenizerTest
Running org.apache.commons.lang3.text.FormattableUtilsTest
Tests run: 5, Failures: 0, Errors: 0, Skipped: 0, Time elapsed: 0 sec - in org.apache.commons.lang3.text.FormattableUtilsTest
Running org.apache.commons.lang3.text.CompositeFormatTest
Tests run: 2, Failures: 0, Errors: 0, Skipped: 0, Time elapsed: 0 sec - in org.apache.commons.lang3.text.CompositeFormatTest
Running org.apache.commons.lang3.text.WordUtilsTest
Tests run: 12, Failures: 0, Errors: 0, Skipped: 0, Time elapsed: 0 sec - in org.apache.commons.lang3.text.WordUtilsTest
Running org.apache.commons.lang3.text.StrLookupTest
Tests run: 5, Failures: 0, Errors: 0, Skipped: 0, Time elapsed: 0.002 sec - in org.apache.commons.lang3.text.StrLookupTest
Running org.apache.commons.lang3.text.StrBuilderAppendInsertTest
Tests run: 51, Failures: 0, Errors: 0, Skipped: 0, Time elapsed: 0.016 sec - in org.apache.commons.lang3.text.StrBuilderAppendInsertTest
Running org.apache.commons.lang3.text.ExtendedMessageFormatTest
Tests run: 10, Failures: 0, Errors: 0, Skipped: 0, Time elapsed: 0.682 sec - in org.apache.commons.lang3.text.ExtendedMessageFormatTest
Running org.apache.commons.lang3.text.StrSubstitutorTest
Tests run: 40, Failures: 0, Errors: 0, Skipped: 0, Time elapsed: 0.021 sec - in org.apache.commons.lang3.text.StrSubstitutorTest
Running org.apache.commons.lang3.text.StrBuilderTest
Tests run: 90, Failures: 0, Errors: 0, Skipped: 0, Time elapsed: 0.034 sec - in org.apache.commons.lang3.text.StrBuilderTest
Running org.apache.commons.lang3.StringEscapeUtilsTest
Tests run: 28, Failures: 0, Errors: 0, Skipped: 0, Time elapsed: 0.364 sec - in org.apache.commons.lang3.StringEscapeUtilsTest
Running org.apache.commons.lang3.AnnotationUtilsTest
Tests run: 10, Failures: 0, Errors: 0, Skipped: 0, Time elapsed: 0.018 sec - in org.apache.commons.lang3.AnnotationUtilsTest
Running org.apache.commons.lang3.ConversionTest
Tests run: 42, Failures: 0, Errors: 0, Skipped: 0, Time elapsed: 0.015 sec - in org.apache.commons.lang3.ConversionTest
Running org.apache.commons.lang3.StringUtilsTrimEmptyTest
Tests run: 15, Failures: 0, Errors: 2, Skipped: 0, Time elapsed: 0.006 sec <<< FAILURE! - in org.apache.commons.lang3.StringUtilsTrimEmptyTest
testIsNotBlank(org.apache.commons.lang3.StringUtilsTrimEmptyTest)  Time elapsed: 0 sec  <<< ERROR!
java.lang.StringIndexOutOfBoundsException: String index out of range: -1
	at java.lang.String.charAt(String.java:658)
	at org.apache.commons.lang3.StringUtils.isBlank(StringUtils.java:35)
	at org.apache.commons.lang3.StringUtils.isNotBlank(StringUtils.java:37)
	at org.apache.commons.lang3.StringUtilsTrimEmptyTest.testIsNotBlank(StringUtilsTrimEmptyTest.java:67)

testIsBlank(org.apache.commons.lang3.StringUtilsTrimEmptyTest)  Time elapsed: 0 sec  <<< ERROR!
java.lang.StringIndexOutOfBoundsException: String index out of range: -1
	at java.lang.String.charAt(String.java:658)
	at org.apache.commons.lang3.StringUtils.isBlank(StringUtils.java:35)
	at org.apache.commons.lang3.StringUtilsTrimEmptyTest.testIsBlank(StringUtilsTrimEmptyTest.java:58)

Running org.apache.commons.lang3.EnumUtilsTest
Tests run: 34, Failures: 0, Errors: 0, Skipped: 0, Time elapsed: 0.007 sec - in org.apache.commons.lang3.EnumUtilsTest
Running org.apache.commons.lang3.exception.ExceptionUtilsTest
Tests run: 28, Failures: 0, Errors: 0, Skipped: 0, Time elapsed: 0.027 sec - in org.apache.commons.lang3.exception.ExceptionUtilsTest
Running org.apache.commons.lang3.exception.DefaultExceptionContextTest
Tests run: 8, Failures: 0, Errors: 0, Skipped: 0, Time elapsed: 0.004 sec - in org.apache.commons.lang3.exception.DefaultExceptionContextTest
Running org.apache.commons.lang3.exception.ContextedExceptionTest
Tests run: 14, Failures: 0, Errors: 0, Skipped: 0, Time elapsed: 0.009 sec - in org.apache.commons.lang3.exception.ContextedExceptionTest
Running org.apache.commons.lang3.exception.ContextedRuntimeExceptionTest
Tests run: 14, Failures: 0, Errors: 0, Skipped: 0, Time elapsed: 0.009 sec - in org.apache.commons.lang3.exception.ContextedRuntimeExceptionTest
Running org.apache.commons.lang3.BitFieldTest
Tests run: 15, Failures: 0, Errors: 0, Skipped: 0, Time elapsed: 0.001 sec - in org.apache.commons.lang3.BitFieldTest
Running org.apache.commons.lang3.ArrayUtilsRemoveMultipleTest
Tests run: 55, Failures: 0, Errors: 0, Skipped: 0, Time elapsed: 0.013 sec - in org.apache.commons.lang3.ArrayUtilsRemoveMultipleTest
Running org.apache.commons.lang3.HashSetvBitSetTest
Ratio=9% array=100 count=1 extract=22154023 bitset=2061070
Ratio=10% array=100 count=10 extract=18624209 bitset=1900109
Ratio=9% array=100 count=50 extract=6100927 bitset=580311
Ratio=4% array=100 count=100 extract=9998843 bitset=420390
Ratio=83% array=1000 count=10 extract=6345859 bitset=5301474
Ratio=27% array=1000 count=100 extract=19273509 bitset=5227416
Ratio=7% array=1000 count=500 extract=46239625 bitset=3571351
Ratio=1% array=1000 count=1000 extract=69665175 bitset=740895
Ratio=3% count=0 hash=4296187 bits=150017
Ratio=33% count=5 hash=565539 bits=188881
Ratio=33% count=10 hash=870099 bits=294067
Ratio=22% count=200 hash=18505758 bits=4135294
Ratio=12% count=50 hash=9479403 bits=1200235
Ratio=27% count=100 hash=8251919 bits=2278106
Ratio=21% count=1000 hash=72856814 bits=15867531
Ratio=27% count=2000 hash=144890262 bits=40173534
Tests run: 2, Failures: 0, Errors: 0, Skipped: 0, Time elapsed: 0.644 sec - in org.apache.commons.lang3.HashSetvBitSetTest
Running org.apache.commons.lang3.StringUtilsTest
Tests run: 124, Failures: 0, Errors: 8, Skipped: 0, Time elapsed: 0.111 sec <<< FAILURE! - in org.apache.commons.lang3.StringUtilsTest
testIsAnyBlank(org.apache.commons.lang3.StringUtilsTest)  Time elapsed: 0.001 sec  <<< ERROR!
java.lang.StringIndexOutOfBoundsException: String index out of range: -1
	at java.lang.String.charAt(String.java:658)
	at org.apache.commons.lang3.StringUtils.isBlank(StringUtils.java:35)
	at org.apache.commons.lang3.StringUtils.isAnyBlank(StringUtils.java:39)
	at org.apache.commons.lang3.StringUtilsTest.testIsAnyBlank(StringUtilsTest.java:195)

testDefaultIfBlank_StringString(org.apache.commons.lang3.StringUtilsTest)  Time elapsed: 0.001 sec  <<< ERROR!
java.lang.StringIndexOutOfBoundsException: String index out of range: -1
	at java.lang.String.charAt(String.java:658)
	at org.apache.commons.lang3.StringUtils.isBlank(StringUtils.java:35)
	at org.apache.commons.lang3.StringUtils.defaultIfBlank(StringUtils.java:896)
	at org.apache.commons.lang3.StringUtilsTest.testDefaultIfBlank_StringString(StringUtilsTest.java:1662)

testDefaultIfBlank_StringBuffers(org.apache.commons.lang3.StringUtilsTest)  Time elapsed: 0 sec  <<< ERROR!
java.lang.StringIndexOutOfBoundsException: String index out of range: -1
	at java.lang.StringBuffer.charAt(StringBuffer.java:179)
	at org.apache.commons.lang3.StringUtils.isBlank(StringUtils.java:35)
	at org.apache.commons.lang3.StringUtils.defaultIfBlank(StringUtils.java:896)
	at org.apache.commons.lang3.StringUtilsTest.testDefaultIfBlank_StringBuffers(StringUtilsTest.java:1704)

testIsNotBlank(org.apache.commons.lang3.StringUtilsTest)  Time elapsed: 0 sec  <<< ERROR!
java.lang.StringIndexOutOfBoundsException: String index out of range: -1
	at java.lang.String.charAt(String.java:658)
	at org.apache.commons.lang3.StringUtils.isBlank(StringUtils.java:35)
	at org.apache.commons.lang3.StringUtils.isNotBlank(StringUtils.java:37)
	at org.apache.commons.lang3.StringUtilsTest.testIsNotBlank(StringUtilsTest.java:182)

testDefaultIfBlank_StringBuilders(org.apache.commons.lang3.StringUtilsTest)  Time elapsed: 0.001 sec  <<< ERROR!
java.lang.StringIndexOutOfBoundsException: String index out of range: -1
	at java.lang.AbstractStringBuilder.charAt(AbstractStringBuilder.java:203)
	at java.lang.StringBuilder.charAt(StringBuilder.java:72)
	at org.apache.commons.lang3.StringUtils.isBlank(StringUtils.java:35)
	at org.apache.commons.lang3.StringUtils.defaultIfBlank(StringUtils.java:896)
	at org.apache.commons.lang3.StringUtilsTest.testDefaultIfBlank_StringBuilders(StringUtilsTest.java:1683)

testIsNoneBlank(org.apache.commons.lang3.StringUtilsTest)  Time elapsed: 0 sec  <<< ERROR!
java.lang.StringIndexOutOfBoundsException: String index out of range: -1
	at java.lang.String.charAt(String.java:658)
	at org.apache.commons.lang3.StringUtils.isBlank(StringUtils.java:35)
	at org.apache.commons.lang3.StringUtils.isAnyBlank(StringUtils.java:39)
	at org.apache.commons.lang3.StringUtils.isNoneBlank(StringUtils.java:41)
	at org.apache.commons.lang3.StringUtilsTest.testIsNoneBlank(StringUtilsTest.java:208)

testDefaultIfBlank_CharBuffers(org.apache.commons.lang3.StringUtilsTest)  Time elapsed: 0 sec  <<< ERROR!
java.lang.IndexOutOfBoundsException: null
	at java.nio.Buffer.checkIndex(Buffer.java:538)
	at java.nio.CharBuffer.charAt(CharBuffer.java:1238)
	at org.apache.commons.lang3.StringUtils.isBlank(StringUtils.java:35)
	at org.apache.commons.lang3.StringUtils.defaultIfBlank(StringUtils.java:896)
	at org.apache.commons.lang3.StringUtilsTest.testDefaultIfBlank_CharBuffers(StringUtilsTest.java:1725)

testIsBlank(org.apache.commons.lang3.StringUtilsTest)  Time elapsed: 0 sec  <<< ERROR!
java.lang.StringIndexOutOfBoundsException: String index out of range: -1
	at java.lang.String.charAt(String.java:658)
	at org.apache.commons.lang3.StringUtils.isBlank(StringUtils.java:35)
	at org.apache.commons.lang3.StringUtilsTest.testIsBlank(StringUtilsTest.java:173)

Running org.apache.commons.lang3.ArrayUtilsRemoveTest
Tests run: 19, Failures: 0, Errors: 0, Skipped: 0, Time elapsed: 0 sec - in org.apache.commons.lang3.ArrayUtilsRemoveTest
Running org.apache.commons.lang3.ObjectUtilsTest
Tests run: 36, Failures: 0, Errors: 0, Skipped: 0, Time elapsed: 0.005 sec - in org.apache.commons.lang3.ObjectUtilsTest
Running org.apache.commons.lang3.ClassPathUtilsTest
Tests run: 13, Failures: 0, Errors: 0, Skipped: 0, Time elapsed: 0.003 sec - in org.apache.commons.lang3.ClassPathUtilsTest
Running org.apache.commons.lang3.math.NumberUtilsTest
Tests run: 91, Failures: 0, Errors: 2, Skipped: 0, Time elapsed: 0.033 sec <<< FAILURE! - in org.apache.commons.lang3.math.NumberUtilsTest
testCreateBigDecimal(org.apache.commons.lang3.math.NumberUtilsTest)  Time elapsed: 0 sec  <<< ERROR!
java.lang.StringIndexOutOfBoundsException: String index out of range: -1
	at java.lang.String.charAt(String.java:658)
	at org.apache.commons.lang3.StringUtils.isBlank(StringUtils.java:35)
	at org.apache.commons.lang3.math.NumberUtils.createBigDecimal(NumberUtils.java:794)
	at org.apache.commons.lang3.math.NumberUtilsTest.testCreateBigDecimalFailure(NumberUtilsTest.java:485)
	at org.apache.commons.lang3.math.NumberUtilsTest.testCreateBigDecimal(NumberUtilsTest.java:471)

testIsNumber(org.apache.commons.lang3.math.NumberUtilsTest)  Time elapsed: 0 sec  <<< ERROR!
java.lang.StringIndexOutOfBoundsException: String index out of range: -1
	at java.lang.String.charAt(String.java:658)
	at org.apache.commons.lang3.StringUtils.isBlank(StringUtils.java:35)
	at org.apache.commons.lang3.math.NumberUtils.createNumber(NumberUtils.java:455)
	at org.apache.commons.lang3.math.NumberUtilsTest.checkCreateNumber(NumberUtilsTest.java:1297)
	at org.apache.commons.lang3.math.NumberUtilsTest.compareIsNumberWithCreateNumber(NumberUtilsTest.java:1267)
	at org.apache.commons.lang3.math.NumberUtilsTest.testIsNumber(NumberUtilsTest.java:1215)

Running org.apache.commons.lang3.math.IEEE754rUtilsTest
Tests run: 3, Failures: 0, Errors: 0, Skipped: 0, Time elapsed: 0 sec - in org.apache.commons.lang3.math.IEEE754rUtilsTest
Running org.apache.commons.lang3.math.FractionTest
Tests run: 25, Failures: 0, Errors: 0, Skipped: 0, Time elapsed: 0.162 sec - in org.apache.commons.lang3.math.FractionTest
Running org.apache.commons.lang3.BooleanUtilsTest
Tests run: 72, Failures: 0, Errors: 0, Skipped: 0, Time elapsed: 0.01 sec - in org.apache.commons.lang3.BooleanUtilsTest
Running org.apache.commons.lang3.CharSequenceUtilsTest
Tests run: 2, Failures: 0, Errors: 0, Skipped: 0, Time elapsed: 0.001 sec - in org.apache.commons.lang3.CharSequenceUtilsTest
Running org.apache.commons.lang3.CharSetUtilsTest
Tests run: 11, Failures: 0, Errors: 0, Skipped: 0, Time elapsed: 0 sec - in org.apache.commons.lang3.CharSetUtilsTest
Running org.apache.commons.lang3.ArrayUtilsAddTest
Tests run: 13, Failures: 0, Errors: 0, Skipped: 0, Time elapsed: 0.001 sec - in org.apache.commons.lang3.ArrayUtilsAddTest
Running org.apache.commons.lang3.CharEncodingTest
Tests run: 6, Failures: 0, Errors: 0, Skipped: 0, Time elapsed: 0.032 sec - in org.apache.commons.lang3.CharEncodingTest
Running org.apache.commons.lang3.ClassUtilsTest
Tests run: 57, Failures: 0, Errors: 0, Skipped: 0, Time elapsed: 0.012 sec - in org.apache.commons.lang3.ClassUtilsTest
Running org.apache.commons.lang3.RangeTest
Tests run: 24, Failures: 0, Errors: 0, Skipped: 0, Time elapsed: 0.005 sec - in org.apache.commons.lang3.RangeTest
Running org.apache.commons.lang3.event.EventUtilsTest
Tests run: 8, Failures: 0, Errors: 0, Skipped: 0, Time elapsed: 0.014 sec - in org.apache.commons.lang3.event.EventUtilsTest
Running org.apache.commons.lang3.event.EventListenerSupportTest
Tests run: 9, Failures: 0, Errors: 0, Skipped: 0, Time elapsed: 0.02 sec - in org.apache.commons.lang3.event.EventListenerSupportTest
Running org.apache.commons.lang3.ArrayUtilsTest
Tests run: 205, Failures: 0, Errors: 0, Skipped: 0, Time elapsed: 0.046 sec - in org.apache.commons.lang3.ArrayUtilsTest
Running org.apache.commons.lang3.CharUtilsTest
Tests run: 24, Failures: 0, Errors: 0, Skipped: 0, Time elapsed: 0.001 sec - in org.apache.commons.lang3.CharUtilsTest
Running org.apache.commons.lang3.NotImplementedExceptionTest
Tests run: 1, Failures: 0, Errors: 0, Skipped: 0, Time elapsed: 0 sec - in org.apache.commons.lang3.NotImplementedExceptionTest
Running org.apache.commons.lang3.StringUtilsEqualsIndexOfTest
Tests run: 50, Failures: 0, Errors: 0, Skipped: 0, Time elapsed: 0.002 sec - in org.apache.commons.lang3.StringUtilsEqualsIndexOfTest
Running org.apache.commons.lang3.RandomUtilsTest
Tests run: 23, Failures: 0, Errors: 0, Skipped: 0, Time elapsed: 0.001 sec - in org.apache.commons.lang3.RandomUtilsTest

Results :


Tests in error: 
  StringUtilsTest.testDefaultIfBlank_CharBuffers:1725 » IndexOutOfBounds
  StringUtilsTest.testDefaultIfBlank_StringBuffers:1704 » StringIndexOutOfBounds
  StringUtilsTest.testDefaultIfBlank_StringBuilders:1683 » StringIndexOutOfBounds
  StringUtilsTest.testDefaultIfBlank_StringString:1662 » StringIndexOutOfBounds ...
  StringUtilsTest.testIsAnyBlank:195 » StringIndexOutOfBounds String index out o...
  StringUtilsTest.testIsBlank:173 » StringIndexOutOfBounds String index out of r...
  StringUtilsTest.testIsNoneBlank:208 » StringIndexOutOfBounds String index out ...
  StringUtilsTest.testIsNotBlank:182 » StringIndexOutOfBounds String index out o...
  StringUtilsTrimEmptyTest.testIsBlank:58 » StringIndexOutOfBounds String index ...
  StringUtilsTrimEmptyTest.testIsNotBlank:67 » StringIndexOutOfBounds String ind...
  ValidateTest.testNotBlankBlankStringWithNewlinesShouldThrow:399 » StringIndexOutOfBounds
  ValidateTest.testNotBlankBlankStringWithWhitespacesShouldThrow:383 » StringIndexOutOfBounds
  ValidateTest.testNotBlankMsgBlankStringShouldThrow:415 » StringIndexOutOfBounds
  ValidateTest.testNotBlankMsgBlankStringWithWhitespacesShouldThrow:431 » StringIndexOutOfBounds
  ValidateTest.testNotBlankMsgNotBlankStringWithNewlinesShouldNotThrow:522 » StringIndexOutOfBounds
  ValidateTest.testNotBlankMsgNotBlankStringWithWhitespacesShouldNotThrow:510 » StringIndexOutOfBounds
  ValidateTest.testNotBlankNotBlankStringWithNewlinesShouldNotThrow:486 » StringIndexOutOfBounds
  ValidateTest.testNotBlankNotBlankStringWithWhitespacesShouldNotThrow:474 » StringIndexOutOfBounds
  NumberUtilsTest.testCreateBigDecimal:471->testCreateBigDecimalFailure:485 » StringIndexOutOfBounds
  NumberUtilsTest.testIsNumber:1215->compareIsNumberWithCreateNumber:1267->checkCreateNumber:1297 » StringIndexOutOfBounds
  FieldUtilsTest.testGetDeclaredFieldAccessIllegalArgumentException4 »  Unexpect...
  FieldUtilsTest.testGetDeclaredFieldForceAccessIllegalArgumentException4 »  Une...
  FieldUtilsTest.testGetFieldForceAccessIllegalArgumentException4 »  Unexpected ...
  FieldUtilsTest.testGetFieldIllegalArgumentException4 »  Unexpected exception, ...
  FieldUtilsTest.testReadDeclaredNamedField:673 » StringIndexOutOfBounds String ...
  FieldUtilsTest.testReadDeclaredNamedFieldForceAccess:757 » StringIndexOutOfBounds
  FieldUtilsTest.testReadNamedField:558 » StringIndexOutOfBounds String index ou...
  FieldUtilsTest.testReadNamedFieldForceAccess:642 » StringIndexOutOfBounds Stri...
  FieldUtilsTest.testReadNamedStaticField:367 » StringIndexOutOfBounds String in...
  FieldUtilsTest.testReadNamedStaticFieldForceAccess:417 » StringIndexOutOfBounds


Tests run: 3526, Failures: 0, Errors: 30, Skipped: 97

[INFO] ------------------------------------------------------------------------
[INFO] BUILD FAILURE
[INFO] ------------------------------------------------------------------------
[INFO] Total time: 34.005s
[INFO] Finished at: Mon Aug 03 19:10:46 BST 2015
[INFO] Final Memory: 23M/414M
[INFO] ------------------------------------------------------------------------
[ERROR] Failed to execute goal org.apache.maven.plugins:maven-surefire-plugin:2.18:test (default-test) on project commons-lang3: There are test failures.
[ERROR] 
[ERROR] Please refer to /home/perham/Study/LittleDarwin/Cases/commons-lang3-3.4-src/target/surefire-reports for the individual test results.
[ERROR] -> [Help 1]
[ERROR] 
[ERROR] To see the full stack trace of the errors, re-run Maven with the -e switch.
[ERROR] Re-run Maven using the -X switch to enable full debug logging.
[ERROR] 
[ERROR] For more information about the errors and possible solutions, please read the following articles:
[ERROR] [Help 1] http://cwiki.apache.org/confluence/display/MAVEN/MojoFailureException
