[INFO] Scanning for projects...
[INFO]                                                                         
[INFO] ------------------------------------------------------------------------
[INFO] Building Apache Commons Lang 3.4
[INFO] ------------------------------------------------------------------------
[INFO] 
[INFO] --- maven-enforcer-plugin:1.3.1:enforce (enforce-maven-3) @ commons-lang3 ---
[INFO] 
[INFO] --- build-helper-maven-plugin:1.8:parse-version (parse-version) @ commons-lang3 ---
[INFO] 
[INFO] --- maven-antrun-plugin:1.8:run (javadoc.resources) @ commons-lang3 ---
[INFO] Executing tasks

main:
[INFO] Executed tasks
[INFO] 
[INFO] --- maven-remote-resources-plugin:1.5:process (default) @ commons-lang3 ---
[INFO] 
[INFO] --- buildnumber-maven-plugin:1.3:create (default) @ commons-lang3 ---
[INFO] Executing: /bin/sh -c cd /home/perham/Study/LittleDarwin/Cases/commons-lang3-3.4-src && svn --non-interactive info
[INFO] Working directory: /home/perham/Study/LittleDarwin/Cases/commons-lang3-3.4-src
[INFO] Storing buildNumber: ?????? at timestamp: 1438562557404
[INFO] Executing: /bin/sh -c cd /home/perham/Study/LittleDarwin/Cases/commons-lang3-3.4-src && svn --non-interactive info
[INFO] Working directory: /home/perham/Study/LittleDarwin/Cases/commons-lang3-3.4-src
[INFO] Storing buildScmBranch: UNKNOWN_BRANCH
[INFO] 
[INFO] --- maven-resources-plugin:2.7:resources (default-resources) @ commons-lang3 ---
[INFO] Using 'ISO-8859-1' encoding to copy filtered resources.
[INFO] Copying 0 resource
[INFO] Copying 2 resources to META-INF
[INFO] 
[INFO] --- maven-compiler-plugin:3.2:compile (default-compile) @ commons-lang3 ---
[INFO] Changes detected - recompiling the module!
[INFO] Compiling 133 source files to /home/perham/Study/LittleDarwin/Cases/commons-lang3-3.4-src/target/classes
[INFO] /home/perham/Study/LittleDarwin/Cases/commons-lang3-3.4-src/src/main/java/org/apache/commons/lang3/SerializationUtils.java: /home/perham/Study/LittleDarwin/Cases/commons-lang3-3.4-src/src/main/java/org/apache/commons/lang3/SerializationUtils.java uses unchecked or unsafe operations.
[INFO] /home/perham/Study/LittleDarwin/Cases/commons-lang3-3.4-src/src/main/java/org/apache/commons/lang3/SerializationUtils.java: Recompile with -Xlint:unchecked for details.
[INFO] 
[INFO] --- maven-bundle-plugin:2.5.3:manifest (bundle-manifest) @ commons-lang3 ---
[INFO] 
[INFO] --- animal-sniffer-maven-plugin:1.13:check (checkAPIcompatibility) @ commons-lang3 ---
[INFO] Checking unresolved references to org.codehaus.mojo.signature:java16:1.0
[INFO] 
[INFO] --- maven-resources-plugin:2.7:testResources (default-testResources) @ commons-lang3 ---
[INFO] Using 'ISO-8859-1' encoding to copy filtered resources.
[INFO] Copying 2 resources
[INFO] Copying 2 resources to META-INF
[INFO] 
[INFO] --- maven-compiler-plugin:3.2:testCompile (default-testCompile) @ commons-lang3 ---
[INFO] Nothing to compile - all classes are up to date
[INFO] 
[INFO] --- maven-surefire-plugin:2.18:test (default-test) @ commons-lang3 ---
[INFO] Surefire report directory: /home/perham/Study/LittleDarwin/Cases/commons-lang3-3.4-src/target/surefire-reports

-------------------------------------------------------
 T E S T S
-------------------------------------------------------
Running org.apache.commons.lang3.ValidateTest
Tests run: 63, Failures: 0, Errors: 0, Skipped: 0, Time elapsed: 0.059 sec - in org.apache.commons.lang3.ValidateTest
Running org.apache.commons.lang3.LocaleUtilsTest
Tests run: 15, Failures: 0, Errors: 0, Skipped: 0, Time elapsed: 0.035 sec - in org.apache.commons.lang3.LocaleUtilsTest
Running org.apache.commons.lang3.tuple.MutableTripleTest
Tests run: 8, Failures: 0, Errors: 0, Skipped: 0, Time elapsed: 0.03 sec - in org.apache.commons.lang3.tuple.MutableTripleTest
Running org.apache.commons.lang3.tuple.TripleTest
Tests run: 10, Failures: 0, Errors: 0, Skipped: 0, Time elapsed: 0.015 sec - in org.apache.commons.lang3.tuple.TripleTest
Running org.apache.commons.lang3.tuple.ImmutablePairTest
Tests run: 6, Failures: 0, Errors: 0, Skipped: 0, Time elapsed: 0.007 sec - in org.apache.commons.lang3.tuple.ImmutablePairTest
Running org.apache.commons.lang3.tuple.MutablePairTest
Tests run: 8, Failures: 0, Errors: 0, Skipped: 0, Time elapsed: 0.009 sec - in org.apache.commons.lang3.tuple.MutablePairTest
Running org.apache.commons.lang3.tuple.ImmutableTripleTest
Tests run: 6, Failures: 0, Errors: 0, Skipped: 0, Time elapsed: 0.004 sec - in org.apache.commons.lang3.tuple.ImmutableTripleTest
Running org.apache.commons.lang3.tuple.PairTest
Tests run: 9, Failures: 0, Errors: 0, Skipped: 0, Time elapsed: 0.005 sec - in org.apache.commons.lang3.tuple.PairTest
Running org.apache.commons.lang3.StringUtilsIsTest
Tests run: 8, Failures: 0, Errors: 0, Skipped: 0, Time elapsed: 0.013 sec - in org.apache.commons.lang3.StringUtilsIsTest
Running org.apache.commons.lang3.JavaVersionTest
Tests run: 3, Failures: 0, Errors: 0, Skipped: 0, Time elapsed: 0.001 sec - in org.apache.commons.lang3.JavaVersionTest
Running org.apache.commons.lang3.builder.NoFieldNamesToStringStyleTest
Tests run: 8, Failures: 0, Errors: 0, Skipped: 0, Time elapsed: 0.006 sec - in org.apache.commons.lang3.builder.NoFieldNamesToStringStyleTest
Running org.apache.commons.lang3.builder.ShortPrefixToStringStyleTest
Tests run: 8, Failures: 0, Errors: 0, Skipped: 0, Time elapsed: 0.001 sec - in org.apache.commons.lang3.builder.ShortPrefixToStringStyleTest
Running org.apache.commons.lang3.builder.DiffResultTest
Tests run: 9, Failures: 0, Errors: 0, Skipped: 0, Time elapsed: 0.007 sec - in org.apache.commons.lang3.builder.DiffResultTest
Running org.apache.commons.lang3.builder.CompareToBuilderTest
Tests run: 48, Failures: 0, Errors: 0, Skipped: 0, Time elapsed: 0.022 sec - in org.apache.commons.lang3.builder.CompareToBuilderTest
Running org.apache.commons.lang3.builder.MultilineRecursiveToStringStyleTest
Tests run: 10, Failures: 0, Errors: 0, Skipped: 0, Time elapsed: 0.001 sec - in org.apache.commons.lang3.builder.MultilineRecursiveToStringStyleTest
Running org.apache.commons.lang3.builder.RecursiveToStringStyleTest
Tests run: 8, Failures: 0, Errors: 0, Skipped: 0, Time elapsed: 0.005 sec - in org.apache.commons.lang3.builder.RecursiveToStringStyleTest
Running org.apache.commons.lang3.builder.DefaultToStringStyleTest
Tests run: 8, Failures: 0, Errors: 0, Skipped: 0, Time elapsed: 0.004 sec - in org.apache.commons.lang3.builder.DefaultToStringStyleTest
Running org.apache.commons.lang3.builder.ReflectionToStringBuilderExcludeTest
Tests run: 11, Failures: 0, Errors: 0, Skipped: 0, Time elapsed: 0.011 sec - in org.apache.commons.lang3.builder.ReflectionToStringBuilderExcludeTest
Running org.apache.commons.lang3.builder.StandardToStringStyleTest
Tests run: 8, Failures: 0, Errors: 0, Skipped: 0, Time elapsed: 0.003 sec - in org.apache.commons.lang3.builder.StandardToStringStyleTest
Running org.apache.commons.lang3.builder.ToStringStyleTest
Tests run: 12, Failures: 0, Errors: 0, Skipped: 0, Time elapsed: 0.003 sec - in org.apache.commons.lang3.builder.ToStringStyleTest
Running org.apache.commons.lang3.builder.DiffTest
Tests run: 4, Failures: 0, Errors: 0, Skipped: 0, Time elapsed: 0 sec - in org.apache.commons.lang3.builder.DiffTest
Running org.apache.commons.lang3.builder.SimpleToStringStyleTest
Tests run: 8, Failures: 0, Errors: 0, Skipped: 0, Time elapsed: 0.004 sec - in org.apache.commons.lang3.builder.SimpleToStringStyleTest
Running org.apache.commons.lang3.builder.MultiLineToStringStyleTest
Tests run: 8, Failures: 0, Errors: 0, Skipped: 0, Time elapsed: 0.01 sec - in org.apache.commons.lang3.builder.MultiLineToStringStyleTest
Running org.apache.commons.lang3.builder.ToStringStyleConcurrencyTest
Tests run: 3, Failures: 0, Errors: 0, Skipped: 0, Time elapsed: 5.231 sec - in org.apache.commons.lang3.builder.ToStringStyleConcurrencyTest
Running org.apache.commons.lang3.builder.ReflectionToStringBuilderMutateInspectConcurrencyTest
Tests run: 1, Failures: 0, Errors: 0, Skipped: 1, Time elapsed: 0.001 sec - in org.apache.commons.lang3.builder.ReflectionToStringBuilderMutateInspectConcurrencyTest
Running org.apache.commons.lang3.builder.ToStringBuilderTest
Tests run: 74, Failures: 0, Errors: 0, Skipped: 1, Time elapsed: 0.052 sec - in org.apache.commons.lang3.builder.ToStringBuilderTest
Running org.apache.commons.lang3.builder.EqualsBuilderTest
Tests run: 48, Failures: 0, Errors: 0, Skipped: 0, Time elapsed: 0.022 sec - in org.apache.commons.lang3.builder.EqualsBuilderTest
Running org.apache.commons.lang3.builder.HashCodeBuilderAndEqualsBuilderTest
Tests run: 4, Failures: 0, Errors: 0, Skipped: 0, Time elapsed: 0.008 sec - in org.apache.commons.lang3.builder.HashCodeBuilderAndEqualsBuilderTest
Running org.apache.commons.lang3.builder.ReflectionToStringBuilderConcurrencyTest
Tests run: 3, Failures: 0, Errors: 0, Skipped: 3, Time elapsed: 0 sec - in org.apache.commons.lang3.builder.ReflectionToStringBuilderConcurrencyTest
Running org.apache.commons.lang3.builder.JsonToStringStyleTest
Tests run: 9, Failures: 0, Errors: 0, Skipped: 0, Time elapsed: 0.005 sec - in org.apache.commons.lang3.builder.JsonToStringStyleTest
Running org.apache.commons.lang3.builder.NoClassNameToStringStyleTest
Tests run: 8, Failures: 0, Errors: 0, Skipped: 0, Time elapsed: 0.001 sec - in org.apache.commons.lang3.builder.NoClassNameToStringStyleTest
Running org.apache.commons.lang3.builder.DiffBuilderTest
Tests run: 30, Failures: 0, Errors: 0, Skipped: 0, Time elapsed: 0.027 sec - in org.apache.commons.lang3.builder.DiffBuilderTest
Running org.apache.commons.lang3.builder.HashCodeBuilderTest
Tests run: 44, Failures: 0, Errors: 0, Skipped: 0, Time elapsed: 0.01 sec - in org.apache.commons.lang3.builder.HashCodeBuilderTest
Running org.apache.commons.lang3.concurrent.AtomicInitializerTest
Tests run: 3, Failures: 0, Errors: 0, Skipped: 0, Time elapsed: 0.011 sec - in org.apache.commons.lang3.concurrent.AtomicInitializerTest
Running org.apache.commons.lang3.concurrent.CallableBackgroundInitializerTest
Tests run: 4, Failures: 0, Errors: 0, Skipped: 0, Time elapsed: 0.002 sec - in org.apache.commons.lang3.concurrent.CallableBackgroundInitializerTest
Running org.apache.commons.lang3.concurrent.BackgroundInitializerTest
Tests run: 15, Failures: 0, Errors: 0, Skipped: 0, Time elapsed: 0.017 sec - in org.apache.commons.lang3.concurrent.BackgroundInitializerTest
Running org.apache.commons.lang3.concurrent.LazyInitializerTest
Tests run: 3, Failures: 0, Errors: 0, Skipped: 0, Time elapsed: 0.005 sec - in org.apache.commons.lang3.concurrent.LazyInitializerTest
Running org.apache.commons.lang3.concurrent.BasicThreadFactoryTest
Tests run: 15, Failures: 0, Errors: 0, Skipped: 0, Time elapsed: 0.035 sec - in org.apache.commons.lang3.concurrent.BasicThreadFactoryTest
Running org.apache.commons.lang3.concurrent.ConstantInitializerTest
Tests run: 7, Failures: 0, Errors: 0, Skipped: 0, Time elapsed: 0.001 sec - in org.apache.commons.lang3.concurrent.ConstantInitializerTest
Running org.apache.commons.lang3.concurrent.MultiBackgroundInitializerTest
Tests run: 17, Failures: 0, Errors: 0, Skipped: 0, Time elapsed: 0.053 sec - in org.apache.commons.lang3.concurrent.MultiBackgroundInitializerTest
Running org.apache.commons.lang3.concurrent.AtomicSafeInitializerTest
Tests run: 4, Failures: 0, Errors: 0, Skipped: 0, Time elapsed: 0.012 sec - in org.apache.commons.lang3.concurrent.AtomicSafeInitializerTest
Running org.apache.commons.lang3.concurrent.ConcurrentUtilsTest
Tests run: 40, Failures: 0, Errors: 0, Skipped: 0, Time elapsed: 0.012 sec - in org.apache.commons.lang3.concurrent.ConcurrentUtilsTest
Running org.apache.commons.lang3.concurrent.TimedSemaphoreTest
Tests run: 15, Failures: 0, Errors: 0, Skipped: 0, Time elapsed: 1.183 sec - in org.apache.commons.lang3.concurrent.TimedSemaphoreTest
Running org.apache.commons.lang3.StringUtilsSubstringTest
Tests run: 14, Failures: 0, Errors: 0, Skipped: 0, Time elapsed: 0.001 sec - in org.apache.commons.lang3.StringUtilsSubstringTest
Running org.apache.commons.lang3.SystemUtilsTest
Tests run: 12, Failures: 0, Errors: 0, Skipped: 0, Time elapsed: 0.001 sec - in org.apache.commons.lang3.SystemUtilsTest
Running org.apache.commons.lang3.CharRangeTest
Tests run: 16, Failures: 0, Errors: 0, Skipped: 0, Time elapsed: 0.033 sec - in org.apache.commons.lang3.CharRangeTest
Running org.apache.commons.lang3.CharSetTest
Tests run: 14, Failures: 0, Errors: 0, Skipped: 0, Time elapsed: 0.01 sec - in org.apache.commons.lang3.CharSetTest
Running org.apache.commons.lang3.StringUtilsStartsEndsWithTest
Tests run: 6, Failures: 0, Errors: 1, Skipped: 0, Time elapsed: 0.007 sec <<< FAILURE! - in org.apache.commons.lang3.StringUtilsStartsEndsWithTest
testStartsWithAny(org.apache.commons.lang3.StringUtilsStartsEndsWithTest)  Time elapsed: 0.005 sec  <<< ERROR!
java.lang.NullPointerException: null
	at org.apache.commons.lang3.ArrayUtils.isEmpty(ArrayUtils.java:657)
	at org.apache.commons.lang3.StringUtils.startsWithAny(StringUtils.java:7379)
	at org.apache.commons.lang3.StringUtilsStartsEndsWithTest.testStartsWithAny(StringUtilsStartsEndsWithTest.java:90)

Running org.apache.commons.lang3.RandomStringUtilsTest
Tests run: 11, Failures: 0, Errors: 0, Skipped: 0, Time elapsed: 0.037 sec - in org.apache.commons.lang3.RandomStringUtilsTest
Running org.apache.commons.lang3.SerializationUtilsTest
Tests run: 26, Failures: 0, Errors: 0, Skipped: 0, Time elapsed: 0.054 sec - in org.apache.commons.lang3.SerializationUtilsTest
Running org.apache.commons.lang3.time.StopWatchTest
Tests run: 8, Failures: 0, Errors: 0, Skipped: 0, Time elapsed: 4.758 sec - in org.apache.commons.lang3.time.StopWatchTest
Running org.apache.commons.lang3.time.DateUtilsRoundingTest
Tests run: 22, Failures: 0, Errors: 0, Skipped: 0, Time elapsed: 0.203 sec - in org.apache.commons.lang3.time.DateUtilsRoundingTest
Running org.apache.commons.lang3.time.FastDateParserTest
Tests run: 33, Failures: 0, Errors: 0, Skipped: 0, Time elapsed: 2.507 sec - in org.apache.commons.lang3.time.FastDateParserTest
Running org.apache.commons.lang3.time.FastDateFormat_ParserTest
Tests run: 33, Failures: 0, Errors: 0, Skipped: 0, Time elapsed: 0.854 sec - in org.apache.commons.lang3.time.FastDateFormat_ParserTest
Running org.apache.commons.lang3.time.DurationFormatUtilsTest
Tests run: 25, Failures: 0, Errors: 0, Skipped: 0, Time elapsed: 0.58 sec - in org.apache.commons.lang3.time.DurationFormatUtilsTest
Running org.apache.commons.lang3.time.DateFormatUtilsTest
Tests run: 10, Failures: 0, Errors: 0, Skipped: 0, Time elapsed: 0.001 sec - in org.apache.commons.lang3.time.DateFormatUtilsTest
Running org.apache.commons.lang3.time.DateUtilsFragmentTest
Tests run: 57, Failures: 0, Errors: 0, Skipped: 0, Time elapsed: 0.01 sec - in org.apache.commons.lang3.time.DateUtilsFragmentTest
Running org.apache.commons.lang3.time.FastDatePrinterTimeZonesTest
Tests run: 617, Failures: 0, Errors: 0, Skipped: 0, Time elapsed: 0.231 sec - in org.apache.commons.lang3.time.FastDatePrinterTimeZonesTest
Running org.apache.commons.lang3.time.FastDateFormatTest
>>FastDateFormatTest: FastDateParser:18137  SimpleDateFormat:3682
Tests run: 14, Failures: 0, Errors: 0, Skipped: 0, Time elapsed: 2.47 sec - in org.apache.commons.lang3.time.FastDateFormatTest
Running org.apache.commons.lang3.time.FastDateFormat_PrinterTest
Tests run: 17, Failures: 0, Errors: 0, Skipped: 0, Time elapsed: 0.008 sec - in org.apache.commons.lang3.time.FastDateFormat_PrinterTest
Running org.apache.commons.lang3.time.FastDatePrinterTest
Tests run: 17, Failures: 0, Errors: 0, Skipped: 0, Time elapsed: 0.011 sec - in org.apache.commons.lang3.time.FastDatePrinterTest
Running org.apache.commons.lang3.time.FastDateParserSDFTest
Tests run: 276, Failures: 0, Errors: 0, Skipped: 92, Time elapsed: 0.08 sec - in org.apache.commons.lang3.time.FastDateParserSDFTest
Running org.apache.commons.lang3.time.DateUtilsTest
DateUtilsTest: Default Locale=en_US
Tests run: 38, Failures: 0, Errors: 0, Skipped: 0, Time elapsed: 0.035 sec - in org.apache.commons.lang3.time.DateUtilsTest
Running org.apache.commons.lang3.reflect.InheritanceUtilsTest
Tests run: 9, Failures: 0, Errors: 0, Skipped: 0, Time elapsed: 0.006 sec - in org.apache.commons.lang3.reflect.InheritanceUtilsTest
Running org.apache.commons.lang3.reflect.MethodUtilsTest
Tests run: 23, Failures: 0, Errors: 4, Skipped: 0, Time elapsed: 0.031 sec <<< FAILURE! - in org.apache.commons.lang3.reflect.MethodUtilsTest
testInvokeStaticMethod(org.apache.commons.lang3.reflect.MethodUtilsTest)  Time elapsed: 0.001 sec  <<< ERROR!
java.lang.NullPointerException: null
	at org.apache.commons.lang3.ArrayUtils.isEmpty(ArrayUtils.java:657)
	at org.apache.commons.lang3.ArrayUtils.nullToEmpty(ArrayUtils.java:78)
	at org.apache.commons.lang3.reflect.MethodUtils.invokeStaticMethod(MethodUtils.java:306)
	at org.apache.commons.lang3.reflect.MethodUtilsTest.testInvokeStaticMethod(MethodUtilsTest.java:222)

testInvokeExactMethod(org.apache.commons.lang3.reflect.MethodUtilsTest)  Time elapsed: 0 sec  <<< ERROR!
java.lang.NullPointerException: null
	at org.apache.commons.lang3.ArrayUtils.isEmpty(ArrayUtils.java:657)
	at org.apache.commons.lang3.ArrayUtils.nullToEmpty(ArrayUtils.java:80)
	at org.apache.commons.lang3.reflect.MethodUtils.invokeExactMethod(MethodUtils.java:235)
	at org.apache.commons.lang3.reflect.MethodUtils.invokeExactMethod(MethodUtils.java:183)
	at org.apache.commons.lang3.reflect.MethodUtilsTest.testInvokeExactMethod(MethodUtilsTest.java:184)

testInvokeMethod(org.apache.commons.lang3.reflect.MethodUtilsTest)  Time elapsed: 0 sec  <<< ERROR!
java.lang.NullPointerException: null
	at org.apache.commons.lang3.ArrayUtils.isEmpty(ArrayUtils.java:657)
	at org.apache.commons.lang3.ArrayUtils.nullToEmpty(ArrayUtils.java:80)
	at org.apache.commons.lang3.reflect.MethodUtils.invokeMethod(MethodUtils.java:150)
	at org.apache.commons.lang3.reflect.MethodUtils.invokeMethod(MethodUtils.java:94)
	at org.apache.commons.lang3.reflect.MethodUtilsTest.testInvokeMethod(MethodUtilsTest.java:159)

testInvokeExactStaticMethod(org.apache.commons.lang3.reflect.MethodUtilsTest)  Time elapsed: 0 sec  <<< ERROR!
java.lang.NullPointerException: null
	at org.apache.commons.lang3.ArrayUtils.isEmpty(ArrayUtils.java:657)
	at org.apache.commons.lang3.ArrayUtils.nullToEmpty(ArrayUtils.java:78)
	at org.apache.commons.lang3.reflect.MethodUtils.invokeExactStaticMethod(MethodUtils.java:369)
	at org.apache.commons.lang3.reflect.MethodUtilsTest.testInvokeExactStaticMethod(MethodUtilsTest.java:252)

Running org.apache.commons.lang3.reflect.ConstructorUtilsTest
Tests run: 7, Failures: 0, Errors: 2, Skipped: 0, Time elapsed: 0.004 sec <<< FAILURE! - in org.apache.commons.lang3.reflect.ConstructorUtilsTest
testInvokeConstructor(org.apache.commons.lang3.reflect.ConstructorUtilsTest)  Time elapsed: 0 sec  <<< ERROR!
java.lang.NullPointerException: null
	at org.apache.commons.lang3.ArrayUtils.isEmpty(ArrayUtils.java:657)
	at org.apache.commons.lang3.ArrayUtils.nullToEmpty(ArrayUtils.java:78)
	at org.apache.commons.lang3.reflect.ConstructorUtils.invokeConstructor(ConstructorUtils.java:83)
	at org.apache.commons.lang3.reflect.ConstructorUtilsTest.testInvokeConstructor(ConstructorUtilsTest.java:104)

testInvokeExactConstructor(org.apache.commons.lang3.reflect.ConstructorUtilsTest)  Time elapsed: 0 sec  <<< ERROR!
java.lang.NullPointerException: null
	at org.apache.commons.lang3.ArrayUtils.isEmpty(ArrayUtils.java:657)
	at org.apache.commons.lang3.ArrayUtils.nullToEmpty(ArrayUtils.java:78)
	at org.apache.commons.lang3.reflect.ConstructorUtils.invokeExactConstructor(ConstructorUtils.java:143)
	at org.apache.commons.lang3.reflect.ConstructorUtilsTest.testInvokeExactConstructor(ConstructorUtilsTest.java:127)

Running org.apache.commons.lang3.reflect.FieldUtilsTest
Tests run: 64, Failures: 0, Errors: 0, Skipped: 0, Time elapsed: 0.03 sec - in org.apache.commons.lang3.reflect.FieldUtilsTest
Running org.apache.commons.lang3.reflect.TypeLiteralTest
Tests run: 4, Failures: 0, Errors: 0, Skipped: 0, Time elapsed: 0.001 sec - in org.apache.commons.lang3.reflect.TypeLiteralTest
Running org.apache.commons.lang3.reflect.TypeUtilsTest
Tests run: 19, Failures: 0, Errors: 0, Skipped: 0, Time elapsed: 0.041 sec - in org.apache.commons.lang3.reflect.TypeUtilsTest
Running org.apache.commons.lang3.mutable.MutableByteTest
Tests run: 17, Failures: 0, Errors: 0, Skipped: 0, Time elapsed: 0.011 sec - in org.apache.commons.lang3.mutable.MutableByteTest
Running org.apache.commons.lang3.mutable.MutableShortTest
Tests run: 14, Failures: 0, Errors: 0, Skipped: 0, Time elapsed: 0.006 sec - in org.apache.commons.lang3.mutable.MutableShortTest
Running org.apache.commons.lang3.mutable.MutableIntTest
Tests run: 17, Failures: 0, Errors: 0, Skipped: 0, Time elapsed: 0.007 sec - in org.apache.commons.lang3.mutable.MutableIntTest
Running org.apache.commons.lang3.mutable.MutableDoubleTest
Tests run: 18, Failures: 0, Errors: 0, Skipped: 0, Time elapsed: 0.008 sec - in org.apache.commons.lang3.mutable.MutableDoubleTest
Running org.apache.commons.lang3.mutable.MutableFloatTest
Tests run: 18, Failures: 0, Errors: 0, Skipped: 0, Time elapsed: 0.009 sec - in org.apache.commons.lang3.mutable.MutableFloatTest
Running org.apache.commons.lang3.mutable.MutableLongTest
Tests run: 17, Failures: 0, Errors: 0, Skipped: 0, Time elapsed: 0.007 sec - in org.apache.commons.lang3.mutable.MutableLongTest
Running org.apache.commons.lang3.mutable.MutableBooleanTest
Tests run: 9, Failures: 0, Errors: 0, Skipped: 0, Time elapsed: 0.004 sec - in org.apache.commons.lang3.mutable.MutableBooleanTest
Running org.apache.commons.lang3.mutable.MutableObjectTest
Tests run: 5, Failures: 0, Errors: 0, Skipped: 0, Time elapsed: 0.002 sec - in org.apache.commons.lang3.mutable.MutableObjectTest
Running org.apache.commons.lang3.text.translate.UnicodeEscaperTest
Tests run: 3, Failures: 0, Errors: 0, Skipped: 0, Time elapsed: 0.001 sec - in org.apache.commons.lang3.text.translate.UnicodeEscaperTest
Running org.apache.commons.lang3.text.translate.EntityArraysTest
Tests run: 3, Failures: 0, Errors: 0, Skipped: 0, Time elapsed: 0.002 sec - in org.apache.commons.lang3.text.translate.EntityArraysTest
Running org.apache.commons.lang3.text.translate.UnicodeUnpairedSurrogateRemoverTest
Tests run: 2, Failures: 0, Errors: 0, Skipped: 0, Time elapsed: 0.001 sec - in org.apache.commons.lang3.text.translate.UnicodeUnpairedSurrogateRemoverTest
Running org.apache.commons.lang3.text.translate.NumericEntityUnescaperTest
Tests run: 3, Failures: 0, Errors: 0, Skipped: 0, Time elapsed: 0.001 sec - in org.apache.commons.lang3.text.translate.NumericEntityUnescaperTest
Running org.apache.commons.lang3.text.translate.NumericEntityEscaperTest
Tests run: 4, Failures: 0, Errors: 0, Skipped: 0, Time elapsed: 0.001 sec - in org.apache.commons.lang3.text.translate.NumericEntityEscaperTest
Running org.apache.commons.lang3.text.translate.LookupTranslatorTest
Tests run: 2, Failures: 0, Errors: 0, Skipped: 0, Time elapsed: 0 sec - in org.apache.commons.lang3.text.translate.LookupTranslatorTest
Running org.apache.commons.lang3.text.translate.UnicodeUnescaperTest
Tests run: 3, Failures: 0, Errors: 0, Skipped: 0, Time elapsed: 0 sec - in org.apache.commons.lang3.text.translate.UnicodeUnescaperTest
Running org.apache.commons.lang3.text.translate.OctalUnescaperTest
Tests run: 1, Failures: 0, Errors: 0, Skipped: 0, Time elapsed: 0 sec - in org.apache.commons.lang3.text.translate.OctalUnescaperTest
Running org.apache.commons.lang3.text.StrMatcherTest
Tests run: 14, Failures: 0, Errors: 0, Skipped: 0, Time elapsed: 0.003 sec - in org.apache.commons.lang3.text.StrMatcherTest
Running org.apache.commons.lang3.text.StrTokenizerTest
Tests run: 55, Failures: 0, Errors: 0, Skipped: 0, Time elapsed: 0.014 sec - in org.apache.commons.lang3.text.StrTokenizerTest
Running org.apache.commons.lang3.text.FormattableUtilsTest
Tests run: 5, Failures: 0, Errors: 0, Skipped: 0, Time elapsed: 0 sec - in org.apache.commons.lang3.text.FormattableUtilsTest
Running org.apache.commons.lang3.text.CompositeFormatTest
Tests run: 2, Failures: 0, Errors: 0, Skipped: 0, Time elapsed: 0 sec - in org.apache.commons.lang3.text.CompositeFormatTest
Running org.apache.commons.lang3.text.WordUtilsTest
Tests run: 12, Failures: 0, Errors: 0, Skipped: 0, Time elapsed: 0.016 sec - in org.apache.commons.lang3.text.WordUtilsTest
Running org.apache.commons.lang3.text.StrLookupTest
Tests run: 5, Failures: 0, Errors: 0, Skipped: 0, Time elapsed: 0.004 sec - in org.apache.commons.lang3.text.StrLookupTest
Running org.apache.commons.lang3.text.StrBuilderAppendInsertTest
Tests run: 51, Failures: 0, Errors: 0, Skipped: 0, Time elapsed: 0.021 sec - in org.apache.commons.lang3.text.StrBuilderAppendInsertTest
Running org.apache.commons.lang3.text.ExtendedMessageFormatTest
Tests run: 10, Failures: 0, Errors: 0, Skipped: 0, Time elapsed: 0.828 sec - in org.apache.commons.lang3.text.ExtendedMessageFormatTest
Running org.apache.commons.lang3.text.StrSubstitutorTest
Tests run: 40, Failures: 0, Errors: 0, Skipped: 0, Time elapsed: 0.038 sec - in org.apache.commons.lang3.text.StrSubstitutorTest
Running org.apache.commons.lang3.text.StrBuilderTest
Tests run: 90, Failures: 0, Errors: 0, Skipped: 0, Time elapsed: 0.057 sec - in org.apache.commons.lang3.text.StrBuilderTest
Running org.apache.commons.lang3.StringEscapeUtilsTest
Tests run: 28, Failures: 0, Errors: 0, Skipped: 0, Time elapsed: 0.487 sec - in org.apache.commons.lang3.StringEscapeUtilsTest
Running org.apache.commons.lang3.AnnotationUtilsTest
Tests run: 10, Failures: 0, Errors: 0, Skipped: 0, Time elapsed: 0.016 sec - in org.apache.commons.lang3.AnnotationUtilsTest
Running org.apache.commons.lang3.ConversionTest
Tests run: 42, Failures: 0, Errors: 0, Skipped: 0, Time elapsed: 0.011 sec - in org.apache.commons.lang3.ConversionTest
Running org.apache.commons.lang3.StringUtilsTrimEmptyTest
Tests run: 15, Failures: 0, Errors: 0, Skipped: 0, Time elapsed: 0.006 sec - in org.apache.commons.lang3.StringUtilsTrimEmptyTest
Running org.apache.commons.lang3.EnumUtilsTest
Tests run: 34, Failures: 0, Errors: 0, Skipped: 0, Time elapsed: 0.01 sec - in org.apache.commons.lang3.EnumUtilsTest
Running org.apache.commons.lang3.exception.ExceptionUtilsTest
Tests run: 28, Failures: 0, Errors: 0, Skipped: 0, Time elapsed: 0.028 sec - in org.apache.commons.lang3.exception.ExceptionUtilsTest
Running org.apache.commons.lang3.exception.DefaultExceptionContextTest
Tests run: 8, Failures: 0, Errors: 0, Skipped: 0, Time elapsed: 0.003 sec - in org.apache.commons.lang3.exception.DefaultExceptionContextTest
Running org.apache.commons.lang3.exception.ContextedExceptionTest
Tests run: 14, Failures: 0, Errors: 0, Skipped: 0, Time elapsed: 0.009 sec - in org.apache.commons.lang3.exception.ContextedExceptionTest
Running org.apache.commons.lang3.exception.ContextedRuntimeExceptionTest
Tests run: 14, Failures: 0, Errors: 0, Skipped: 0, Time elapsed: 0.01 sec - in org.apache.commons.lang3.exception.ContextedRuntimeExceptionTest
Running org.apache.commons.lang3.BitFieldTest
Tests run: 15, Failures: 0, Errors: 0, Skipped: 0, Time elapsed: 0.001 sec - in org.apache.commons.lang3.BitFieldTest
Running org.apache.commons.lang3.ArrayUtilsRemoveMultipleTest
Tests run: 55, Failures: 0, Errors: 1, Skipped: 0, Time elapsed: 0.014 sec <<< FAILURE! - in org.apache.commons.lang3.ArrayUtilsRemoveMultipleTest
testRemoveElementsObjectArray(org.apache.commons.lang3.ArrayUtilsRemoveMultipleTest)  Time elapsed: 0 sec  <<< ERROR!
java.lang.NullPointerException: null
	at org.apache.commons.lang3.ArrayUtils.isEmpty(ArrayUtils.java:657)
	at org.apache.commons.lang3.ArrayUtils.removeElements(ArrayUtils.java:837)
	at org.apache.commons.lang3.ArrayUtilsRemoveMultipleTest.testRemoveElementsObjectArray(ArrayUtilsRemoveMultipleTest.java:666)

Running org.apache.commons.lang3.HashSetvBitSetTest
Ratio=8% array=100 count=1 extract=22183609 bitset=1973917
Ratio=11% array=100 count=10 extract=18354146 bitset=2031201
Ratio=15% array=100 count=50 extract=11998582 bitset=1873036
Ratio=5% array=100 count=100 extract=10535470 bitset=540785
Ratio=77% array=1000 count=10 extract=6571038 bitset=5065838
Ratio=29% array=1000 count=100 extract=15454496 bitset=4606210
Ratio=7% array=1000 count=500 extract=44559384 bitset=3127699
Ratio=0% array=1000 count=1000 extract=79700390 bitset=782699
Ratio=18% count=0 hash=4146136 bits=778956
Ratio=28% count=5 hash=682981 bits=195015
Ratio=26% count=10 hash=1003831 bits=270798
Ratio=22% count=200 hash=19815033 bits=4483494
Ratio=15% count=50 hash=8714566 bits=1371130
Ratio=25% count=100 hash=9471090 bits=2444541
Ratio=21% count=1000 hash=81001623 bits=17185607
Ratio=21% count=2000 hash=162451593 bits=35019492
Tests run: 2, Failures: 0, Errors: 0, Skipped: 0, Time elapsed: 0.703 sec - in org.apache.commons.lang3.HashSetvBitSetTest
Running org.apache.commons.lang3.StringUtilsTest
Tests run: 124, Failures: 0, Errors: 4, Skipped: 0, Time elapsed: 0.168 sec <<< FAILURE! - in org.apache.commons.lang3.StringUtilsTest
testIsAnyBlank(org.apache.commons.lang3.StringUtilsTest)  Time elapsed: 0 sec  <<< ERROR!
java.lang.NullPointerException: null
	at org.apache.commons.lang3.ArrayUtils.isEmpty(ArrayUtils.java:657)
	at org.apache.commons.lang3.StringUtils.isAnyBlank(StringUtils.java:349)
	at org.apache.commons.lang3.StringUtilsTest.testIsAnyBlank(StringUtilsTest.java:190)

testIsAnyEmpty(org.apache.commons.lang3.StringUtilsTest)  Time elapsed: 0 sec  <<< ERROR!
java.lang.NullPointerException: null
	at org.apache.commons.lang3.ArrayUtils.isEmpty(ArrayUtils.java:657)
	at org.apache.commons.lang3.StringUtils.isAnyEmpty(StringUtils.java:249)
	at org.apache.commons.lang3.StringUtilsTest.testIsAnyEmpty(StringUtilsTest.java:148)

testIsNoneBlank(org.apache.commons.lang3.StringUtilsTest)  Time elapsed: 0 sec  <<< ERROR!
java.lang.NullPointerException: null
	at org.apache.commons.lang3.ArrayUtils.isEmpty(ArrayUtils.java:657)
	at org.apache.commons.lang3.StringUtils.isAnyBlank(StringUtils.java:349)
	at org.apache.commons.lang3.StringUtils.isNoneBlank(StringUtils.java:379)
	at org.apache.commons.lang3.StringUtilsTest.testIsNoneBlank(StringUtilsTest.java:203)

testIsNoneEmpty(org.apache.commons.lang3.StringUtilsTest)  Time elapsed: 0 sec  <<< ERROR!
java.lang.NullPointerException: null
	at org.apache.commons.lang3.ArrayUtils.isEmpty(ArrayUtils.java:657)
	at org.apache.commons.lang3.StringUtils.isAnyEmpty(StringUtils.java:249)
	at org.apache.commons.lang3.StringUtils.isNoneEmpty(StringUtils.java:278)
	at org.apache.commons.lang3.StringUtilsTest.testIsNoneEmpty(StringUtilsTest.java:160)

Running org.apache.commons.lang3.ArrayUtilsRemoveTest
Tests run: 19, Failures: 0, Errors: 0, Skipped: 0, Time elapsed: 0.001 sec - in org.apache.commons.lang3.ArrayUtilsRemoveTest
Running org.apache.commons.lang3.ObjectUtilsTest
Tests run: 36, Failures: 0, Errors: 0, Skipped: 0, Time elapsed: 0.017 sec - in org.apache.commons.lang3.ObjectUtilsTest
Running org.apache.commons.lang3.ClassPathUtilsTest
Tests run: 13, Failures: 0, Errors: 0, Skipped: 0, Time elapsed: 0 sec - in org.apache.commons.lang3.ClassPathUtilsTest
Running org.apache.commons.lang3.math.NumberUtilsTest
Tests run: 91, Failures: 0, Errors: 0, Skipped: 0, Time elapsed: 0.042 sec - in org.apache.commons.lang3.math.NumberUtilsTest
Running org.apache.commons.lang3.math.IEEE754rUtilsTest
Tests run: 3, Failures: 0, Errors: 0, Skipped: 0, Time elapsed: 0.007 sec - in org.apache.commons.lang3.math.IEEE754rUtilsTest
Running org.apache.commons.lang3.math.FractionTest
Tests run: 25, Failures: 0, Errors: 0, Skipped: 0, Time elapsed: 0.177 sec - in org.apache.commons.lang3.math.FractionTest
Running org.apache.commons.lang3.BooleanUtilsTest
Tests run: 72, Failures: 0, Errors: 0, Skipped: 0, Time elapsed: 0.029 sec - in org.apache.commons.lang3.BooleanUtilsTest
Running org.apache.commons.lang3.CharSequenceUtilsTest
Tests run: 2, Failures: 0, Errors: 0, Skipped: 0, Time elapsed: 0.002 sec - in org.apache.commons.lang3.CharSequenceUtilsTest
Running org.apache.commons.lang3.CharSetUtilsTest
Tests run: 11, Failures: 0, Errors: 0, Skipped: 0, Time elapsed: 0.007 sec - in org.apache.commons.lang3.CharSetUtilsTest
Running org.apache.commons.lang3.ArrayUtilsAddTest
Tests run: 13, Failures: 0, Errors: 0, Skipped: 0, Time elapsed: 0.007 sec - in org.apache.commons.lang3.ArrayUtilsAddTest
Running org.apache.commons.lang3.CharEncodingTest
Tests run: 6, Failures: 0, Errors: 0, Skipped: 0, Time elapsed: 0.051 sec - in org.apache.commons.lang3.CharEncodingTest
Running org.apache.commons.lang3.ClassUtilsTest
Tests run: 57, Failures: 0, Errors: 0, Skipped: 0, Time elapsed: 0.039 sec - in org.apache.commons.lang3.ClassUtilsTest
Running org.apache.commons.lang3.RangeTest
Tests run: 24, Failures: 0, Errors: 0, Skipped: 0, Time elapsed: 0.017 sec - in org.apache.commons.lang3.RangeTest
Running org.apache.commons.lang3.event.EventUtilsTest
Tests run: 8, Failures: 0, Errors: 2, Skipped: 0, Time elapsed: 0.052 sec <<< FAILURE! - in org.apache.commons.lang3.event.EventUtilsTest
testBindEventsToMethod(org.apache.commons.lang3.event.EventUtilsTest)  Time elapsed: 0.002 sec  <<< ERROR!
java.lang.reflect.UndeclaredThrowableException: null
	at org.apache.commons.lang3.ArrayUtils.isEmpty(ArrayUtils.java:657)
	at org.apache.commons.lang3.ArrayUtils.nullToEmpty(ArrayUtils.java:80)
	at org.apache.commons.lang3.reflect.MethodUtils.invokeMethod(MethodUtils.java:150)
	at org.apache.commons.lang3.reflect.MethodUtils.invokeMethod(MethodUtils.java:94)
	at org.apache.commons.lang3.event.EventUtils$EventBindingInvocationHandler.invoke(EventUtils.java:115)
	at com.sun.proxy.$Proxy19.propertyChange(Unknown Source)
	at sun.reflect.NativeMethodAccessorImpl.invoke0(Native Method)
	at sun.reflect.NativeMethodAccessorImpl.invoke(NativeMethodAccessorImpl.java:57)
	at sun.reflect.DelegatingMethodAccessorImpl.invoke(DelegatingMethodAccessorImpl.java:43)
	at java.lang.reflect.Method.invoke(Method.java:606)
	at org.apache.commons.lang3.event.EventListenerSupport$ProxyInvocationHandler.invoke(EventListenerSupport.java:317)
	at com.sun.proxy.$Proxy19.propertyChange(Unknown Source)
	at org.apache.commons.lang3.event.EventUtilsTest$PropertyChangeSource.setProperty(EventUtilsTest.java:263)
	at org.apache.commons.lang3.event.EventUtilsTest.testBindEventsToMethod(EventUtilsTest.java:134)

testBindFilteredEventsToMethod(org.apache.commons.lang3.event.EventUtilsTest)  Time elapsed: 0.005 sec  <<< ERROR!
java.lang.reflect.UndeclaredThrowableException: null
	at org.apache.commons.lang3.ArrayUtils.isEmpty(ArrayUtils.java:657)
	at org.apache.commons.lang3.ArrayUtils.nullToEmpty(ArrayUtils.java:80)
	at org.apache.commons.lang3.reflect.MethodUtils.invokeMethod(MethodUtils.java:150)
	at org.apache.commons.lang3.reflect.MethodUtils.invokeMethod(MethodUtils.java:94)
	at org.apache.commons.lang3.event.EventUtils$EventBindingInvocationHandler.invoke(EventUtils.java:115)
	at com.sun.proxy.$Proxy22.event1(Unknown Source)
	at sun.reflect.NativeMethodAccessorImpl.invoke0(Native Method)
	at sun.reflect.NativeMethodAccessorImpl.invoke(NativeMethodAccessorImpl.java:57)
	at sun.reflect.DelegatingMethodAccessorImpl.invoke(DelegatingMethodAccessorImpl.java:43)
	at java.lang.reflect.Method.invoke(Method.java:606)
	at org.apache.commons.lang3.event.EventListenerSupport$ProxyInvocationHandler.invoke(EventListenerSupport.java:317)
	at com.sun.proxy.$Proxy22.event1(Unknown Source)
	at org.apache.commons.lang3.event.EventUtilsTest.testBindFilteredEventsToMethod(EventUtilsTest.java:158)

Running org.apache.commons.lang3.event.EventListenerSupportTest
Tests run: 9, Failures: 0, Errors: 0, Skipped: 0, Time elapsed: 0.024 sec - in org.apache.commons.lang3.event.EventListenerSupportTest
Running org.apache.commons.lang3.ArrayUtilsTest
Tests run: 205, Failures: 11, Errors: 12, Skipped: 0, Time elapsed: 0.088 sec <<< FAILURE! - in org.apache.commons.lang3.ArrayUtilsTest
testNullToEmptyBooleanObjectEmptyArray(org.apache.commons.lang3.ArrayUtilsTest)  Time elapsed: 0.001 sec  <<< FAILURE!
java.lang.AssertionError: expected not same
	at org.junit.Assert.fail(Assert.java:88)
	at org.junit.Assert.failSame(Assert.java:819)
	at org.junit.Assert.assertNotSame(Assert.java:798)
	at org.junit.Assert.assertNotSame(Assert.java:811)
	at org.apache.commons.lang3.ArrayUtilsTest.testNullToEmptyBooleanObjectEmptyArray(ArrayUtilsTest.java:579)

testNullToEmptyBooleanObjectNull(org.apache.commons.lang3.ArrayUtilsTest)  Time elapsed: 0.001 sec  <<< ERROR!
java.lang.NullPointerException: null
	at org.apache.commons.lang3.ArrayUtils.isEmpty(ArrayUtils.java:657)
	at org.apache.commons.lang3.ArrayUtils.nullToEmpty(ArrayUtils.java:114)
	at org.apache.commons.lang3.ArrayUtilsTest.testNullToEmptyBooleanObjectNull(ArrayUtilsTest.java:571)

testNullToEmptyObjectNull(org.apache.commons.lang3.ArrayUtilsTest)  Time elapsed: 0 sec  <<< ERROR!
java.lang.NullPointerException: null
	at org.apache.commons.lang3.ArrayUtils.isEmpty(ArrayUtils.java:657)
	at org.apache.commons.lang3.ArrayUtils.nullToEmpty(ArrayUtils.java:78)
	at org.apache.commons.lang3.ArrayUtilsTest.testNullToEmptyObjectNull(ArrayUtilsTest.java:514)

testNullToEmptyByteObjectEmptyArray(org.apache.commons.lang3.ArrayUtilsTest)  Time elapsed: 0 sec  <<< FAILURE!
java.lang.AssertionError: expected not same
	at org.junit.Assert.fail(Assert.java:88)
	at org.junit.Assert.failSame(Assert.java:819)
	at org.junit.Assert.assertNotSame(Assert.java:798)
	at org.junit.Assert.assertNotSame(Assert.java:811)
	at org.apache.commons.lang3.ArrayUtilsTest.testNullToEmptyByteObjectEmptyArray(ArrayUtilsTest.java:676)

testNullToEmptyLongObjectEmptyArray(org.apache.commons.lang3.ArrayUtilsTest)  Time elapsed: 0.001 sec  <<< FAILURE!
java.lang.AssertionError: expected not same
	at org.junit.Assert.fail(Assert.java:88)
	at org.junit.Assert.failSame(Assert.java:819)
	at org.junit.Assert.assertNotSame(Assert.java:798)
	at org.junit.Assert.assertNotSame(Assert.java:811)
	at org.apache.commons.lang3.ArrayUtilsTest.testNullToEmptyLongObjectEmptyArray(ArrayUtilsTest.java:598)

testNullToEmptyDoubleObjectNull(org.apache.commons.lang3.ArrayUtilsTest)  Time elapsed: 0.001 sec  <<< ERROR!
java.lang.NullPointerException: null
	at org.apache.commons.lang3.ArrayUtils.isEmpty(ArrayUtils.java:657)
	at org.apache.commons.lang3.ArrayUtils.nullToEmpty(ArrayUtils.java:110)
	at org.apache.commons.lang3.ArrayUtilsTest.testNullToEmptyDoubleObjectNull(ArrayUtilsTest.java:687)

testNullToEmptyClassEmptyArray(org.apache.commons.lang3.ArrayUtilsTest)  Time elapsed: 0 sec  <<< FAILURE!
java.lang.AssertionError: expected not same
	at org.junit.Assert.fail(Assert.java:88)
	at org.junit.Assert.failSame(Assert.java:819)
	at org.junit.Assert.assertNotSame(Assert.java:798)
	at org.junit.Assert.assertNotSame(Assert.java:811)
	at org.apache.commons.lang3.ArrayUtilsTest.testNullToEmptyClassEmptyArray(ArrayUtilsTest.java:541)

testNullToEmptyLongObjectNull(org.apache.commons.lang3.ArrayUtilsTest)  Time elapsed: 0 sec  <<< ERROR!
java.lang.NullPointerException: null
	at org.apache.commons.lang3.ArrayUtils.isEmpty(ArrayUtils.java:657)
	at org.apache.commons.lang3.ArrayUtils.nullToEmpty(ArrayUtils.java:100)
	at org.apache.commons.lang3.ArrayUtilsTest.testNullToEmptyLongObjectNull(ArrayUtilsTest.java:590)

testNUllToEmptyCharObjectNull(org.apache.commons.lang3.ArrayUtilsTest)  Time elapsed: 0 sec  <<< ERROR!
java.lang.NullPointerException: null
	at org.apache.commons.lang3.ArrayUtils.isEmpty(ArrayUtils.java:657)
	at org.apache.commons.lang3.ArrayUtils.nullToEmpty(ArrayUtils.java:106)
	at org.apache.commons.lang3.ArrayUtilsTest.testNUllToEmptyCharObjectNull(ArrayUtilsTest.java:649)

testNullToEmptyObjectEmptyArray(org.apache.commons.lang3.ArrayUtilsTest)  Time elapsed: 0.001 sec  <<< FAILURE!
java.lang.AssertionError: expected not same
	at org.junit.Assert.fail(Assert.java:88)
	at org.junit.Assert.failSame(Assert.java:819)
	at org.junit.Assert.assertNotSame(Assert.java:798)
	at org.junit.Assert.assertNotSame(Assert.java:811)
	at org.apache.commons.lang3.ArrayUtilsTest.testNullToEmptyObjectEmptyArray(ArrayUtilsTest.java:522)

testNullToEmptyStringNull(org.apache.commons.lang3.ArrayUtilsTest)  Time elapsed: 0 sec  <<< ERROR!
java.lang.NullPointerException: null
	at org.apache.commons.lang3.ArrayUtils.isEmpty(ArrayUtils.java:657)
	at org.apache.commons.lang3.ArrayUtils.nullToEmpty(ArrayUtils.java:82)
	at org.apache.commons.lang3.ArrayUtilsTest.testNullToEmptyStringNull(ArrayUtilsTest.java:552)

testNullToEmptyShortObjectNull(org.apache.commons.lang3.ArrayUtilsTest)  Time elapsed: 0 sec  <<< ERROR!
java.lang.NullPointerException: null
	at org.apache.commons.lang3.ArrayUtils.isEmpty(ArrayUtils.java:657)
	at org.apache.commons.lang3.ArrayUtils.nullToEmpty(ArrayUtils.java:104)
	at org.apache.commons.lang3.ArrayUtilsTest.testNullToEmptyShortObjectNull(ArrayUtilsTest.java:629)

testNullToEmptyFloatObjectEmptyArray(org.apache.commons.lang3.ArrayUtilsTest)  Time elapsed: 0 sec  <<< FAILURE!
java.lang.AssertionError: expected not same
	at org.junit.Assert.fail(Assert.java:88)
	at org.junit.Assert.failSame(Assert.java:819)
	at org.junit.Assert.assertNotSame(Assert.java:798)
	at org.junit.Assert.assertNotSame(Assert.java:811)
	at org.apache.commons.lang3.ArrayUtilsTest.testNullToEmptyFloatObjectEmptyArray(ArrayUtilsTest.java:714)

testNullToEmptyIntObjectEmptyArray(org.apache.commons.lang3.ArrayUtilsTest)  Time elapsed: 0 sec  <<< FAILURE!
java.lang.AssertionError: expected not same
	at org.junit.Assert.fail(Assert.java:88)
	at org.junit.Assert.failSame(Assert.java:819)
	at org.junit.Assert.assertNotSame(Assert.java:798)
	at org.junit.Assert.assertNotSame(Assert.java:811)
	at org.apache.commons.lang3.ArrayUtilsTest.testNullToEmptyIntObjectEmptyArray(ArrayUtilsTest.java:618)

testNullToEmptyClassNull(org.apache.commons.lang3.ArrayUtilsTest)  Time elapsed: 0.001 sec  <<< ERROR!
java.lang.NullPointerException: null
	at org.apache.commons.lang3.ArrayUtils.isEmpty(ArrayUtils.java:657)
	at org.apache.commons.lang3.ArrayUtils.nullToEmpty(ArrayUtils.java:80)
	at org.apache.commons.lang3.ArrayUtilsTest.testNullToEmptyClassNull(ArrayUtilsTest.java:533)

testNullToEmptyShortObjectEmptyArray(org.apache.commons.lang3.ArrayUtilsTest)  Time elapsed: 0 sec  <<< FAILURE!
java.lang.AssertionError: expected not same
	at org.junit.Assert.fail(Assert.java:88)
	at org.junit.Assert.failSame(Assert.java:819)
	at org.junit.Assert.assertNotSame(Assert.java:798)
	at org.junit.Assert.assertNotSame(Assert.java:811)
	at org.apache.commons.lang3.ArrayUtilsTest.testNullToEmptyShortObjectEmptyArray(ArrayUtilsTest.java:637)

testIsEmptyObject(org.apache.commons.lang3.ArrayUtilsTest)  Time elapsed: 0 sec  <<< ERROR!
java.lang.NullPointerException: null
	at org.apache.commons.lang3.ArrayUtils.isEmpty(ArrayUtils.java:657)
	at org.apache.commons.lang3.ArrayUtilsTest.testIsEmptyObject(ArrayUtilsTest.java:3271)

testNullToEmptyStringEmptyArray(org.apache.commons.lang3.ArrayUtilsTest)  Time elapsed: 0.001 sec  <<< FAILURE!
java.lang.AssertionError: expected not same
	at org.junit.Assert.fail(Assert.java:88)
	at org.junit.Assert.failSame(Assert.java:819)
	at org.junit.Assert.assertNotSame(Assert.java:798)
	at org.junit.Assert.assertNotSame(Assert.java:811)
	at org.apache.commons.lang3.ArrayUtilsTest.testNullToEmptyStringEmptyArray(ArrayUtilsTest.java:560)

testNullToEmptyIntObjectNull(org.apache.commons.lang3.ArrayUtilsTest)  Time elapsed: 0.001 sec  <<< ERROR!
java.lang.NullPointerException: null
	at org.apache.commons.lang3.ArrayUtils.isEmpty(ArrayUtils.java:657)
	at org.apache.commons.lang3.ArrayUtils.nullToEmpty(ArrayUtils.java:102)
	at org.apache.commons.lang3.ArrayUtilsTest.testNullToEmptyIntObjectNull(ArrayUtilsTest.java:610)

testNullToEmptyByteObjectNull(org.apache.commons.lang3.ArrayUtilsTest)  Time elapsed: 0.001 sec  <<< ERROR!
java.lang.NullPointerException: null
	at org.apache.commons.lang3.ArrayUtils.isEmpty(ArrayUtils.java:657)
	at org.apache.commons.lang3.ArrayUtils.nullToEmpty(ArrayUtils.java:108)
	at org.apache.commons.lang3.ArrayUtilsTest.testNullToEmptyByteObjectNull(ArrayUtilsTest.java:668)

testNullToEmptyCharObjectEmptyArray(org.apache.commons.lang3.ArrayUtilsTest)  Time elapsed: 0 sec  <<< FAILURE!
java.lang.AssertionError: expected not same
	at org.junit.Assert.fail(Assert.java:88)
	at org.junit.Assert.failSame(Assert.java:819)
	at org.junit.Assert.assertNotSame(Assert.java:798)
	at org.junit.Assert.assertNotSame(Assert.java:811)
	at org.apache.commons.lang3.ArrayUtilsTest.testNullToEmptyCharObjectEmptyArray(ArrayUtilsTest.java:657)

testNullToEmptyDoubleObjectEmptyArray(org.apache.commons.lang3.ArrayUtilsTest)  Time elapsed: 0 sec  <<< FAILURE!
java.lang.AssertionError: expected not same
	at org.junit.Assert.fail(Assert.java:88)
	at org.junit.Assert.failSame(Assert.java:819)
	at org.junit.Assert.assertNotSame(Assert.java:798)
	at org.junit.Assert.assertNotSame(Assert.java:811)
	at org.apache.commons.lang3.ArrayUtilsTest.testNullToEmptyDoubleObjectEmptyArray(ArrayUtilsTest.java:695)

testNullToEmptyFloatObjectNull(org.apache.commons.lang3.ArrayUtilsTest)  Time elapsed: 0 sec  <<< ERROR!
java.lang.NullPointerException: null
	at org.apache.commons.lang3.ArrayUtils.isEmpty(ArrayUtils.java:657)
	at org.apache.commons.lang3.ArrayUtils.nullToEmpty(ArrayUtils.java:112)
	at org.apache.commons.lang3.ArrayUtilsTest.testNullToEmptyFloatObjectNull(ArrayUtilsTest.java:706)

Running org.apache.commons.lang3.CharUtilsTest
Tests run: 24, Failures: 0, Errors: 0, Skipped: 0, Time elapsed: 0.01 sec - in org.apache.commons.lang3.CharUtilsTest
Running org.apache.commons.lang3.NotImplementedExceptionTest
Tests run: 1, Failures: 0, Errors: 0, Skipped: 0, Time elapsed: 0.001 sec - in org.apache.commons.lang3.NotImplementedExceptionTest
Running org.apache.commons.lang3.StringUtilsEqualsIndexOfTest
Tests run: 50, Failures: 0, Errors: 1, Skipped: 0, Time elapsed: 0.031 sec <<< FAILURE! - in org.apache.commons.lang3.StringUtilsEqualsIndexOfTest
testContainsAny_StringStringArray(org.apache.commons.lang3.StringUtilsEqualsIndexOfTest)  Time elapsed: 0 sec  <<< ERROR!
java.lang.NullPointerException: null
	at org.apache.commons.lang3.ArrayUtils.isEmpty(ArrayUtils.java:657)
	at org.apache.commons.lang3.StringUtils.containsAny(StringUtils.java:1697)
	at org.apache.commons.lang3.StringUtilsEqualsIndexOfTest.testContainsAny_StringStringArray(StringUtilsEqualsIndexOfTest.java:225)

Running org.apache.commons.lang3.RandomUtilsTest
Tests run: 23, Failures: 0, Errors: 0, Skipped: 0, Time elapsed: 0.013 sec - in org.apache.commons.lang3.RandomUtilsTest

Results :

Failed tests: 
  ArrayUtilsTest.testNullToEmptyBooleanObjectEmptyArray:579 expected not same
  ArrayUtilsTest.testNullToEmptyByteObjectEmptyArray:676 expected not same
  ArrayUtilsTest.testNullToEmptyCharObjectEmptyArray:657 expected not same
  ArrayUtilsTest.testNullToEmptyClassEmptyArray:541 expected not same
  ArrayUtilsTest.testNullToEmptyDoubleObjectEmptyArray:695 expected not same
  ArrayUtilsTest.testNullToEmptyFloatObjectEmptyArray:714 expected not same
  ArrayUtilsTest.testNullToEmptyIntObjectEmptyArray:618 expected not same
  ArrayUtilsTest.testNullToEmptyLongObjectEmptyArray:598 expected not same
  ArrayUtilsTest.testNullToEmptyObjectEmptyArray:522 expected not same
  ArrayUtilsTest.testNullToEmptyShortObjectEmptyArray:637 expected not same
  ArrayUtilsTest.testNullToEmptyStringEmptyArray:560 expected not same

Tests in error: 
  ArrayUtilsRemoveMultipleTest.testRemoveElementsObjectArray:666 » NullPointer
  ArrayUtilsTest.testIsEmptyObject:3271 » NullPointer
  ArrayUtilsTest.testNUllToEmptyCharObjectNull:649 » NullPointer
  ArrayUtilsTest.testNullToEmptyBooleanObjectNull:571 » NullPointer
  ArrayUtilsTest.testNullToEmptyByteObjectNull:668 » NullPointer
  ArrayUtilsTest.testNullToEmptyClassNull:533 » NullPointer
  ArrayUtilsTest.testNullToEmptyDoubleObjectNull:687 » NullPointer
  ArrayUtilsTest.testNullToEmptyFloatObjectNull:706 » NullPointer
  ArrayUtilsTest.testNullToEmptyIntObjectNull:610 » NullPointer
  ArrayUtilsTest.testNullToEmptyLongObjectNull:590 » NullPointer
  ArrayUtilsTest.testNullToEmptyObjectNull:514 » NullPointer
  ArrayUtilsTest.testNullToEmptyShortObjectNull:629 » NullPointer
  ArrayUtilsTest.testNullToEmptyStringNull:552 » NullPointer
  StringUtilsEqualsIndexOfTest.testContainsAny_StringStringArray:225 » NullPointer
  StringUtilsStartsEndsWithTest.testStartsWithAny:90 » NullPointer
  StringUtilsTest.testIsAnyBlank:190 » NullPointer
  StringUtilsTest.testIsAnyEmpty:148 » NullPointer
  StringUtilsTest.testIsNoneBlank:203 » NullPointer
  StringUtilsTest.testIsNoneEmpty:160 » NullPointer
  EventUtilsTest.testBindEventsToMethod:134 » UndeclaredThrowable
  EventUtilsTest.testBindFilteredEventsToMethod:158 » UndeclaredThrowable
  ConstructorUtilsTest.testInvokeConstructor:104 » NullPointer
  ConstructorUtilsTest.testInvokeExactConstructor:127 » NullPointer
  MethodUtilsTest.testInvokeExactMethod:184 » NullPointer
  MethodUtilsTest.testInvokeExactStaticMethod:252 » NullPointer
  MethodUtilsTest.testInvokeMethod:159 » NullPointer
  MethodUtilsTest.testInvokeStaticMethod:222 » NullPointer


Tests run: 3526, Failures: 11, Errors: 27, Skipped: 97

[INFO] ------------------------------------------------------------------------
[INFO] BUILD FAILURE
[INFO] ------------------------------------------------------------------------
[INFO] Total time: 38.601s
[INFO] Finished at: Mon Aug 03 01:43:12 BST 2015
[INFO] Final Memory: 23M/407M
[INFO] ------------------------------------------------------------------------
[ERROR] Failed to execute goal org.apache.maven.plugins:maven-surefire-plugin:2.18:test (default-test) on project commons-lang3: There are test failures.
[ERROR] 
[ERROR] Please refer to /home/perham/Study/LittleDarwin/Cases/commons-lang3-3.4-src/target/surefire-reports for the individual test results.
[ERROR] -> [Help 1]
[ERROR] 
[ERROR] To see the full stack trace of the errors, re-run Maven with the -e switch.
[ERROR] Re-run Maven using the -X switch to enable full debug logging.
[ERROR] 
[ERROR] For more information about the errors and possible solutions, please read the following articles:
[ERROR] [Help 1] http://cwiki.apache.org/confluence/display/MAVEN/MojoFailureException
