[INFO] Scanning for projects...
[INFO]                                                                         
[INFO] ------------------------------------------------------------------------
[INFO] Building Apache Commons Lang 3.4
[INFO] ------------------------------------------------------------------------
[INFO] 
[INFO] --- maven-enforcer-plugin:1.3.1:enforce (enforce-maven-3) @ commons-lang3 ---
[INFO] 
[INFO] --- build-helper-maven-plugin:1.8:parse-version (parse-version) @ commons-lang3 ---
[INFO] 
[INFO] --- maven-antrun-plugin:1.8:run (javadoc.resources) @ commons-lang3 ---
[INFO] Executing tasks

main:
[INFO] Executed tasks
[INFO] 
[INFO] --- maven-remote-resources-plugin:1.5:process (default) @ commons-lang3 ---
[INFO] 
[INFO] --- buildnumber-maven-plugin:1.3:create (default) @ commons-lang3 ---
[INFO] Executing: /bin/sh -c cd /home/perham/Study/LittleDarwin/Cases/commons-lang3-3.4-src && svn --non-interactive info
[INFO] Working directory: /home/perham/Study/LittleDarwin/Cases/commons-lang3-3.4-src
[INFO] Storing buildNumber: ?????? at timestamp: 1438554538628
[INFO] Executing: /bin/sh -c cd /home/perham/Study/LittleDarwin/Cases/commons-lang3-3.4-src && svn --non-interactive info
[INFO] Working directory: /home/perham/Study/LittleDarwin/Cases/commons-lang3-3.4-src
[INFO] Storing buildScmBranch: UNKNOWN_BRANCH
[INFO] 
[INFO] --- maven-resources-plugin:2.7:resources (default-resources) @ commons-lang3 ---
[INFO] Using 'ISO-8859-1' encoding to copy filtered resources.
[INFO] Copying 0 resource
[INFO] Copying 2 resources to META-INF
[INFO] 
[INFO] --- maven-compiler-plugin:3.2:compile (default-compile) @ commons-lang3 ---
[INFO] Changes detected - recompiling the module!
[INFO] Compiling 133 source files to /home/perham/Study/LittleDarwin/Cases/commons-lang3-3.4-src/target/classes
[INFO] /home/perham/Study/LittleDarwin/Cases/commons-lang3-3.4-src/src/main/java/org/apache/commons/lang3/SerializationUtils.java: /home/perham/Study/LittleDarwin/Cases/commons-lang3-3.4-src/src/main/java/org/apache/commons/lang3/SerializationUtils.java uses unchecked or unsafe operations.
[INFO] /home/perham/Study/LittleDarwin/Cases/commons-lang3-3.4-src/src/main/java/org/apache/commons/lang3/SerializationUtils.java: Recompile with -Xlint:unchecked for details.
[INFO] 
[INFO] --- maven-bundle-plugin:2.5.3:manifest (bundle-manifest) @ commons-lang3 ---
[INFO] 
[INFO] --- animal-sniffer-maven-plugin:1.13:check (checkAPIcompatibility) @ commons-lang3 ---
[INFO] Checking unresolved references to org.codehaus.mojo.signature:java16:1.0
[INFO] 
[INFO] --- maven-resources-plugin:2.7:testResources (default-testResources) @ commons-lang3 ---
[INFO] Using 'ISO-8859-1' encoding to copy filtered resources.
[INFO] Copying 2 resources
[INFO] Copying 2 resources to META-INF
[INFO] 
[INFO] --- maven-compiler-plugin:3.2:testCompile (default-testCompile) @ commons-lang3 ---
[INFO] Nothing to compile - all classes are up to date
[INFO] 
[INFO] --- maven-surefire-plugin:2.18:test (default-test) @ commons-lang3 ---
[INFO] Surefire report directory: /home/perham/Study/LittleDarwin/Cases/commons-lang3-3.4-src/target/surefire-reports

-------------------------------------------------------
 T E S T S
-------------------------------------------------------
Running org.apache.commons.lang3.ValidateTest
Tests run: 63, Failures: 0, Errors: 0, Skipped: 0, Time elapsed: 0.039 sec - in org.apache.commons.lang3.ValidateTest
Running org.apache.commons.lang3.LocaleUtilsTest
Tests run: 15, Failures: 0, Errors: 0, Skipped: 0, Time elapsed: 0.027 sec - in org.apache.commons.lang3.LocaleUtilsTest
Running org.apache.commons.lang3.tuple.MutableTripleTest
Tests run: 8, Failures: 0, Errors: 0, Skipped: 0, Time elapsed: 0.01 sec - in org.apache.commons.lang3.tuple.MutableTripleTest
Running org.apache.commons.lang3.tuple.TripleTest
Tests run: 10, Failures: 0, Errors: 0, Skipped: 0, Time elapsed: 0.01 sec - in org.apache.commons.lang3.tuple.TripleTest
Running org.apache.commons.lang3.tuple.ImmutablePairTest
Tests run: 6, Failures: 0, Errors: 0, Skipped: 0, Time elapsed: 0 sec - in org.apache.commons.lang3.tuple.ImmutablePairTest
Running org.apache.commons.lang3.tuple.MutablePairTest
Tests run: 8, Failures: 0, Errors: 0, Skipped: 0, Time elapsed: 0.001 sec - in org.apache.commons.lang3.tuple.MutablePairTest
Running org.apache.commons.lang3.tuple.ImmutableTripleTest
Tests run: 6, Failures: 0, Errors: 0, Skipped: 0, Time elapsed: 0 sec - in org.apache.commons.lang3.tuple.ImmutableTripleTest
Running org.apache.commons.lang3.tuple.PairTest
Tests run: 9, Failures: 0, Errors: 0, Skipped: 0, Time elapsed: 0.001 sec - in org.apache.commons.lang3.tuple.PairTest
Running org.apache.commons.lang3.StringUtilsIsTest
Tests run: 8, Failures: 0, Errors: 0, Skipped: 0, Time elapsed: 0.014 sec - in org.apache.commons.lang3.StringUtilsIsTest
Running org.apache.commons.lang3.JavaVersionTest
Tests run: 3, Failures: 0, Errors: 0, Skipped: 0, Time elapsed: 0 sec - in org.apache.commons.lang3.JavaVersionTest
Running org.apache.commons.lang3.builder.NoFieldNamesToStringStyleTest
Tests run: 8, Failures: 0, Errors: 0, Skipped: 0, Time elapsed: 0.01 sec - in org.apache.commons.lang3.builder.NoFieldNamesToStringStyleTest
Running org.apache.commons.lang3.builder.ShortPrefixToStringStyleTest
Tests run: 8, Failures: 0, Errors: 0, Skipped: 0, Time elapsed: 0.002 sec - in org.apache.commons.lang3.builder.ShortPrefixToStringStyleTest
Running org.apache.commons.lang3.builder.DiffResultTest
Tests run: 9, Failures: 0, Errors: 0, Skipped: 0, Time elapsed: 0.007 sec - in org.apache.commons.lang3.builder.DiffResultTest
Running org.apache.commons.lang3.builder.CompareToBuilderTest
Tests run: 48, Failures: 0, Errors: 4, Skipped: 0, Time elapsed: 0.026 sec <<< FAILURE! - in org.apache.commons.lang3.builder.CompareToBuilderTest
testReflectionHierarchyCompareExcludeFields(org.apache.commons.lang3.builder.CompareToBuilderTest)  Time elapsed: 0.013 sec  <<< ERROR!
java.lang.ArrayIndexOutOfBoundsException: 0
	at org.apache.commons.lang3.ArrayUtils.indexOf(ArrayUtils.java:319)
	at org.apache.commons.lang3.ArrayUtils.indexOf(ArrayUtils.java:311)
	at org.apache.commons.lang3.ArrayUtils.contains(ArrayUtils.java:332)
	at org.apache.commons.lang3.builder.CompareToBuilder.reflectionAppend(CompareToBuilder.java:325)
	at org.apache.commons.lang3.builder.CompareToBuilder.reflectionCompare(CompareToBuilder.java:294)
	at org.apache.commons.lang3.builder.CompareToBuilder.reflectionCompare(CompareToBuilder.java:175)
	at org.apache.commons.lang3.builder.CompareToBuilderTest.reflectionCompareSignum(CompareToBuilderTest.java:246)
	at org.apache.commons.lang3.builder.CompareToBuilderTest.assertReflectionCompareContract(CompareToBuilderTest.java:218)
	at org.apache.commons.lang3.builder.CompareToBuilderTest.testReflectionHierarchyCompare(CompareToBuilderTest.java:192)
	at org.apache.commons.lang3.builder.CompareToBuilderTest.testReflectionHierarchyCompareExcludeFields(CompareToBuilderTest.java:133)

testReflectionHierarchyCompare(org.apache.commons.lang3.builder.CompareToBuilderTest)  Time elapsed: 0 sec  <<< ERROR!
java.lang.ArrayIndexOutOfBoundsException: 0
	at org.apache.commons.lang3.ArrayUtils.indexOf(ArrayUtils.java:319)
	at org.apache.commons.lang3.ArrayUtils.indexOf(ArrayUtils.java:311)
	at org.apache.commons.lang3.ArrayUtils.contains(ArrayUtils.java:332)
	at org.apache.commons.lang3.builder.CompareToBuilder.reflectionAppend(CompareToBuilder.java:325)
	at org.apache.commons.lang3.builder.CompareToBuilder.reflectionCompare(CompareToBuilder.java:294)
	at org.apache.commons.lang3.builder.CompareToBuilder.reflectionCompare(CompareToBuilder.java:175)
	at org.apache.commons.lang3.builder.CompareToBuilderTest.reflectionCompareSignum(CompareToBuilderTest.java:246)
	at org.apache.commons.lang3.builder.CompareToBuilderTest.assertReflectionCompareContract(CompareToBuilderTest.java:218)
	at org.apache.commons.lang3.builder.CompareToBuilderTest.testReflectionHierarchyCompare(CompareToBuilderTest.java:192)
	at org.apache.commons.lang3.builder.CompareToBuilderTest.testReflectionHierarchyCompare(CompareToBuilderTest.java:127)

testReflectionCompare(org.apache.commons.lang3.builder.CompareToBuilderTest)  Time elapsed: 0 sec  <<< ERROR!
java.lang.ArrayIndexOutOfBoundsException: 0
	at org.apache.commons.lang3.ArrayUtils.indexOf(ArrayUtils.java:319)
	at org.apache.commons.lang3.ArrayUtils.indexOf(ArrayUtils.java:311)
	at org.apache.commons.lang3.ArrayUtils.contains(ArrayUtils.java:332)
	at org.apache.commons.lang3.builder.CompareToBuilder.reflectionAppend(CompareToBuilder.java:325)
	at org.apache.commons.lang3.builder.CompareToBuilder.reflectionCompare(CompareToBuilder.java:294)
	at org.apache.commons.lang3.builder.CompareToBuilder.reflectionCompare(CompareToBuilder.java:143)
	at org.apache.commons.lang3.builder.CompareToBuilderTest.testReflectionCompare(CompareToBuilderTest.java:106)

testReflectionHierarchyCompareTransients(org.apache.commons.lang3.builder.CompareToBuilderTest)  Time elapsed: 0 sec  <<< ERROR!
java.lang.ArrayIndexOutOfBoundsException: 0
	at org.apache.commons.lang3.ArrayUtils.indexOf(ArrayUtils.java:319)
	at org.apache.commons.lang3.ArrayUtils.indexOf(ArrayUtils.java:311)
	at org.apache.commons.lang3.ArrayUtils.contains(ArrayUtils.java:332)
	at org.apache.commons.lang3.builder.CompareToBuilder.reflectionAppend(CompareToBuilder.java:325)
	at org.apache.commons.lang3.builder.CompareToBuilder.reflectionCompare(CompareToBuilder.java:294)
	at org.apache.commons.lang3.builder.CompareToBuilder.reflectionCompare(CompareToBuilder.java:175)
	at org.apache.commons.lang3.builder.CompareToBuilderTest.reflectionCompareSignum(CompareToBuilderTest.java:246)
	at org.apache.commons.lang3.builder.CompareToBuilderTest.assertReflectionCompareContract(CompareToBuilderTest.java:218)
	at org.apache.commons.lang3.builder.CompareToBuilderTest.testReflectionHierarchyCompare(CompareToBuilderTest.java:192)
	at org.apache.commons.lang3.builder.CompareToBuilderTest.testReflectionHierarchyCompareTransients(CompareToBuilderTest.java:152)

Running org.apache.commons.lang3.builder.MultilineRecursiveToStringStyleTest
Tests run: 10, Failures: 0, Errors: 0, Skipped: 0, Time elapsed: 0.002 sec - in org.apache.commons.lang3.builder.MultilineRecursiveToStringStyleTest
Running org.apache.commons.lang3.builder.RecursiveToStringStyleTest
Tests run: 8, Failures: 0, Errors: 0, Skipped: 0, Time elapsed: 0.003 sec - in org.apache.commons.lang3.builder.RecursiveToStringStyleTest
Running org.apache.commons.lang3.builder.DefaultToStringStyleTest
Tests run: 8, Failures: 0, Errors: 0, Skipped: 0, Time elapsed: 0.003 sec - in org.apache.commons.lang3.builder.DefaultToStringStyleTest
Running org.apache.commons.lang3.builder.ReflectionToStringBuilderExcludeTest
Tests run: 11, Failures: 0, Errors: 0, Skipped: 0, Time elapsed: 0.005 sec - in org.apache.commons.lang3.builder.ReflectionToStringBuilderExcludeTest
Running org.apache.commons.lang3.builder.StandardToStringStyleTest
Tests run: 8, Failures: 0, Errors: 0, Skipped: 0, Time elapsed: 0.003 sec - in org.apache.commons.lang3.builder.StandardToStringStyleTest
Running org.apache.commons.lang3.builder.ToStringStyleTest
Tests run: 12, Failures: 0, Errors: 0, Skipped: 0, Time elapsed: 0.002 sec - in org.apache.commons.lang3.builder.ToStringStyleTest
Running org.apache.commons.lang3.builder.DiffTest
Tests run: 4, Failures: 0, Errors: 0, Skipped: 0, Time elapsed: 0 sec - in org.apache.commons.lang3.builder.DiffTest
Running org.apache.commons.lang3.builder.SimpleToStringStyleTest
Tests run: 8, Failures: 0, Errors: 0, Skipped: 0, Time elapsed: 0.001 sec - in org.apache.commons.lang3.builder.SimpleToStringStyleTest
Running org.apache.commons.lang3.builder.MultiLineToStringStyleTest
Tests run: 8, Failures: 0, Errors: 0, Skipped: 0, Time elapsed: 0.004 sec - in org.apache.commons.lang3.builder.MultiLineToStringStyleTest
Running org.apache.commons.lang3.builder.ToStringStyleConcurrencyTest
Tests run: 3, Failures: 0, Errors: 0, Skipped: 0, Time elapsed: 4.299 sec - in org.apache.commons.lang3.builder.ToStringStyleConcurrencyTest
Running org.apache.commons.lang3.builder.ReflectionToStringBuilderMutateInspectConcurrencyTest
Tests run: 1, Failures: 0, Errors: 0, Skipped: 1, Time elapsed: 0 sec - in org.apache.commons.lang3.builder.ReflectionToStringBuilderMutateInspectConcurrencyTest
Running org.apache.commons.lang3.builder.ToStringBuilderTest
Tests run: 74, Failures: 0, Errors: 0, Skipped: 1, Time elapsed: 0.044 sec - in org.apache.commons.lang3.builder.ToStringBuilderTest
Running org.apache.commons.lang3.builder.EqualsBuilderTest
Tests run: 48, Failures: 0, Errors: 4, Skipped: 0, Time elapsed: 0.015 sec <<< FAILURE! - in org.apache.commons.lang3.builder.EqualsBuilderTest
testReflectionEquals(org.apache.commons.lang3.builder.EqualsBuilderTest)  Time elapsed: 0.002 sec  <<< ERROR!
java.lang.ArrayIndexOutOfBoundsException: 0
	at org.apache.commons.lang3.ArrayUtils.indexOf(ArrayUtils.java:319)
	at org.apache.commons.lang3.ArrayUtils.indexOf(ArrayUtils.java:311)
	at org.apache.commons.lang3.ArrayUtils.contains(ArrayUtils.java:332)
	at org.apache.commons.lang3.builder.EqualsBuilder.reflectionAppend(EqualsBuilder.java:411)
	at org.apache.commons.lang3.builder.EqualsBuilder.reflectionEquals(EqualsBuilder.java:365)
	at org.apache.commons.lang3.builder.EqualsBuilder.reflectionEquals(EqualsBuilder.java:274)
	at org.apache.commons.lang3.builder.EqualsBuilderTest.testReflectionEquals(EqualsBuilderTest.java:156)

testCyclicalObjectReferences(org.apache.commons.lang3.builder.EqualsBuilderTest)  Time elapsed: 0.002 sec  <<< ERROR!
java.lang.ArrayIndexOutOfBoundsException: 0
	at org.apache.commons.lang3.ArrayUtils.indexOf(ArrayUtils.java:319)
	at org.apache.commons.lang3.ArrayUtils.indexOf(ArrayUtils.java:311)
	at org.apache.commons.lang3.ArrayUtils.contains(ArrayUtils.java:332)
	at org.apache.commons.lang3.builder.EqualsBuilder.reflectionAppend(EqualsBuilder.java:411)
	at org.apache.commons.lang3.builder.EqualsBuilder.reflectionEquals(EqualsBuilder.java:365)
	at org.apache.commons.lang3.builder.EqualsBuilder.reflectionEquals(EqualsBuilder.java:274)
	at org.apache.commons.lang3.builder.EqualsBuilderTest$TestObjectReference.equals(EqualsBuilderTest.java:1126)
	at org.apache.commons.lang3.builder.EqualsBuilderTest.testCyclicalObjectReferences(EqualsBuilderTest.java:1102)

testReflectionEqualsExcludeFields(org.apache.commons.lang3.builder.EqualsBuilderTest)  Time elapsed: 0.001 sec  <<< ERROR!
java.lang.ArrayIndexOutOfBoundsException: 0
	at org.apache.commons.lang3.ArrayUtils.indexOf(ArrayUtils.java:319)
	at org.apache.commons.lang3.ArrayUtils.indexOf(ArrayUtils.java:311)
	at org.apache.commons.lang3.ArrayUtils.contains(ArrayUtils.java:332)
	at org.apache.commons.lang3.builder.EqualsBuilder.reflectionAppend(EqualsBuilder.java:411)
	at org.apache.commons.lang3.builder.EqualsBuilder.reflectionEquals(EqualsBuilder.java:365)
	at org.apache.commons.lang3.builder.EqualsBuilder.reflectionEquals(EqualsBuilder.java:274)
	at org.apache.commons.lang3.builder.EqualsBuilderTest.testReflectionEqualsExcludeFields(EqualsBuilderTest.java:1047)

testReflectionHierarchyEquals(org.apache.commons.lang3.builder.EqualsBuilderTest)  Time elapsed: 0.001 sec  <<< ERROR!
java.lang.ArrayIndexOutOfBoundsException: 0
	at org.apache.commons.lang3.ArrayUtils.indexOf(ArrayUtils.java:319)
	at org.apache.commons.lang3.ArrayUtils.indexOf(ArrayUtils.java:311)
	at org.apache.commons.lang3.ArrayUtils.contains(ArrayUtils.java:332)
	at org.apache.commons.lang3.builder.EqualsBuilder.reflectionAppend(EqualsBuilder.java:411)
	at org.apache.commons.lang3.builder.EqualsBuilder.reflectionEquals(EqualsBuilder.java:365)
	at org.apache.commons.lang3.builder.EqualsBuilder.reflectionEquals(EqualsBuilder.java:299)
	at org.apache.commons.lang3.builder.EqualsBuilderTest.testReflectionEqualsEquivalenceRelationship(EqualsBuilderTest.java:264)
	at org.apache.commons.lang3.builder.EqualsBuilderTest.testReflectionHierarchyEquals(EqualsBuilderTest.java:193)
	at org.apache.commons.lang3.builder.EqualsBuilderTest.testReflectionHierarchyEquals(EqualsBuilderTest.java:169)

Running org.apache.commons.lang3.builder.HashCodeBuilderAndEqualsBuilderTest
Tests run: 4, Failures: 0, Errors: 4, Skipped: 0, Time elapsed: 0 sec <<< FAILURE! - in org.apache.commons.lang3.builder.HashCodeBuilderAndEqualsBuilderTest
testIntegerWithTransients(org.apache.commons.lang3.builder.HashCodeBuilderAndEqualsBuilderTest)  Time elapsed: 0 sec  <<< ERROR!
java.lang.ArrayIndexOutOfBoundsException: 0
	at org.apache.commons.lang3.ArrayUtils.indexOf(ArrayUtils.java:319)
	at org.apache.commons.lang3.ArrayUtils.indexOf(ArrayUtils.java:311)
	at org.apache.commons.lang3.ArrayUtils.contains(ArrayUtils.java:332)
	at org.apache.commons.lang3.builder.EqualsBuilder.reflectionAppend(EqualsBuilder.java:411)
	at org.apache.commons.lang3.builder.EqualsBuilder.reflectionEquals(EqualsBuilder.java:365)
	at org.apache.commons.lang3.builder.EqualsBuilder.reflectionEquals(EqualsBuilder.java:299)
	at org.apache.commons.lang3.builder.HashCodeBuilderAndEqualsBuilderTest.assertEqualsAndHashCodeContract(HashCodeBuilderAndEqualsBuilderTest.java:85)
	at org.apache.commons.lang3.builder.HashCodeBuilderAndEqualsBuilderTest.testInteger(HashCodeBuilderAndEqualsBuilderTest.java:37)
	at org.apache.commons.lang3.builder.HashCodeBuilderAndEqualsBuilderTest.testIntegerWithTransients(HashCodeBuilderAndEqualsBuilderTest.java:47)

testFixture(org.apache.commons.lang3.builder.HashCodeBuilderAndEqualsBuilderTest)  Time elapsed: 0 sec  <<< ERROR!
java.lang.ArrayIndexOutOfBoundsException: 0
	at org.apache.commons.lang3.ArrayUtils.indexOf(ArrayUtils.java:319)
	at org.apache.commons.lang3.ArrayUtils.indexOf(ArrayUtils.java:311)
	at org.apache.commons.lang3.ArrayUtils.contains(ArrayUtils.java:332)
	at org.apache.commons.lang3.builder.EqualsBuilder.reflectionAppend(EqualsBuilder.java:411)
	at org.apache.commons.lang3.builder.EqualsBuilder.reflectionEquals(EqualsBuilder.java:365)
	at org.apache.commons.lang3.builder.EqualsBuilder.reflectionEquals(EqualsBuilder.java:299)
	at org.apache.commons.lang3.builder.HashCodeBuilderAndEqualsBuilderTest.assertEqualsAndHashCodeContract(HashCodeBuilderAndEqualsBuilderTest.java:85)
	at org.apache.commons.lang3.builder.HashCodeBuilderAndEqualsBuilderTest.testFixture(HashCodeBuilderAndEqualsBuilderTest.java:61)
	at org.apache.commons.lang3.builder.HashCodeBuilderAndEqualsBuilderTest.testFixture(HashCodeBuilderAndEqualsBuilderTest.java:52)

testFixtureWithTransients(org.apache.commons.lang3.builder.HashCodeBuilderAndEqualsBuilderTest)  Time elapsed: 0 sec  <<< ERROR!
java.lang.ArrayIndexOutOfBoundsException: 0
	at org.apache.commons.lang3.ArrayUtils.indexOf(ArrayUtils.java:319)
	at org.apache.commons.lang3.ArrayUtils.indexOf(ArrayUtils.java:311)
	at org.apache.commons.lang3.ArrayUtils.contains(ArrayUtils.java:332)
	at org.apache.commons.lang3.builder.EqualsBuilder.reflectionAppend(EqualsBuilder.java:411)
	at org.apache.commons.lang3.builder.EqualsBuilder.reflectionEquals(EqualsBuilder.java:365)
	at org.apache.commons.lang3.builder.EqualsBuilder.reflectionEquals(EqualsBuilder.java:299)
	at org.apache.commons.lang3.builder.HashCodeBuilderAndEqualsBuilderTest.assertEqualsAndHashCodeContract(HashCodeBuilderAndEqualsBuilderTest.java:85)
	at org.apache.commons.lang3.builder.HashCodeBuilderAndEqualsBuilderTest.testFixture(HashCodeBuilderAndEqualsBuilderTest.java:61)
	at org.apache.commons.lang3.builder.HashCodeBuilderAndEqualsBuilderTest.testFixtureWithTransients(HashCodeBuilderAndEqualsBuilderTest.java:57)

testInteger(org.apache.commons.lang3.builder.HashCodeBuilderAndEqualsBuilderTest)  Time elapsed: 0 sec  <<< ERROR!
java.lang.ArrayIndexOutOfBoundsException: 0
	at org.apache.commons.lang3.ArrayUtils.indexOf(ArrayUtils.java:319)
	at org.apache.commons.lang3.ArrayUtils.indexOf(ArrayUtils.java:311)
	at org.apache.commons.lang3.ArrayUtils.contains(ArrayUtils.java:332)
	at org.apache.commons.lang3.builder.EqualsBuilder.reflectionAppend(EqualsBuilder.java:411)
	at org.apache.commons.lang3.builder.EqualsBuilder.reflectionEquals(EqualsBuilder.java:365)
	at org.apache.commons.lang3.builder.EqualsBuilder.reflectionEquals(EqualsBuilder.java:299)
	at org.apache.commons.lang3.builder.HashCodeBuilderAndEqualsBuilderTest.assertEqualsAndHashCodeContract(HashCodeBuilderAndEqualsBuilderTest.java:85)
	at org.apache.commons.lang3.builder.HashCodeBuilderAndEqualsBuilderTest.testInteger(HashCodeBuilderAndEqualsBuilderTest.java:37)
	at org.apache.commons.lang3.builder.HashCodeBuilderAndEqualsBuilderTest.testInteger(HashCodeBuilderAndEqualsBuilderTest.java:42)

Running org.apache.commons.lang3.builder.ReflectionToStringBuilderConcurrencyTest
Tests run: 3, Failures: 0, Errors: 0, Skipped: 3, Time elapsed: 0 sec - in org.apache.commons.lang3.builder.ReflectionToStringBuilderConcurrencyTest
Running org.apache.commons.lang3.builder.JsonToStringStyleTest
Tests run: 9, Failures: 0, Errors: 0, Skipped: 0, Time elapsed: 0.001 sec - in org.apache.commons.lang3.builder.JsonToStringStyleTest
Running org.apache.commons.lang3.builder.NoClassNameToStringStyleTest
Tests run: 8, Failures: 0, Errors: 0, Skipped: 0, Time elapsed: 0.001 sec - in org.apache.commons.lang3.builder.NoClassNameToStringStyleTest
Running org.apache.commons.lang3.builder.DiffBuilderTest
Tests run: 30, Failures: 0, Errors: 23, Skipped: 0, Time elapsed: 0.015 sec <<< FAILURE! - in org.apache.commons.lang3.builder.DiffBuilderTest
testCharArray(org.apache.commons.lang3.builder.DiffBuilderTest)  Time elapsed: 0.002 sec  <<< ERROR!
java.lang.ArrayIndexOutOfBoundsException: 0
	at org.apache.commons.lang3.ArrayUtils.indexOf(ArrayUtils.java:319)
	at org.apache.commons.lang3.ArrayUtils.indexOf(ArrayUtils.java:311)
	at org.apache.commons.lang3.ArrayUtils.contains(ArrayUtils.java:332)
	at org.apache.commons.lang3.builder.EqualsBuilder.reflectionAppend(EqualsBuilder.java:411)
	at org.apache.commons.lang3.builder.EqualsBuilder.reflectionEquals(EqualsBuilder.java:365)
	at org.apache.commons.lang3.builder.EqualsBuilder.reflectionEquals(EqualsBuilder.java:299)
	at org.apache.commons.lang3.builder.DiffBuilderTest$TypeTestClass.equals(DiffBuilderTest.java:92)
	at org.apache.commons.lang3.builder.DiffBuilder.<init>(DiffBuilder.java:119)
	at org.apache.commons.lang3.builder.DiffBuilder.<init>(DiffBuilder.java:151)
	at org.apache.commons.lang3.builder.DiffBuilderTest$TypeTestClass.diff(DiffBuilderTest.java:63)
	at org.apache.commons.lang3.builder.DiffBuilderTest.testCharArray(DiffBuilderTest.java:169)

testObjectArray(org.apache.commons.lang3.builder.DiffBuilderTest)  Time elapsed: 0 sec  <<< ERROR!
java.lang.ArrayIndexOutOfBoundsException: 0
	at org.apache.commons.lang3.ArrayUtils.indexOf(ArrayUtils.java:319)
	at org.apache.commons.lang3.ArrayUtils.indexOf(ArrayUtils.java:311)
	at org.apache.commons.lang3.ArrayUtils.contains(ArrayUtils.java:332)
	at org.apache.commons.lang3.builder.EqualsBuilder.reflectionAppend(EqualsBuilder.java:411)
	at org.apache.commons.lang3.builder.EqualsBuilder.reflectionEquals(EqualsBuilder.java:365)
	at org.apache.commons.lang3.builder.EqualsBuilder.reflectionEquals(EqualsBuilder.java:299)
	at org.apache.commons.lang3.builder.DiffBuilderTest$TypeTestClass.equals(DiffBuilderTest.java:92)
	at org.apache.commons.lang3.builder.DiffBuilder.<init>(DiffBuilder.java:119)
	at org.apache.commons.lang3.builder.DiffBuilder.<init>(DiffBuilder.java:151)
	at org.apache.commons.lang3.builder.DiffBuilderTest$TypeTestClass.diff(DiffBuilderTest.java:63)
	at org.apache.commons.lang3.builder.DiffBuilderTest.testObjectArray(DiffBuilderTest.java:381)

testFloatArray(org.apache.commons.lang3.builder.DiffBuilderTest)  Time elapsed: 0.001 sec  <<< ERROR!
java.lang.ArrayIndexOutOfBoundsException: 0
	at org.apache.commons.lang3.ArrayUtils.indexOf(ArrayUtils.java:319)
	at org.apache.commons.lang3.ArrayUtils.indexOf(ArrayUtils.java:311)
	at org.apache.commons.lang3.ArrayUtils.contains(ArrayUtils.java:332)
	at org.apache.commons.lang3.builder.EqualsBuilder.reflectionAppend(EqualsBuilder.java:411)
	at org.apache.commons.lang3.builder.EqualsBuilder.reflectionEquals(EqualsBuilder.java:365)
	at org.apache.commons.lang3.builder.EqualsBuilder.reflectionEquals(EqualsBuilder.java:299)
	at org.apache.commons.lang3.builder.DiffBuilderTest$TypeTestClass.equals(DiffBuilderTest.java:92)
	at org.apache.commons.lang3.builder.DiffBuilder.<init>(DiffBuilder.java:119)
	at org.apache.commons.lang3.builder.DiffBuilder.<init>(DiffBuilder.java:151)
	at org.apache.commons.lang3.builder.DiffBuilderTest$TypeTestClass.diff(DiffBuilderTest.java:63)
	at org.apache.commons.lang3.builder.DiffBuilderTest.testFloatArray(DiffBuilderTest.java:224)

testObjectsNotSameButEqual(org.apache.commons.lang3.builder.DiffBuilderTest)  Time elapsed: 0 sec  <<< ERROR!
java.lang.ArrayIndexOutOfBoundsException: 0
	at org.apache.commons.lang3.ArrayUtils.indexOf(ArrayUtils.java:319)
	at org.apache.commons.lang3.ArrayUtils.indexOf(ArrayUtils.java:311)
	at org.apache.commons.lang3.ArrayUtils.contains(ArrayUtils.java:332)
	at org.apache.commons.lang3.builder.EqualsBuilder.reflectionAppend(EqualsBuilder.java:411)
	at org.apache.commons.lang3.builder.EqualsBuilder.reflectionEquals(EqualsBuilder.java:365)
	at org.apache.commons.lang3.builder.EqualsBuilder.reflectionEquals(EqualsBuilder.java:299)
	at org.apache.commons.lang3.builder.DiffBuilderTest$TypeTestClass.equals(DiffBuilderTest.java:92)
	at org.apache.commons.lang3.builder.DiffBuilder.<init>(DiffBuilder.java:119)
	at org.apache.commons.lang3.builder.DiffBuilder.<init>(DiffBuilder.java:151)
	at org.apache.commons.lang3.builder.DiffBuilderTest$TypeTestClass.diff(DiffBuilderTest.java:63)
	at org.apache.commons.lang3.builder.DiffBuilderTest.testObjectsNotSameButEqual(DiffBuilderTest.java:356)

testInt(org.apache.commons.lang3.builder.DiffBuilderTest)  Time elapsed: 0.001 sec  <<< ERROR!
java.lang.ArrayIndexOutOfBoundsException: 0
	at org.apache.commons.lang3.ArrayUtils.indexOf(ArrayUtils.java:319)
	at org.apache.commons.lang3.ArrayUtils.indexOf(ArrayUtils.java:311)
	at org.apache.commons.lang3.ArrayUtils.contains(ArrayUtils.java:332)
	at org.apache.commons.lang3.builder.EqualsBuilder.reflectionAppend(EqualsBuilder.java:411)
	at org.apache.commons.lang3.builder.EqualsBuilder.reflectionEquals(EqualsBuilder.java:365)
	at org.apache.commons.lang3.builder.EqualsBuilder.reflectionEquals(EqualsBuilder.java:299)
	at org.apache.commons.lang3.builder.DiffBuilderTest$TypeTestClass.equals(DiffBuilderTest.java:92)
	at org.apache.commons.lang3.builder.DiffBuilder.<init>(DiffBuilder.java:119)
	at org.apache.commons.lang3.builder.DiffBuilder.<init>(DiffBuilder.java:151)
	at org.apache.commons.lang3.builder.DiffBuilderTest$TypeTestClass.diff(DiffBuilderTest.java:63)
	at org.apache.commons.lang3.builder.DiffBuilderTest.testInt(DiffBuilderTest.java:239)

testByteArray(org.apache.commons.lang3.builder.DiffBuilderTest)  Time elapsed: 0 sec  <<< ERROR!
java.lang.ArrayIndexOutOfBoundsException: 0
	at org.apache.commons.lang3.ArrayUtils.indexOf(ArrayUtils.java:319)
	at org.apache.commons.lang3.ArrayUtils.indexOf(ArrayUtils.java:311)
	at org.apache.commons.lang3.ArrayUtils.contains(ArrayUtils.java:332)
	at org.apache.commons.lang3.builder.EqualsBuilder.reflectionAppend(EqualsBuilder.java:411)
	at org.apache.commons.lang3.builder.EqualsBuilder.reflectionEquals(EqualsBuilder.java:365)
	at org.apache.commons.lang3.builder.EqualsBuilder.reflectionEquals(EqualsBuilder.java:299)
	at org.apache.commons.lang3.builder.DiffBuilderTest$TypeTestClass.equals(DiffBuilderTest.java:92)
	at org.apache.commons.lang3.builder.DiffBuilder.<init>(DiffBuilder.java:119)
	at org.apache.commons.lang3.builder.DiffBuilder.<init>(DiffBuilder.java:151)
	at org.apache.commons.lang3.builder.DiffBuilderTest$TypeTestClass.diff(DiffBuilderTest.java:63)
	at org.apache.commons.lang3.builder.DiffBuilderTest.testByteArray(DiffBuilderTest.java:142)

testFloat(org.apache.commons.lang3.builder.DiffBuilderTest)  Time elapsed: 0.001 sec  <<< ERROR!
java.lang.ArrayIndexOutOfBoundsException: 0
	at org.apache.commons.lang3.ArrayUtils.indexOf(ArrayUtils.java:319)
	at org.apache.commons.lang3.ArrayUtils.indexOf(ArrayUtils.java:311)
	at org.apache.commons.lang3.ArrayUtils.contains(ArrayUtils.java:332)
	at org.apache.commons.lang3.builder.EqualsBuilder.reflectionAppend(EqualsBuilder.java:411)
	at org.apache.commons.lang3.builder.EqualsBuilder.reflectionEquals(EqualsBuilder.java:365)
	at org.apache.commons.lang3.builder.EqualsBuilder.reflectionEquals(EqualsBuilder.java:299)
	at org.apache.commons.lang3.builder.DiffBuilderTest$TypeTestClass.equals(DiffBuilderTest.java:92)
	at org.apache.commons.lang3.builder.DiffBuilder.<init>(DiffBuilder.java:119)
	at org.apache.commons.lang3.builder.DiffBuilder.<init>(DiffBuilder.java:151)
	at org.apache.commons.lang3.builder.DiffBuilderTest$TypeTestClass.diff(DiffBuilderTest.java:63)
	at org.apache.commons.lang3.builder.DiffBuilderTest.testFloat(DiffBuilderTest.java:211)

testShort(org.apache.commons.lang3.builder.DiffBuilderTest)  Time elapsed: 0 sec  <<< ERROR!
java.lang.ArrayIndexOutOfBoundsException: 0
	at org.apache.commons.lang3.ArrayUtils.indexOf(ArrayUtils.java:319)
	at org.apache.commons.lang3.ArrayUtils.indexOf(ArrayUtils.java:311)
	at org.apache.commons.lang3.ArrayUtils.contains(ArrayUtils.java:332)
	at org.apache.commons.lang3.builder.EqualsBuilder.reflectionAppend(EqualsBuilder.java:411)
	at org.apache.commons.lang3.builder.EqualsBuilder.reflectionEquals(EqualsBuilder.java:365)
	at org.apache.commons.lang3.builder.EqualsBuilder.reflectionEquals(EqualsBuilder.java:299)
	at org.apache.commons.lang3.builder.DiffBuilderTest$TypeTestClass.equals(DiffBuilderTest.java:92)
	at org.apache.commons.lang3.builder.DiffBuilder.<init>(DiffBuilder.java:119)
	at org.apache.commons.lang3.builder.DiffBuilder.<init>(DiffBuilder.java:151)
	at org.apache.commons.lang3.builder.DiffBuilderTest$TypeTestClass.diff(DiffBuilderTest.java:63)
	at org.apache.commons.lang3.builder.DiffBuilderTest.testShort(DiffBuilderTest.java:293)

testByte(org.apache.commons.lang3.builder.DiffBuilderTest)  Time elapsed: 0.001 sec  <<< ERROR!
java.lang.ArrayIndexOutOfBoundsException: 0
	at org.apache.commons.lang3.ArrayUtils.indexOf(ArrayUtils.java:319)
	at org.apache.commons.lang3.ArrayUtils.indexOf(ArrayUtils.java:311)
	at org.apache.commons.lang3.ArrayUtils.contains(ArrayUtils.java:332)
	at org.apache.commons.lang3.builder.EqualsBuilder.reflectionAppend(EqualsBuilder.java:411)
	at org.apache.commons.lang3.builder.EqualsBuilder.reflectionEquals(EqualsBuilder.java:365)
	at org.apache.commons.lang3.builder.EqualsBuilder.reflectionEquals(EqualsBuilder.java:299)
	at org.apache.commons.lang3.builder.DiffBuilderTest$TypeTestClass.equals(DiffBuilderTest.java:92)
	at org.apache.commons.lang3.builder.DiffBuilder.<init>(DiffBuilder.java:119)
	at org.apache.commons.lang3.builder.DiffBuilder.<init>(DiffBuilder.java:151)
	at org.apache.commons.lang3.builder.DiffBuilderTest$TypeTestClass.diff(DiffBuilderTest.java:63)
	at org.apache.commons.lang3.builder.DiffBuilderTest.testByte(DiffBuilderTest.java:130)

testChar(org.apache.commons.lang3.builder.DiffBuilderTest)  Time elapsed: 0 sec  <<< ERROR!
java.lang.ArrayIndexOutOfBoundsException: 0
	at org.apache.commons.lang3.ArrayUtils.indexOf(ArrayUtils.java:319)
	at org.apache.commons.lang3.ArrayUtils.indexOf(ArrayUtils.java:311)
	at org.apache.commons.lang3.ArrayUtils.contains(ArrayUtils.java:332)
	at org.apache.commons.lang3.builder.EqualsBuilder.reflectionAppend(EqualsBuilder.java:411)
	at org.apache.commons.lang3.builder.EqualsBuilder.reflectionEquals(EqualsBuilder.java:365)
	at org.apache.commons.lang3.builder.EqualsBuilder.reflectionEquals(EqualsBuilder.java:299)
	at org.apache.commons.lang3.builder.DiffBuilderTest$TypeTestClass.equals(DiffBuilderTest.java:92)
	at org.apache.commons.lang3.builder.DiffBuilder.<init>(DiffBuilder.java:119)
	at org.apache.commons.lang3.builder.DiffBuilder.<init>(DiffBuilder.java:151)
	at org.apache.commons.lang3.builder.DiffBuilderTest$TypeTestClass.diff(DiffBuilderTest.java:63)
	at org.apache.commons.lang3.builder.DiffBuilderTest.testChar(DiffBuilderTest.java:156)

testLong(org.apache.commons.lang3.builder.DiffBuilderTest)  Time elapsed: 0.001 sec  <<< ERROR!
java.lang.ArrayIndexOutOfBoundsException: 0
	at org.apache.commons.lang3.ArrayUtils.indexOf(ArrayUtils.java:319)
	at org.apache.commons.lang3.ArrayUtils.indexOf(ArrayUtils.java:311)
	at org.apache.commons.lang3.ArrayUtils.contains(ArrayUtils.java:332)
	at org.apache.commons.lang3.builder.EqualsBuilder.reflectionAppend(EqualsBuilder.java:411)
	at org.apache.commons.lang3.builder.EqualsBuilder.reflectionEquals(EqualsBuilder.java:365)
	at org.apache.commons.lang3.builder.EqualsBuilder.reflectionEquals(EqualsBuilder.java:299)
	at org.apache.commons.lang3.builder.DiffBuilderTest$TypeTestClass.equals(DiffBuilderTest.java:92)
	at org.apache.commons.lang3.builder.DiffBuilder.<init>(DiffBuilder.java:119)
	at org.apache.commons.lang3.builder.DiffBuilder.<init>(DiffBuilder.java:151)
	at org.apache.commons.lang3.builder.DiffBuilderTest$TypeTestClass.diff(DiffBuilderTest.java:63)
	at org.apache.commons.lang3.builder.DiffBuilderTest.testLong(DiffBuilderTest.java:266)

testObjectsSameAndEqual(org.apache.commons.lang3.builder.DiffBuilderTest)  Time elapsed: 0 sec  <<< ERROR!
java.lang.ArrayIndexOutOfBoundsException: 0
	at org.apache.commons.lang3.ArrayUtils.indexOf(ArrayUtils.java:319)
	at org.apache.commons.lang3.ArrayUtils.indexOf(ArrayUtils.java:311)
	at org.apache.commons.lang3.ArrayUtils.contains(ArrayUtils.java:332)
	at org.apache.commons.lang3.builder.EqualsBuilder.reflectionAppend(EqualsBuilder.java:411)
	at org.apache.commons.lang3.builder.EqualsBuilder.reflectionEquals(EqualsBuilder.java:365)
	at org.apache.commons.lang3.builder.EqualsBuilder.reflectionEquals(EqualsBuilder.java:299)
	at org.apache.commons.lang3.builder.DiffBuilderTest$TypeTestClass.equals(DiffBuilderTest.java:92)
	at org.apache.commons.lang3.builder.DiffBuilder.<init>(DiffBuilder.java:119)
	at org.apache.commons.lang3.builder.DiffBuilder.<init>(DiffBuilder.java:151)
	at org.apache.commons.lang3.builder.DiffBuilderTest$TypeTestClass.diff(DiffBuilderTest.java:63)
	at org.apache.commons.lang3.builder.DiffBuilderTest.testObjectsSameAndEqual(DiffBuilderTest.java:340)

testBoolean(org.apache.commons.lang3.builder.DiffBuilderTest)  Time elapsed: 0.001 sec  <<< ERROR!
java.lang.ArrayIndexOutOfBoundsException: 0
	at org.apache.commons.lang3.ArrayUtils.indexOf(ArrayUtils.java:319)
	at org.apache.commons.lang3.ArrayUtils.indexOf(ArrayUtils.java:311)
	at org.apache.commons.lang3.ArrayUtils.contains(ArrayUtils.java:332)
	at org.apache.commons.lang3.builder.EqualsBuilder.reflectionAppend(EqualsBuilder.java:411)
	at org.apache.commons.lang3.builder.EqualsBuilder.reflectionEquals(EqualsBuilder.java:365)
	at org.apache.commons.lang3.builder.EqualsBuilder.reflectionEquals(EqualsBuilder.java:299)
	at org.apache.commons.lang3.builder.DiffBuilderTest$TypeTestClass.equals(DiffBuilderTest.java:92)
	at org.apache.commons.lang3.builder.DiffBuilder.<init>(DiffBuilder.java:119)
	at org.apache.commons.lang3.builder.DiffBuilder.<init>(DiffBuilder.java:151)
	at org.apache.commons.lang3.builder.DiffBuilderTest$TypeTestClass.diff(DiffBuilderTest.java:63)
	at org.apache.commons.lang3.builder.DiffBuilderTest.testBoolean(DiffBuilderTest.java:102)

testBooleanArray(org.apache.commons.lang3.builder.DiffBuilderTest)  Time elapsed: 0 sec  <<< ERROR!
java.lang.ArrayIndexOutOfBoundsException: 0
	at org.apache.commons.lang3.ArrayUtils.indexOf(ArrayUtils.java:319)
	at org.apache.commons.lang3.ArrayUtils.indexOf(ArrayUtils.java:311)
	at org.apache.commons.lang3.ArrayUtils.contains(ArrayUtils.java:332)
	at org.apache.commons.lang3.builder.EqualsBuilder.reflectionAppend(EqualsBuilder.java:411)
	at org.apache.commons.lang3.builder.EqualsBuilder.reflectionEquals(EqualsBuilder.java:365)
	at org.apache.commons.lang3.builder.EqualsBuilder.reflectionEquals(EqualsBuilder.java:299)
	at org.apache.commons.lang3.builder.DiffBuilderTest$TypeTestClass.equals(DiffBuilderTest.java:92)
	at org.apache.commons.lang3.builder.DiffBuilder.<init>(DiffBuilder.java:119)
	at org.apache.commons.lang3.builder.DiffBuilder.<init>(DiffBuilder.java:151)
	at org.apache.commons.lang3.builder.DiffBuilderTest$TypeTestClass.diff(DiffBuilderTest.java:63)
	at org.apache.commons.lang3.builder.DiffBuilderTest.testBooleanArray(DiffBuilderTest.java:115)

testSimilarObjectIgnoresAppends(org.apache.commons.lang3.builder.DiffBuilderTest)  Time elapsed: 0.001 sec  <<< ERROR!
java.lang.ArrayIndexOutOfBoundsException: 0
	at org.apache.commons.lang3.ArrayUtils.indexOf(ArrayUtils.java:319)
	at org.apache.commons.lang3.ArrayUtils.indexOf(ArrayUtils.java:311)
	at org.apache.commons.lang3.ArrayUtils.contains(ArrayUtils.java:332)
	at org.apache.commons.lang3.builder.EqualsBuilder.reflectionAppend(EqualsBuilder.java:411)
	at org.apache.commons.lang3.builder.EqualsBuilder.reflectionEquals(EqualsBuilder.java:365)
	at org.apache.commons.lang3.builder.EqualsBuilder.reflectionEquals(EqualsBuilder.java:299)
	at org.apache.commons.lang3.builder.DiffBuilderTest$TypeTestClass.equals(DiffBuilderTest.java:92)
	at org.apache.commons.lang3.builder.DiffBuilder.<init>(DiffBuilder.java:119)
	at org.apache.commons.lang3.builder.DiffBuilder.<init>(DiffBuilder.java:151)
	at org.apache.commons.lang3.builder.DiffBuilderTest.testSimilarObjectIgnoresAppends(DiffBuilderTest.java:441)

testLongArray(org.apache.commons.lang3.builder.DiffBuilderTest)  Time elapsed: 0 sec  <<< ERROR!
java.lang.ArrayIndexOutOfBoundsException: 0
	at org.apache.commons.lang3.ArrayUtils.indexOf(ArrayUtils.java:319)
	at org.apache.commons.lang3.ArrayUtils.indexOf(ArrayUtils.java:311)
	at org.apache.commons.lang3.ArrayUtils.contains(ArrayUtils.java:332)
	at org.apache.commons.lang3.builder.EqualsBuilder.reflectionAppend(EqualsBuilder.java:411)
	at org.apache.commons.lang3.builder.EqualsBuilder.reflectionEquals(EqualsBuilder.java:365)
	at org.apache.commons.lang3.builder.EqualsBuilder.reflectionEquals(EqualsBuilder.java:299)
	at org.apache.commons.lang3.builder.DiffBuilderTest$TypeTestClass.equals(DiffBuilderTest.java:92)
	at org.apache.commons.lang3.builder.DiffBuilder.<init>(DiffBuilder.java:119)
	at org.apache.commons.lang3.builder.DiffBuilder.<init>(DiffBuilder.java:151)
	at org.apache.commons.lang3.builder.DiffBuilderTest$TypeTestClass.diff(DiffBuilderTest.java:63)
	at org.apache.commons.lang3.builder.DiffBuilderTest.testLongArray(DiffBuilderTest.java:279)

testShortArray(org.apache.commons.lang3.builder.DiffBuilderTest)  Time elapsed: 0.001 sec  <<< ERROR!
java.lang.ArrayIndexOutOfBoundsException: 0
	at org.apache.commons.lang3.ArrayUtils.indexOf(ArrayUtils.java:319)
	at org.apache.commons.lang3.ArrayUtils.indexOf(ArrayUtils.java:311)
	at org.apache.commons.lang3.ArrayUtils.contains(ArrayUtils.java:332)
	at org.apache.commons.lang3.builder.EqualsBuilder.reflectionAppend(EqualsBuilder.java:411)
	at org.apache.commons.lang3.builder.EqualsBuilder.reflectionEquals(EqualsBuilder.java:365)
	at org.apache.commons.lang3.builder.EqualsBuilder.reflectionEquals(EqualsBuilder.java:299)
	at org.apache.commons.lang3.builder.DiffBuilderTest$TypeTestClass.equals(DiffBuilderTest.java:92)
	at org.apache.commons.lang3.builder.DiffBuilder.<init>(DiffBuilder.java:119)
	at org.apache.commons.lang3.builder.DiffBuilder.<init>(DiffBuilder.java:151)
	at org.apache.commons.lang3.builder.DiffBuilderTest$TypeTestClass.diff(DiffBuilderTest.java:63)
	at org.apache.commons.lang3.builder.DiffBuilderTest.testShortArray(DiffBuilderTest.java:306)

testObjectArrayEqual(org.apache.commons.lang3.builder.DiffBuilderTest)  Time elapsed: 0 sec  <<< ERROR!
java.lang.ArrayIndexOutOfBoundsException: 0
	at org.apache.commons.lang3.ArrayUtils.indexOf(ArrayUtils.java:319)
	at org.apache.commons.lang3.ArrayUtils.indexOf(ArrayUtils.java:311)
	at org.apache.commons.lang3.ArrayUtils.contains(ArrayUtils.java:332)
	at org.apache.commons.lang3.builder.EqualsBuilder.reflectionAppend(EqualsBuilder.java:411)
	at org.apache.commons.lang3.builder.EqualsBuilder.reflectionEquals(EqualsBuilder.java:365)
	at org.apache.commons.lang3.builder.EqualsBuilder.reflectionEquals(EqualsBuilder.java:299)
	at org.apache.commons.lang3.builder.DiffBuilderTest$TypeTestClass.equals(DiffBuilderTest.java:92)
	at org.apache.commons.lang3.builder.DiffBuilder.<init>(DiffBuilder.java:119)
	at org.apache.commons.lang3.builder.DiffBuilder.<init>(DiffBuilder.java:151)
	at org.apache.commons.lang3.builder.DiffBuilderTest$TypeTestClass.diff(DiffBuilderTest.java:63)
	at org.apache.commons.lang3.builder.DiffBuilderTest.testObjectArrayEqual(DiffBuilderTest.java:394)

testObjectsNotSameNorEqual(org.apache.commons.lang3.builder.DiffBuilderTest)  Time elapsed: 0.001 sec  <<< ERROR!
java.lang.ArrayIndexOutOfBoundsException: 0
	at org.apache.commons.lang3.ArrayUtils.indexOf(ArrayUtils.java:319)
	at org.apache.commons.lang3.ArrayUtils.indexOf(ArrayUtils.java:311)
	at org.apache.commons.lang3.ArrayUtils.contains(ArrayUtils.java:332)
	at org.apache.commons.lang3.builder.EqualsBuilder.reflectionAppend(EqualsBuilder.java:411)
	at org.apache.commons.lang3.builder.EqualsBuilder.reflectionEquals(EqualsBuilder.java:365)
	at org.apache.commons.lang3.builder.EqualsBuilder.reflectionEquals(EqualsBuilder.java:299)
	at org.apache.commons.lang3.builder.DiffBuilderTest$TypeTestClass.equals(DiffBuilderTest.java:92)
	at org.apache.commons.lang3.builder.DiffBuilder.<init>(DiffBuilder.java:119)
	at org.apache.commons.lang3.builder.DiffBuilder.<init>(DiffBuilder.java:151)
	at org.apache.commons.lang3.builder.DiffBuilderTest$TypeTestClass.diff(DiffBuilderTest.java:63)
	at org.apache.commons.lang3.builder.DiffBuilderTest.testObjectsNotSameNorEqual(DiffBuilderTest.java:372)

testIntArray(org.apache.commons.lang3.builder.DiffBuilderTest)  Time elapsed: 0 sec  <<< ERROR!
java.lang.ArrayIndexOutOfBoundsException: 0
	at org.apache.commons.lang3.ArrayUtils.indexOf(ArrayUtils.java:319)
	at org.apache.commons.lang3.ArrayUtils.indexOf(ArrayUtils.java:311)
	at org.apache.commons.lang3.ArrayUtils.contains(ArrayUtils.java:332)
	at org.apache.commons.lang3.builder.EqualsBuilder.reflectionAppend(EqualsBuilder.java:411)
	at org.apache.commons.lang3.builder.EqualsBuilder.reflectionEquals(EqualsBuilder.java:365)
	at org.apache.commons.lang3.builder.EqualsBuilder.reflectionEquals(EqualsBuilder.java:299)
	at org.apache.commons.lang3.builder.DiffBuilderTest$TypeTestClass.equals(DiffBuilderTest.java:92)
	at org.apache.commons.lang3.builder.DiffBuilder.<init>(DiffBuilder.java:119)
	at org.apache.commons.lang3.builder.DiffBuilder.<init>(DiffBuilder.java:151)
	at org.apache.commons.lang3.builder.DiffBuilderTest$TypeTestClass.diff(DiffBuilderTest.java:63)
	at org.apache.commons.lang3.builder.DiffBuilderTest.testIntArray(DiffBuilderTest.java:252)

testDouble(org.apache.commons.lang3.builder.DiffBuilderTest)  Time elapsed: 0.001 sec  <<< ERROR!
java.lang.ArrayIndexOutOfBoundsException: 0
	at org.apache.commons.lang3.ArrayUtils.indexOf(ArrayUtils.java:319)
	at org.apache.commons.lang3.ArrayUtils.indexOf(ArrayUtils.java:311)
	at org.apache.commons.lang3.ArrayUtils.contains(ArrayUtils.java:332)
	at org.apache.commons.lang3.builder.EqualsBuilder.reflectionAppend(EqualsBuilder.java:411)
	at org.apache.commons.lang3.builder.EqualsBuilder.reflectionEquals(EqualsBuilder.java:365)
	at org.apache.commons.lang3.builder.EqualsBuilder.reflectionEquals(EqualsBuilder.java:299)
	at org.apache.commons.lang3.builder.DiffBuilderTest$TypeTestClass.equals(DiffBuilderTest.java:92)
	at org.apache.commons.lang3.builder.DiffBuilder.<init>(DiffBuilder.java:119)
	at org.apache.commons.lang3.builder.DiffBuilder.<init>(DiffBuilder.java:151)
	at org.apache.commons.lang3.builder.DiffBuilderTest$TypeTestClass.diff(DiffBuilderTest.java:63)
	at org.apache.commons.lang3.builder.DiffBuilderTest.testDouble(DiffBuilderTest.java:184)

testObject(org.apache.commons.lang3.builder.DiffBuilderTest)  Time elapsed: 0 sec  <<< ERROR!
java.lang.ArrayIndexOutOfBoundsException: 0
	at org.apache.commons.lang3.ArrayUtils.indexOf(ArrayUtils.java:319)
	at org.apache.commons.lang3.ArrayUtils.indexOf(ArrayUtils.java:311)
	at org.apache.commons.lang3.ArrayUtils.contains(ArrayUtils.java:332)
	at org.apache.commons.lang3.builder.EqualsBuilder.reflectionAppend(EqualsBuilder.java:411)
	at org.apache.commons.lang3.builder.EqualsBuilder.reflectionEquals(EqualsBuilder.java:365)
	at org.apache.commons.lang3.builder.EqualsBuilder.reflectionEquals(EqualsBuilder.java:299)
	at org.apache.commons.lang3.builder.DiffBuilderTest$TypeTestClass.equals(DiffBuilderTest.java:92)
	at org.apache.commons.lang3.builder.DiffBuilder.<init>(DiffBuilder.java:119)
	at org.apache.commons.lang3.builder.DiffBuilder.<init>(DiffBuilder.java:151)
	at org.apache.commons.lang3.builder.DiffBuilderTest$TypeTestClass.diff(DiffBuilderTest.java:63)
	at org.apache.commons.lang3.builder.DiffBuilderTest.testObject(DiffBuilderTest.java:320)

testDoubleArray(org.apache.commons.lang3.builder.DiffBuilderTest)  Time elapsed: 0 sec  <<< ERROR!
java.lang.ArrayIndexOutOfBoundsException: 0
	at org.apache.commons.lang3.ArrayUtils.indexOf(ArrayUtils.java:319)
	at org.apache.commons.lang3.ArrayUtils.indexOf(ArrayUtils.java:311)
	at org.apache.commons.lang3.ArrayUtils.contains(ArrayUtils.java:332)
	at org.apache.commons.lang3.builder.EqualsBuilder.reflectionAppend(EqualsBuilder.java:411)
	at org.apache.commons.lang3.builder.EqualsBuilder.reflectionEquals(EqualsBuilder.java:365)
	at org.apache.commons.lang3.builder.EqualsBuilder.reflectionEquals(EqualsBuilder.java:299)
	at org.apache.commons.lang3.builder.DiffBuilderTest$TypeTestClass.equals(DiffBuilderTest.java:92)
	at org.apache.commons.lang3.builder.DiffBuilder.<init>(DiffBuilder.java:119)
	at org.apache.commons.lang3.builder.DiffBuilder.<init>(DiffBuilder.java:151)
	at org.apache.commons.lang3.builder.DiffBuilderTest$TypeTestClass.diff(DiffBuilderTest.java:63)
	at org.apache.commons.lang3.builder.DiffBuilderTest.testDoubleArray(DiffBuilderTest.java:197)

Running org.apache.commons.lang3.builder.HashCodeBuilderTest
Tests run: 44, Failures: 0, Errors: 4, Skipped: 0, Time elapsed: 0.01 sec <<< FAILURE! - in org.apache.commons.lang3.builder.HashCodeBuilderTest
testReflectionObjectCycle(org.apache.commons.lang3.builder.HashCodeBuilderTest)  Time elapsed: 0.001 sec  <<< ERROR!
java.lang.ArrayIndexOutOfBoundsException: 0
	at org.apache.commons.lang3.ArrayUtils.indexOf(ArrayUtils.java:319)
	at org.apache.commons.lang3.ArrayUtils.indexOf(ArrayUtils.java:311)
	at org.apache.commons.lang3.ArrayUtils.contains(ArrayUtils.java:332)
	at org.apache.commons.lang3.builder.HashCodeBuilder.reflectionAppend(HashCodeBuilder.java:192)
	at org.apache.commons.lang3.builder.HashCodeBuilder.reflectionHashCode(HashCodeBuilder.java:354)
	at org.apache.commons.lang3.builder.HashCodeBuilder.reflectionHashCode(HashCodeBuilder.java:473)
	at org.apache.commons.lang3.builder.HashCodeBuilderTest$ReflectionTestCycleA.hashCode(HashCodeBuilderTest.java:39)
	at org.apache.commons.lang3.builder.HashCodeBuilderTest.testReflectionObjectCycle(HashCodeBuilderTest.java:552)

testReflectionHierarchyHashCode(org.apache.commons.lang3.builder.HashCodeBuilderTest)  Time elapsed: 0.001 sec  <<< ERROR!
java.lang.ArrayIndexOutOfBoundsException: 0
	at org.apache.commons.lang3.ArrayUtils.indexOf(ArrayUtils.java:319)
	at org.apache.commons.lang3.ArrayUtils.indexOf(ArrayUtils.java:311)
	at org.apache.commons.lang3.ArrayUtils.contains(ArrayUtils.java:332)
	at org.apache.commons.lang3.builder.HashCodeBuilder.reflectionAppend(HashCodeBuilder.java:192)
	at org.apache.commons.lang3.builder.HashCodeBuilder.reflectionHashCode(HashCodeBuilder.java:354)
	at org.apache.commons.lang3.builder.HashCodeBuilder.reflectionHashCode(HashCodeBuilder.java:473)
	at org.apache.commons.lang3.builder.HashCodeBuilderTest.testReflectionHierarchyHashCode(HashCodeBuilderTest.java:153)

testReflectionHashCode(org.apache.commons.lang3.builder.HashCodeBuilderTest)  Time elapsed: 0 sec  <<< ERROR!
java.lang.ArrayIndexOutOfBoundsException: 0
	at org.apache.commons.lang3.ArrayUtils.indexOf(ArrayUtils.java:319)
	at org.apache.commons.lang3.ArrayUtils.indexOf(ArrayUtils.java:311)
	at org.apache.commons.lang3.ArrayUtils.contains(ArrayUtils.java:332)
	at org.apache.commons.lang3.builder.HashCodeBuilder.reflectionAppend(HashCodeBuilder.java:192)
	at org.apache.commons.lang3.builder.HashCodeBuilder.reflectionHashCode(HashCodeBuilder.java:354)
	at org.apache.commons.lang3.builder.HashCodeBuilder.reflectionHashCode(HashCodeBuilder.java:473)
	at org.apache.commons.lang3.builder.HashCodeBuilderTest.testReflectionHashCode(HashCodeBuilderTest.java:147)

testReflectionHashCodeExcludeFields(org.apache.commons.lang3.builder.HashCodeBuilderTest)  Time elapsed: 0.001 sec  <<< ERROR!
java.lang.ArrayIndexOutOfBoundsException: 0
	at org.apache.commons.lang3.ArrayUtils.indexOf(ArrayUtils.java:319)
	at org.apache.commons.lang3.ArrayUtils.indexOf(ArrayUtils.java:311)
	at org.apache.commons.lang3.ArrayUtils.contains(ArrayUtils.java:332)
	at org.apache.commons.lang3.builder.HashCodeBuilder.reflectionAppend(HashCodeBuilder.java:192)
	at org.apache.commons.lang3.builder.HashCodeBuilder.reflectionHashCode(HashCodeBuilder.java:354)
	at org.apache.commons.lang3.builder.HashCodeBuilder.reflectionHashCode(HashCodeBuilder.java:473)
	at org.apache.commons.lang3.builder.HashCodeBuilderTest.testReflectionHashCodeExcludeFields(HashCodeBuilderTest.java:493)

Running org.apache.commons.lang3.concurrent.AtomicInitializerTest
Tests run: 3, Failures: 0, Errors: 0, Skipped: 0, Time elapsed: 0.003 sec - in org.apache.commons.lang3.concurrent.AtomicInitializerTest
Running org.apache.commons.lang3.concurrent.CallableBackgroundInitializerTest
Tests run: 4, Failures: 0, Errors: 0, Skipped: 0, Time elapsed: 0.002 sec - in org.apache.commons.lang3.concurrent.CallableBackgroundInitializerTest
Running org.apache.commons.lang3.concurrent.BackgroundInitializerTest
Tests run: 15, Failures: 0, Errors: 0, Skipped: 0, Time elapsed: 0.012 sec - in org.apache.commons.lang3.concurrent.BackgroundInitializerTest
Running org.apache.commons.lang3.concurrent.LazyInitializerTest
Tests run: 3, Failures: 0, Errors: 0, Skipped: 0, Time elapsed: 0 sec - in org.apache.commons.lang3.concurrent.LazyInitializerTest
Running org.apache.commons.lang3.concurrent.BasicThreadFactoryTest
Tests run: 15, Failures: 0, Errors: 0, Skipped: 0, Time elapsed: 0.035 sec - in org.apache.commons.lang3.concurrent.BasicThreadFactoryTest
Running org.apache.commons.lang3.concurrent.ConstantInitializerTest
Tests run: 7, Failures: 0, Errors: 0, Skipped: 0, Time elapsed: 0 sec - in org.apache.commons.lang3.concurrent.ConstantInitializerTest
Running org.apache.commons.lang3.concurrent.MultiBackgroundInitializerTest
Tests run: 17, Failures: 0, Errors: 0, Skipped: 0, Time elapsed: 0.039 sec - in org.apache.commons.lang3.concurrent.MultiBackgroundInitializerTest
Running org.apache.commons.lang3.concurrent.AtomicSafeInitializerTest
Tests run: 4, Failures: 0, Errors: 0, Skipped: 0, Time elapsed: 0.005 sec - in org.apache.commons.lang3.concurrent.AtomicSafeInitializerTest
Running org.apache.commons.lang3.concurrent.ConcurrentUtilsTest
Tests run: 40, Failures: 0, Errors: 0, Skipped: 0, Time elapsed: 0.016 sec - in org.apache.commons.lang3.concurrent.ConcurrentUtilsTest
Running org.apache.commons.lang3.concurrent.TimedSemaphoreTest
Tests run: 15, Failures: 0, Errors: 0, Skipped: 0, Time elapsed: 1.177 sec - in org.apache.commons.lang3.concurrent.TimedSemaphoreTest
Running org.apache.commons.lang3.StringUtilsSubstringTest
Tests run: 14, Failures: 0, Errors: 0, Skipped: 0, Time elapsed: 0.004 sec - in org.apache.commons.lang3.StringUtilsSubstringTest
Running org.apache.commons.lang3.SystemUtilsTest
Tests run: 12, Failures: 0, Errors: 0, Skipped: 0, Time elapsed: 0.002 sec - in org.apache.commons.lang3.SystemUtilsTest
Running org.apache.commons.lang3.CharRangeTest
Tests run: 16, Failures: 0, Errors: 0, Skipped: 0, Time elapsed: 0.031 sec - in org.apache.commons.lang3.CharRangeTest
Running org.apache.commons.lang3.CharSetTest
Tests run: 14, Failures: 6, Errors: 0, Skipped: 0, Time elapsed: 0.01 sec <<< FAILURE! - in org.apache.commons.lang3.CharSetTest
testConstructor_String_oddDash(org.apache.commons.lang3.CharSetTest)  Time elapsed: 0.001 sec  <<< FAILURE!
java.lang.AssertionError: null
	at org.junit.Assert.fail(Assert.java:86)
	at org.junit.Assert.assertTrue(Assert.java:41)
	at org.junit.Assert.assertTrue(Assert.java:52)
	at org.apache.commons.lang3.CharSetTest.testConstructor_String_oddDash(CharSetTest.java:194)

testConstructor_String_combo(org.apache.commons.lang3.CharSetTest)  Time elapsed: 0 sec  <<< FAILURE!
java.lang.AssertionError: null
	at org.junit.Assert.fail(Assert.java:86)
	at org.junit.Assert.assertTrue(Assert.java:41)
	at org.junit.Assert.assertTrue(Assert.java:52)
	at org.apache.commons.lang3.CharSetTest.testConstructor_String_combo(CharSetTest.java:114)

testConstructor_String_oddCombinations(org.apache.commons.lang3.CharSetTest)  Time elapsed: 0.001 sec  <<< FAILURE!
java.lang.AssertionError: null
	at org.junit.Assert.fail(Assert.java:86)
	at org.junit.Assert.assertTrue(Assert.java:41)
	at org.junit.Assert.assertTrue(Assert.java:52)
	at org.apache.commons.lang3.CharSetTest.testConstructor_String_oddCombinations(CharSetTest.java:301)

testConstructor_String_comboNegated(org.apache.commons.lang3.CharSetTest)  Time elapsed: 0 sec  <<< FAILURE!
java.lang.AssertionError: null
	at org.junit.Assert.fail(Assert.java:86)
	at org.junit.Assert.assertTrue(Assert.java:41)
	at org.junit.Assert.assertTrue(Assert.java:52)
	at org.apache.commons.lang3.CharSetTest.testConstructor_String_comboNegated(CharSetTest.java:153)

testConstructor_String_oddNegate(org.apache.commons.lang3.CharSetTest)  Time elapsed: 0 sec  <<< FAILURE!
java.lang.AssertionError: null
	at org.junit.Assert.fail(Assert.java:86)
	at org.junit.Assert.assertTrue(Assert.java:41)
	at org.junit.Assert.assertTrue(Assert.java:52)
	at org.apache.commons.lang3.CharSetTest.testConstructor_String_oddNegate(CharSetTest.java:241)

testStatics(org.apache.commons.lang3.CharSetTest)  Time elapsed: 0.001 sec  <<< FAILURE!
java.lang.AssertionError: null
	at org.junit.Assert.fail(Assert.java:86)
	at org.junit.Assert.assertTrue(Assert.java:41)
	at org.junit.Assert.assertTrue(Assert.java:52)
	at org.apache.commons.lang3.CharSetTest.testStatics(CharSetTest.java:453)

Running org.apache.commons.lang3.StringUtilsStartsEndsWithTest
Tests run: 6, Failures: 0, Errors: 0, Skipped: 0, Time elapsed: 0.003 sec - in org.apache.commons.lang3.StringUtilsStartsEndsWithTest
Running org.apache.commons.lang3.RandomStringUtilsTest
Tests run: 11, Failures: 0, Errors: 0, Skipped: 0, Time elapsed: 0.033 sec - in org.apache.commons.lang3.RandomStringUtilsTest
Running org.apache.commons.lang3.SerializationUtilsTest
Tests run: 26, Failures: 0, Errors: 0, Skipped: 0, Time elapsed: 0.035 sec - in org.apache.commons.lang3.SerializationUtilsTest
Running org.apache.commons.lang3.time.StopWatchTest
Tests run: 8, Failures: 0, Errors: 0, Skipped: 0, Time elapsed: 4.761 sec - in org.apache.commons.lang3.time.StopWatchTest
Running org.apache.commons.lang3.time.DateUtilsRoundingTest
Tests run: 22, Failures: 0, Errors: 0, Skipped: 0, Time elapsed: 0.147 sec - in org.apache.commons.lang3.time.DateUtilsRoundingTest
Running org.apache.commons.lang3.time.FastDateParserTest
Tests run: 33, Failures: 0, Errors: 0, Skipped: 0, Time elapsed: 2.144 sec - in org.apache.commons.lang3.time.FastDateParserTest
Running org.apache.commons.lang3.time.FastDateFormat_ParserTest
Tests run: 33, Failures: 0, Errors: 0, Skipped: 0, Time elapsed: 0.696 sec - in org.apache.commons.lang3.time.FastDateFormat_ParserTest
Running org.apache.commons.lang3.time.DurationFormatUtilsTest
Tests run: 25, Failures: 0, Errors: 0, Skipped: 0, Time elapsed: 0.483 sec - in org.apache.commons.lang3.time.DurationFormatUtilsTest
Running org.apache.commons.lang3.time.DateFormatUtilsTest
Tests run: 10, Failures: 0, Errors: 0, Skipped: 0, Time elapsed: 0.002 sec - in org.apache.commons.lang3.time.DateFormatUtilsTest
Running org.apache.commons.lang3.time.DateUtilsFragmentTest
Tests run: 57, Failures: 0, Errors: 0, Skipped: 0, Time elapsed: 0.01 sec - in org.apache.commons.lang3.time.DateUtilsFragmentTest
Running org.apache.commons.lang3.time.FastDatePrinterTimeZonesTest
Tests run: 617, Failures: 0, Errors: 0, Skipped: 0, Time elapsed: 0.215 sec - in org.apache.commons.lang3.time.FastDatePrinterTimeZonesTest
Running org.apache.commons.lang3.time.FastDateFormatTest
>>FastDateFormatTest: FastDateParser:32409  SimpleDateFormat:3251
Tests run: 14, Failures: 0, Errors: 0, Skipped: 0, Time elapsed: 3.978 sec - in org.apache.commons.lang3.time.FastDateFormatTest
Running org.apache.commons.lang3.time.FastDateFormat_PrinterTest
Tests run: 17, Failures: 0, Errors: 0, Skipped: 0, Time elapsed: 0.007 sec - in org.apache.commons.lang3.time.FastDateFormat_PrinterTest
Running org.apache.commons.lang3.time.FastDatePrinterTest
Tests run: 17, Failures: 0, Errors: 0, Skipped: 0, Time elapsed: 0.004 sec - in org.apache.commons.lang3.time.FastDatePrinterTest
Running org.apache.commons.lang3.time.FastDateParserSDFTest
Tests run: 276, Failures: 0, Errors: 0, Skipped: 92, Time elapsed: 0.059 sec - in org.apache.commons.lang3.time.FastDateParserSDFTest
Running org.apache.commons.lang3.time.DateUtilsTest
DateUtilsTest: Default Locale=en_US
Tests run: 38, Failures: 0, Errors: 0, Skipped: 0, Time elapsed: 0.018 sec - in org.apache.commons.lang3.time.DateUtilsTest
Running org.apache.commons.lang3.reflect.InheritanceUtilsTest
Tests run: 9, Failures: 0, Errors: 0, Skipped: 0, Time elapsed: 0.003 sec - in org.apache.commons.lang3.reflect.InheritanceUtilsTest
Running org.apache.commons.lang3.reflect.MethodUtilsTest
Tests run: 23, Failures: 0, Errors: 0, Skipped: 0, Time elapsed: 0.026 sec - in org.apache.commons.lang3.reflect.MethodUtilsTest
Running org.apache.commons.lang3.reflect.ConstructorUtilsTest
Tests run: 7, Failures: 0, Errors: 0, Skipped: 0, Time elapsed: 0.002 sec - in org.apache.commons.lang3.reflect.ConstructorUtilsTest
Running org.apache.commons.lang3.reflect.FieldUtilsTest
Tests run: 64, Failures: 0, Errors: 0, Skipped: 0, Time elapsed: 0.024 sec - in org.apache.commons.lang3.reflect.FieldUtilsTest
Running org.apache.commons.lang3.reflect.TypeLiteralTest
Tests run: 4, Failures: 0, Errors: 0, Skipped: 0, Time elapsed: 0.005 sec - in org.apache.commons.lang3.reflect.TypeLiteralTest
Running org.apache.commons.lang3.reflect.TypeUtilsTest
Tests run: 19, Failures: 0, Errors: 0, Skipped: 0, Time elapsed: 0.036 sec - in org.apache.commons.lang3.reflect.TypeUtilsTest
Running org.apache.commons.lang3.mutable.MutableByteTest
Tests run: 17, Failures: 0, Errors: 0, Skipped: 0, Time elapsed: 0.003 sec - in org.apache.commons.lang3.mutable.MutableByteTest
Running org.apache.commons.lang3.mutable.MutableShortTest
Tests run: 14, Failures: 0, Errors: 0, Skipped: 0, Time elapsed: 0.001 sec - in org.apache.commons.lang3.mutable.MutableShortTest
Running org.apache.commons.lang3.mutable.MutableIntTest
Tests run: 17, Failures: 0, Errors: 0, Skipped: 0, Time elapsed: 0.003 sec - in org.apache.commons.lang3.mutable.MutableIntTest
Running org.apache.commons.lang3.mutable.MutableDoubleTest
Tests run: 18, Failures: 0, Errors: 0, Skipped: 0, Time elapsed: 0.003 sec - in org.apache.commons.lang3.mutable.MutableDoubleTest
Running org.apache.commons.lang3.mutable.MutableFloatTest
Tests run: 18, Failures: 0, Errors: 0, Skipped: 0, Time elapsed: 0.003 sec - in org.apache.commons.lang3.mutable.MutableFloatTest
Running org.apache.commons.lang3.mutable.MutableLongTest
Tests run: 17, Failures: 0, Errors: 0, Skipped: 0, Time elapsed: 0.002 sec - in org.apache.commons.lang3.mutable.MutableLongTest
Running org.apache.commons.lang3.mutable.MutableBooleanTest
Tests run: 9, Failures: 0, Errors: 0, Skipped: 0, Time elapsed: 0.001 sec - in org.apache.commons.lang3.mutable.MutableBooleanTest
Running org.apache.commons.lang3.mutable.MutableObjectTest
Tests run: 5, Failures: 0, Errors: 0, Skipped: 0, Time elapsed: 0 sec - in org.apache.commons.lang3.mutable.MutableObjectTest
Running org.apache.commons.lang3.text.translate.UnicodeEscaperTest
Tests run: 3, Failures: 0, Errors: 0, Skipped: 0, Time elapsed: 0 sec - in org.apache.commons.lang3.text.translate.UnicodeEscaperTest
Running org.apache.commons.lang3.text.translate.EntityArraysTest
Tests run: 3, Failures: 0, Errors: 0, Skipped: 0, Time elapsed: 0.001 sec - in org.apache.commons.lang3.text.translate.EntityArraysTest
Running org.apache.commons.lang3.text.translate.UnicodeUnpairedSurrogateRemoverTest
Tests run: 2, Failures: 0, Errors: 0, Skipped: 0, Time elapsed: 0 sec - in org.apache.commons.lang3.text.translate.UnicodeUnpairedSurrogateRemoverTest
Running org.apache.commons.lang3.text.translate.NumericEntityUnescaperTest
Tests run: 3, Failures: 0, Errors: 0, Skipped: 0, Time elapsed: 0 sec - in org.apache.commons.lang3.text.translate.NumericEntityUnescaperTest
Running org.apache.commons.lang3.text.translate.NumericEntityEscaperTest
Tests run: 4, Failures: 0, Errors: 0, Skipped: 0, Time elapsed: 0.001 sec - in org.apache.commons.lang3.text.translate.NumericEntityEscaperTest
Running org.apache.commons.lang3.text.translate.LookupTranslatorTest
Tests run: 2, Failures: 0, Errors: 0, Skipped: 0, Time elapsed: 0 sec - in org.apache.commons.lang3.text.translate.LookupTranslatorTest
Running org.apache.commons.lang3.text.translate.UnicodeUnescaperTest
Tests run: 3, Failures: 0, Errors: 0, Skipped: 0, Time elapsed: 0 sec - in org.apache.commons.lang3.text.translate.UnicodeUnescaperTest
Running org.apache.commons.lang3.text.translate.OctalUnescaperTest
Tests run: 1, Failures: 0, Errors: 0, Skipped: 0, Time elapsed: 0 sec - in org.apache.commons.lang3.text.translate.OctalUnescaperTest
Running org.apache.commons.lang3.text.StrMatcherTest
Tests run: 14, Failures: 0, Errors: 0, Skipped: 0, Time elapsed: 0.002 sec - in org.apache.commons.lang3.text.StrMatcherTest
Running org.apache.commons.lang3.text.StrTokenizerTest
Tests run: 55, Failures: 0, Errors: 0, Skipped: 0, Time elapsed: 0.013 sec - in org.apache.commons.lang3.text.StrTokenizerTest
Running org.apache.commons.lang3.text.FormattableUtilsTest
Tests run: 5, Failures: 0, Errors: 0, Skipped: 0, Time elapsed: 0 sec - in org.apache.commons.lang3.text.FormattableUtilsTest
Running org.apache.commons.lang3.text.CompositeFormatTest
Tests run: 2, Failures: 0, Errors: 0, Skipped: 0, Time elapsed: 0.001 sec - in org.apache.commons.lang3.text.CompositeFormatTest
Running org.apache.commons.lang3.text.WordUtilsTest
Tests run: 12, Failures: 0, Errors: 0, Skipped: 0, Time elapsed: 0.003 sec - in org.apache.commons.lang3.text.WordUtilsTest
Running org.apache.commons.lang3.text.StrLookupTest
Tests run: 5, Failures: 0, Errors: 0, Skipped: 0, Time elapsed: 0.002 sec - in org.apache.commons.lang3.text.StrLookupTest
Running org.apache.commons.lang3.text.StrBuilderAppendInsertTest
Tests run: 51, Failures: 0, Errors: 0, Skipped: 0, Time elapsed: 0.01 sec - in org.apache.commons.lang3.text.StrBuilderAppendInsertTest
Running org.apache.commons.lang3.text.ExtendedMessageFormatTest
Tests run: 10, Failures: 0, Errors: 0, Skipped: 0, Time elapsed: 0.745 sec - in org.apache.commons.lang3.text.ExtendedMessageFormatTest
Running org.apache.commons.lang3.text.StrSubstitutorTest
Tests run: 40, Failures: 0, Errors: 0, Skipped: 0, Time elapsed: 0.022 sec - in org.apache.commons.lang3.text.StrSubstitutorTest
Running org.apache.commons.lang3.text.StrBuilderTest
Tests run: 90, Failures: 0, Errors: 0, Skipped: 0, Time elapsed: 0.033 sec - in org.apache.commons.lang3.text.StrBuilderTest
Running org.apache.commons.lang3.StringEscapeUtilsTest
Tests run: 28, Failures: 0, Errors: 0, Skipped: 0, Time elapsed: 0.522 sec - in org.apache.commons.lang3.StringEscapeUtilsTest
Running org.apache.commons.lang3.AnnotationUtilsTest
Tests run: 10, Failures: 0, Errors: 0, Skipped: 0, Time elapsed: 0.023 sec - in org.apache.commons.lang3.AnnotationUtilsTest
Running org.apache.commons.lang3.ConversionTest
Tests run: 42, Failures: 0, Errors: 0, Skipped: 0, Time elapsed: 0.014 sec - in org.apache.commons.lang3.ConversionTest
Running org.apache.commons.lang3.StringUtilsTrimEmptyTest
Tests run: 15, Failures: 0, Errors: 0, Skipped: 0, Time elapsed: 0.006 sec - in org.apache.commons.lang3.StringUtilsTrimEmptyTest
Running org.apache.commons.lang3.EnumUtilsTest
Tests run: 34, Failures: 0, Errors: 0, Skipped: 0, Time elapsed: 0.009 sec - in org.apache.commons.lang3.EnumUtilsTest
Running org.apache.commons.lang3.exception.ExceptionUtilsTest
Tests run: 28, Failures: 0, Errors: 0, Skipped: 0, Time elapsed: 0.024 sec - in org.apache.commons.lang3.exception.ExceptionUtilsTest
Running org.apache.commons.lang3.exception.DefaultExceptionContextTest
Tests run: 8, Failures: 0, Errors: 0, Skipped: 0, Time elapsed: 0.004 sec - in org.apache.commons.lang3.exception.DefaultExceptionContextTest
Running org.apache.commons.lang3.exception.ContextedExceptionTest
Tests run: 14, Failures: 0, Errors: 0, Skipped: 0, Time elapsed: 0.01 sec - in org.apache.commons.lang3.exception.ContextedExceptionTest
Running org.apache.commons.lang3.exception.ContextedRuntimeExceptionTest
Tests run: 14, Failures: 0, Errors: 0, Skipped: 0, Time elapsed: 0.011 sec - in org.apache.commons.lang3.exception.ContextedRuntimeExceptionTest
Running org.apache.commons.lang3.BitFieldTest
Tests run: 15, Failures: 0, Errors: 0, Skipped: 0, Time elapsed: 0.003 sec - in org.apache.commons.lang3.BitFieldTest
Running org.apache.commons.lang3.ArrayUtilsRemoveMultipleTest
Tests run: 55, Failures: 1, Errors: 0, Skipped: 0, Time elapsed: 0.013 sec <<< FAILURE! - in org.apache.commons.lang3.ArrayUtilsRemoveMultipleTest
testRemoveElementsObjectArray(org.apache.commons.lang3.ArrayUtilsRemoveMultipleTest)  Time elapsed: 0.001 sec  <<< FAILURE!
java.lang.AssertionError: null
	at org.junit.Assert.fail(Assert.java:86)
	at org.junit.Assert.assertTrue(Assert.java:41)
	at org.junit.Assert.assertTrue(Assert.java:52)
	at org.apache.commons.lang3.ArrayUtilsRemoveMultipleTest.testRemoveElementsObjectArray(ArrayUtilsRemoveMultipleTest.java:672)

Running org.apache.commons.lang3.HashSetvBitSetTest
Ratio=10% array=100 count=1 extract=12186146 bitset=1248153
Ratio=7% array=100 count=10 extract=16372718 bitset=1182707
Ratio=4% array=100 count=50 extract=22694002 bitset=1067006
Ratio=4% array=100 count=100 extract=10375820 bitset=463766
Ratio=80% array=1000 count=10 extract=5791207 bitset=4643172
Ratio=49% array=1000 count=100 extract=18716569 bitset=9246627
Ratio=7% array=1000 count=500 extract=42194985 bitset=3299283
Ratio=1% array=1000 count=1000 extract=68994897 bitset=725961
Ratio=97% count=0 hash=2589574 bits=2534857
Ratio=5% count=5 hash=3855389 bits=216569
Ratio=12% count=10 hash=2324933 bits=286472
Ratio=23% count=200 hash=17974254 bits=4170492
Ratio=17% count=50 hash=5767803 bits=1037907
Ratio=26% count=100 hash=8571291 bits=2297890
Ratio=22% count=1000 hash=72029811 bits=15940244
Ratio=20% count=2000 hash=155976193 bits=31710501
Tests run: 2, Failures: 0, Errors: 0, Skipped: 0, Time elapsed: 0.64 sec - in org.apache.commons.lang3.HashSetvBitSetTest
Running org.apache.commons.lang3.StringUtilsTest
Tests run: 124, Failures: 0, Errors: 0, Skipped: 0, Time elapsed: 0.157 sec - in org.apache.commons.lang3.StringUtilsTest
Running org.apache.commons.lang3.ArrayUtilsRemoveTest
Tests run: 19, Failures: 0, Errors: 1, Skipped: 0, Time elapsed: 0.002 sec <<< FAILURE! - in org.apache.commons.lang3.ArrayUtilsRemoveTest
testRemoveElementObjectArray(org.apache.commons.lang3.ArrayUtilsRemoveTest)  Time elapsed: 0 sec  <<< ERROR!
java.lang.ArrayIndexOutOfBoundsException: 0
	at org.apache.commons.lang3.ArrayUtils.indexOf(ArrayUtils.java:319)
	at org.apache.commons.lang3.ArrayUtils.indexOf(ArrayUtils.java:311)
	at org.apache.commons.lang3.ArrayUtils.removeElement(ArrayUtils.java:795)
	at org.apache.commons.lang3.ArrayUtilsRemoveTest.testRemoveElementObjectArray(ArrayUtilsRemoveTest.java:318)

Running org.apache.commons.lang3.ObjectUtilsTest
Tests run: 36, Failures: 0, Errors: 0, Skipped: 0, Time elapsed: 0.011 sec - in org.apache.commons.lang3.ObjectUtilsTest
Running org.apache.commons.lang3.ClassPathUtilsTest
Tests run: 13, Failures: 0, Errors: 0, Skipped: 0, Time elapsed: 0.003 sec - in org.apache.commons.lang3.ClassPathUtilsTest
Running org.apache.commons.lang3.math.NumberUtilsTest
Tests run: 91, Failures: 0, Errors: 0, Skipped: 0, Time elapsed: 0.024 sec - in org.apache.commons.lang3.math.NumberUtilsTest
Running org.apache.commons.lang3.math.IEEE754rUtilsTest
Tests run: 3, Failures: 0, Errors: 0, Skipped: 0, Time elapsed: 0.001 sec - in org.apache.commons.lang3.math.IEEE754rUtilsTest
Running org.apache.commons.lang3.math.FractionTest
Tests run: 25, Failures: 0, Errors: 0, Skipped: 0, Time elapsed: 0.279 sec - in org.apache.commons.lang3.math.FractionTest
Running org.apache.commons.lang3.BooleanUtilsTest
Tests run: 72, Failures: 0, Errors: 0, Skipped: 0, Time elapsed: 0.014 sec - in org.apache.commons.lang3.BooleanUtilsTest
Running org.apache.commons.lang3.CharSequenceUtilsTest
Tests run: 2, Failures: 0, Errors: 0, Skipped: 0, Time elapsed: 0.001 sec - in org.apache.commons.lang3.CharSequenceUtilsTest
Running org.apache.commons.lang3.CharSetUtilsTest
Tests run: 11, Failures: 0, Errors: 0, Skipped: 0, Time elapsed: 0.002 sec - in org.apache.commons.lang3.CharSetUtilsTest
Running org.apache.commons.lang3.ArrayUtilsAddTest
Tests run: 13, Failures: 0, Errors: 0, Skipped: 0, Time elapsed: 0.003 sec - in org.apache.commons.lang3.ArrayUtilsAddTest
Running org.apache.commons.lang3.CharEncodingTest
Tests run: 6, Failures: 0, Errors: 0, Skipped: 0, Time elapsed: 0.035 sec - in org.apache.commons.lang3.CharEncodingTest
Running org.apache.commons.lang3.ClassUtilsTest
Tests run: 57, Failures: 0, Errors: 0, Skipped: 0, Time elapsed: 0.037 sec - in org.apache.commons.lang3.ClassUtilsTest
Running org.apache.commons.lang3.RangeTest
Tests run: 24, Failures: 0, Errors: 0, Skipped: 0, Time elapsed: 0.005 sec - in org.apache.commons.lang3.RangeTest
Running org.apache.commons.lang3.event.EventUtilsTest
Tests run: 8, Failures: 0, Errors: 0, Skipped: 0, Time elapsed: 0.016 sec - in org.apache.commons.lang3.event.EventUtilsTest
Running org.apache.commons.lang3.event.EventListenerSupportTest
Tests run: 9, Failures: 0, Errors: 0, Skipped: 0, Time elapsed: 0.009 sec - in org.apache.commons.lang3.event.EventListenerSupportTest
Running org.apache.commons.lang3.ArrayUtilsTest
Tests run: 205, Failures: 1, Errors: 2, Skipped: 0, Time elapsed: 0.069 sec <<< FAILURE! - in org.apache.commons.lang3.ArrayUtilsTest
testContains(org.apache.commons.lang3.ArrayUtilsTest)  Time elapsed: 0 sec  <<< FAILURE!
java.lang.AssertionError: null
	at org.junit.Assert.fail(Assert.java:86)
	at org.junit.Assert.assertTrue(Assert.java:41)
	at org.junit.Assert.assertTrue(Assert.java:52)
	at org.apache.commons.lang3.ArrayUtilsTest.testContains(ArrayUtilsTest.java:2160)

testIndexOf(org.apache.commons.lang3.ArrayUtilsTest)  Time elapsed: 0.001 sec  <<< ERROR!
java.lang.ArrayIndexOutOfBoundsException: 0
	at org.apache.commons.lang3.ArrayUtils.indexOf(ArrayUtils.java:319)
	at org.apache.commons.lang3.ArrayUtils.indexOf(ArrayUtils.java:311)
	at org.apache.commons.lang3.ArrayUtilsTest.testIndexOf(ArrayUtilsTest.java:2097)

testIndexOfWithStartIndex(org.apache.commons.lang3.ArrayUtilsTest)  Time elapsed: 0 sec  <<< ERROR!
java.lang.ArrayIndexOutOfBoundsException: 0
	at org.apache.commons.lang3.ArrayUtils.indexOf(ArrayUtils.java:319)
	at org.apache.commons.lang3.ArrayUtilsTest.testIndexOfWithStartIndex(ArrayUtilsTest.java:2110)

Running org.apache.commons.lang3.CharUtilsTest
Tests run: 24, Failures: 0, Errors: 0, Skipped: 0, Time elapsed: 0.011 sec - in org.apache.commons.lang3.CharUtilsTest
Running org.apache.commons.lang3.NotImplementedExceptionTest
Tests run: 1, Failures: 0, Errors: 0, Skipped: 0, Time elapsed: 0.004 sec - in org.apache.commons.lang3.NotImplementedExceptionTest
Running org.apache.commons.lang3.StringUtilsEqualsIndexOfTest
Tests run: 50, Failures: 0, Errors: 0, Skipped: 0, Time elapsed: 0.019 sec - in org.apache.commons.lang3.StringUtilsEqualsIndexOfTest
Running org.apache.commons.lang3.RandomUtilsTest
Tests run: 23, Failures: 0, Errors: 0, Skipped: 0, Time elapsed: 0.01 sec - in org.apache.commons.lang3.RandomUtilsTest

Results :

Failed tests: 
  ArrayUtilsRemoveMultipleTest.testRemoveElementsObjectArray:672 null
  ArrayUtilsTest.testContains:2160 null
  CharSetTest.testConstructor_String_combo:114 null
  CharSetTest.testConstructor_String_comboNegated:153 null
  CharSetTest.testConstructor_String_oddCombinations:301 null
  CharSetTest.testConstructor_String_oddDash:194 null
  CharSetTest.testConstructor_String_oddNegate:241 null
  CharSetTest.testStatics:453 null

Tests in error: 
  ArrayUtilsRemoveTest.testRemoveElementObjectArray:318 » ArrayIndexOutOfBounds ...
  ArrayUtilsTest.testIndexOf:2097 » ArrayIndexOutOfBounds 0
  ArrayUtilsTest.testIndexOfWithStartIndex:2110 » ArrayIndexOutOfBounds 0
  CompareToBuilderTest.testReflectionCompare:106 » ArrayIndexOutOfBounds 0
  CompareToBuilderTest.testReflectionHierarchyCompare:127->testReflectionHierarchyCompare:192->assertReflectionCompareContract:218->reflectionCompareSignum:246 » ArrayIndexOutOfBounds
  CompareToBuilderTest.testReflectionHierarchyCompareExcludeFields:133->testReflectionHierarchyCompare:192->assertReflectionCompareContract:218->reflectionCompareSignum:246 » ArrayIndexOutOfBounds
  CompareToBuilderTest.testReflectionHierarchyCompareTransients:152->testReflectionHierarchyCompare:192->assertReflectionCompareContract:218->reflectionCompareSignum:246 » ArrayIndexOutOfBounds
  DiffBuilderTest.testBoolean:102 » ArrayIndexOutOfBounds 0
  DiffBuilderTest.testBooleanArray:115 » ArrayIndexOutOfBounds 0
  DiffBuilderTest.testByte:130 » ArrayIndexOutOfBounds 0
  DiffBuilderTest.testByteArray:142 » ArrayIndexOutOfBounds 0
  DiffBuilderTest.testChar:156 » ArrayIndexOutOfBounds 0
  DiffBuilderTest.testCharArray:169 » ArrayIndexOutOfBounds 0
  DiffBuilderTest.testDouble:184 » ArrayIndexOutOfBounds 0
  DiffBuilderTest.testDoubleArray:197 » ArrayIndexOutOfBounds 0
  DiffBuilderTest.testFloat:211 » ArrayIndexOutOfBounds 0
  DiffBuilderTest.testFloatArray:224 » ArrayIndexOutOfBounds 0
  DiffBuilderTest.testInt:239 » ArrayIndexOutOfBounds 0
  DiffBuilderTest.testIntArray:252 » ArrayIndexOutOfBounds 0
  DiffBuilderTest.testLong:266 » ArrayIndexOutOfBounds 0
  DiffBuilderTest.testLongArray:279 » ArrayIndexOutOfBounds 0
  DiffBuilderTest.testObject:320 » ArrayIndexOutOfBounds 0
  DiffBuilderTest.testObjectArray:381 » ArrayIndexOutOfBounds 0
  DiffBuilderTest.testObjectArrayEqual:394 » ArrayIndexOutOfBounds 0
  DiffBuilderTest.testObjectsNotSameButEqual:356 » ArrayIndexOutOfBounds 0
  DiffBuilderTest.testObjectsNotSameNorEqual:372 » ArrayIndexOutOfBounds 0
  DiffBuilderTest.testObjectsSameAndEqual:340 » ArrayIndexOutOfBounds 0
  DiffBuilderTest.testShort:293 » ArrayIndexOutOfBounds 0
  DiffBuilderTest.testShortArray:306 » ArrayIndexOutOfBounds 0
  DiffBuilderTest.testSimilarObjectIgnoresAppends:441 » ArrayIndexOutOfBounds 0
  EqualsBuilderTest.testCyclicalObjectReferences:1102 » ArrayIndexOutOfBounds 0
  EqualsBuilderTest.testReflectionEquals:156 » ArrayIndexOutOfBounds 0
  EqualsBuilderTest.testReflectionEqualsExcludeFields:1047 » ArrayIndexOutOfBounds
  EqualsBuilderTest.testReflectionHierarchyEquals:169->testReflectionHierarchyEquals:193->testReflectionEqualsEquivalenceRelationship:264 » ArrayIndexOutOfBounds
  HashCodeBuilderAndEqualsBuilderTest.testFixture:52->testFixture:61->assertEqualsAndHashCodeContract:85 » ArrayIndexOutOfBounds
  HashCodeBuilderAndEqualsBuilderTest.testFixtureWithTransients:57->testFixture:61->assertEqualsAndHashCodeContract:85 » ArrayIndexOutOfBounds
  HashCodeBuilderAndEqualsBuilderTest.testInteger:42->testInteger:37->assertEqualsAndHashCodeContract:85 » ArrayIndexOutOfBounds
  HashCodeBuilderAndEqualsBuilderTest.testIntegerWithTransients:47->testInteger:37->assertEqualsAndHashCodeContract:85 » ArrayIndexOutOfBounds
  HashCodeBuilderTest.testReflectionHashCode:147 » ArrayIndexOutOfBounds 0
  HashCodeBuilderTest.testReflectionHashCodeExcludeFields:493 » ArrayIndexOutOfBounds
  HashCodeBuilderTest.testReflectionHierarchyHashCode:153 » ArrayIndexOutOfBounds
  HashCodeBuilderTest.testReflectionObjectCycle:552 » ArrayIndexOutOfBounds 0


Tests run: 3526, Failures: 8, Errors: 42, Skipped: 97

[INFO] ------------------------------------------------------------------------
[INFO] BUILD FAILURE
[INFO] ------------------------------------------------------------------------
[INFO] Total time: 34.417s
[INFO] Finished at: Sun Aug 02 23:29:30 BST 2015
[INFO] Final Memory: 23M/409M
[INFO] ------------------------------------------------------------------------
[ERROR] Failed to execute goal org.apache.maven.plugins:maven-surefire-plugin:2.18:test (default-test) on project commons-lang3: There are test failures.
[ERROR] 
[ERROR] Please refer to /home/perham/Study/LittleDarwin/Cases/commons-lang3-3.4-src/target/surefire-reports for the individual test results.
[ERROR] -> [Help 1]
[ERROR] 
[ERROR] To see the full stack trace of the errors, re-run Maven with the -e switch.
[ERROR] Re-run Maven using the -X switch to enable full debug logging.
[ERROR] 
[ERROR] For more information about the errors and possible solutions, please read the following articles:
[ERROR] [Help 1] http://cwiki.apache.org/confluence/display/MAVEN/MojoFailureException
