[INFO] Scanning for projects...
[INFO]                                                                         
[INFO] ------------------------------------------------------------------------
[INFO] Building Apache Commons Codec 1.10
[INFO] ------------------------------------------------------------------------
[INFO] 
[INFO] --- maven-enforcer-plugin:1.3.1:enforce (enforce-maven-3) @ commons-codec ---
[INFO] 
[INFO] --- maven-antrun-plugin:1.7:run (javadoc.resources) @ commons-codec ---
[INFO] Executing tasks

main:
[INFO] Executed tasks
[INFO] 
[INFO] --- maven-remote-resources-plugin:1.5:process (default) @ commons-codec ---
[INFO] 
[INFO] --- buildnumber-maven-plugin:1.3:create (default) @ commons-codec ---
[INFO] Executing: /bin/sh -c cd /home/perham/Study/LittleDarwin/Cases/commons-codec-1.10-src && svn --non-interactive info
[INFO] Working directory: /home/perham/Study/LittleDarwin/Cases/commons-codec-1.10-src
[INFO] Storing buildNumber: ?????? at timestamp: 1438519633245
[INFO] Executing: /bin/sh -c cd /home/perham/Study/LittleDarwin/Cases/commons-codec-1.10-src && svn --non-interactive info
[INFO] Working directory: /home/perham/Study/LittleDarwin/Cases/commons-codec-1.10-src
[INFO] Storing buildScmBranch: UNKNOWN_BRANCH
[INFO] 
[INFO] --- maven-resources-plugin:2.7:resources (default-resources) @ commons-codec ---
[INFO] Using 'UTF-8' encoding to copy filtered resources.
[INFO] Copying 128 resources
[INFO] Copying 2 resources to META-INF
[INFO] 
[INFO] --- maven-compiler-plugin:3.2:compile (default-compile) @ commons-codec ---
[INFO] Changes detected - recompiling the module!
[INFO] Compiling 60 source files to /home/perham/Study/LittleDarwin/Cases/commons-codec-1.10-src/target/classes
[INFO] /home/perham/Study/LittleDarwin/Cases/commons-codec-1.10-src/src/main/java/org/apache/commons/codec/digest/Sha2Crypt.java: Some input files use or override a deprecated API.
[INFO] /home/perham/Study/LittleDarwin/Cases/commons-codec-1.10-src/src/main/java/org/apache/commons/codec/digest/Sha2Crypt.java: Recompile with -Xlint:deprecation for details.
[INFO] 
[INFO] --- maven-bundle-plugin:2.5.3:manifest (bundle-manifest) @ commons-codec ---
[INFO] 
[INFO] --- maven-resources-plugin:2.7:testResources (default-testResources) @ commons-codec ---
[INFO] Using 'UTF-8' encoding to copy filtered resources.
[INFO] skip non existing resourceDirectory /home/perham/Study/LittleDarwin/Cases/commons-codec-1.10-src/src/test/resources
[INFO] Copying 2 resources to META-INF
[INFO] 
[INFO] --- maven-compiler-plugin:3.2:testCompile (default-testCompile) @ commons-codec ---
[INFO] Nothing to compile - all classes are up to date
[INFO] 
[INFO] --- maven-surefire-plugin:2.17:test (default-test) @ commons-codec ---
[INFO] Surefire report directory: /home/perham/Study/LittleDarwin/Cases/commons-codec-1.10-src/target/surefire-reports

-------------------------------------------------------
 T E S T S
-------------------------------------------------------
Running org.apache.commons.codec.digest.B64Test
Tests run: 2, Failures: 0, Errors: 0, Skipped: 0, Time elapsed: 0.026 sec - in org.apache.commons.codec.digest.B64Test
Running org.apache.commons.codec.digest.DigestUtilsTest
Tests run: 17, Failures: 0, Errors: 0, Skipped: 0, Time elapsed: 0.669 sec - in org.apache.commons.codec.digest.DigestUtilsTest
Running org.apache.commons.codec.digest.Sha512CryptTest
Tests run: 8, Failures: 0, Errors: 0, Skipped: 0, Time elapsed: 0.493 sec - in org.apache.commons.codec.digest.Sha512CryptTest
Running org.apache.commons.codec.digest.Apr1CryptTest
Tests run: 8, Failures: 0, Errors: 0, Skipped: 0, Time elapsed: 0.076 sec - in org.apache.commons.codec.digest.Apr1CryptTest
Running org.apache.commons.codec.digest.HmacUtilsTest
Tests run: 24, Failures: 0, Errors: 0, Skipped: 0, Time elapsed: 0.041 sec - in org.apache.commons.codec.digest.HmacUtilsTest
Running org.apache.commons.codec.digest.Sha2CryptTest
Tests run: 1, Failures: 0, Errors: 0, Skipped: 0, Time elapsed: 0 sec - in org.apache.commons.codec.digest.Sha2CryptTest
Running org.apache.commons.codec.digest.CryptTest
Tests run: 4, Failures: 0, Errors: 0, Skipped: 0, Time elapsed: 0.074 sec - in org.apache.commons.codec.digest.CryptTest
Running org.apache.commons.codec.digest.Sha256CryptTest
Tests run: 7, Failures: 0, Errors: 0, Skipped: 0, Time elapsed: 0.105 sec - in org.apache.commons.codec.digest.Sha256CryptTest
Running org.apache.commons.codec.digest.Md5CryptTest
Tests run: 7, Failures: 0, Errors: 0, Skipped: 0, Time elapsed: 0.016 sec - in org.apache.commons.codec.digest.Md5CryptTest
Running org.apache.commons.codec.digest.UnixCryptTest
Tests run: 9, Failures: 0, Errors: 0, Skipped: 0, Time elapsed: 0.01 sec - in org.apache.commons.codec.digest.UnixCryptTest
Running org.apache.commons.codec.CharsetsTest
Tests run: 7, Failures: 0, Errors: 0, Skipped: 0, Time elapsed: 0.001 sec - in org.apache.commons.codec.CharsetsTest
Running org.apache.commons.codec.binary.Base32Test
Tests run: 8, Failures: 0, Errors: 0, Skipped: 0, Time elapsed: 0.006 sec - in org.apache.commons.codec.binary.Base32Test
Running org.apache.commons.codec.binary.Base64OutputStreamTest
Tests run: 7, Failures: 0, Errors: 0, Skipped: 0, Time elapsed: 0.205 sec - in org.apache.commons.codec.binary.Base64OutputStreamTest
Running org.apache.commons.codec.binary.Base64Codec13Test
Tests run: 8, Failures: 0, Errors: 0, Skipped: 0, Time elapsed: 0.01 sec - in org.apache.commons.codec.binary.Base64Codec13Test
Running org.apache.commons.codec.binary.Base64InputStreamTest
Tests run: 19, Failures: 0, Errors: 0, Skipped: 0, Time elapsed: 0.106 sec - in org.apache.commons.codec.binary.Base64InputStreamTest
Running org.apache.commons.codec.binary.Base32InputStreamTest
Tests run: 16, Failures: 0, Errors: 0, Skipped: 0, Time elapsed: 0.125 sec - in org.apache.commons.codec.binary.Base32InputStreamTest
Running org.apache.commons.codec.binary.Base32OutputStreamTest
Tests run: 6, Failures: 0, Errors: 0, Skipped: 0, Time elapsed: 0.092 sec - in org.apache.commons.codec.binary.Base32OutputStreamTest
Running org.apache.commons.codec.binary.BinaryCodecTest
Tests run: 13, Failures: 0, Errors: 0, Skipped: 0, Time elapsed: 0.011 sec - in org.apache.commons.codec.binary.BinaryCodecTest
Running org.apache.commons.codec.binary.BaseNCodecTest
Tests run: 7, Failures: 0, Errors: 0, Skipped: 0, Time elapsed: 0.001 sec - in org.apache.commons.codec.binary.BaseNCodecTest
Running org.apache.commons.codec.binary.StringUtilsTest
Tests run: 17, Failures: 0, Errors: 0, Skipped: 0, Time elapsed: 0.023 sec - in org.apache.commons.codec.binary.StringUtilsTest
Running org.apache.commons.codec.binary.Base64Test
Tests run: 53, Failures: 0, Errors: 0, Skipped: 1, Time elapsed: 0.042 sec - in org.apache.commons.codec.binary.Base64Test
Running org.apache.commons.codec.binary.HexTest
Tests run: 19, Failures: 0, Errors: 0, Skipped: 0, Time elapsed: 0.172 sec - in org.apache.commons.codec.binary.HexTest
Running org.apache.commons.codec.DecoderExceptionTest
Tests run: 4, Failures: 0, Errors: 0, Skipped: 0, Time elapsed: 0 sec - in org.apache.commons.codec.DecoderExceptionTest
Running org.apache.commons.codec.EncoderExceptionTest
Tests run: 4, Failures: 0, Errors: 0, Skipped: 0, Time elapsed: 0 sec - in org.apache.commons.codec.EncoderExceptionTest
Running org.apache.commons.codec.net.BCodecTest
Tests run: 9, Failures: 0, Errors: 0, Skipped: 0, Time elapsed: 0.005 sec - in org.apache.commons.codec.net.BCodecTest
Running org.apache.commons.codec.net.QCodecTest
Tests run: 12, Failures: 0, Errors: 0, Skipped: 0, Time elapsed: 0.006 sec - in org.apache.commons.codec.net.QCodecTest
Running org.apache.commons.codec.net.UtilsTest
Tests run: 1, Failures: 0, Errors: 0, Skipped: 0, Time elapsed: 0 sec - in org.apache.commons.codec.net.UtilsTest
Running org.apache.commons.codec.net.RFC1522CodecTest
Tests run: 2, Failures: 0, Errors: 0, Skipped: 0, Time elapsed: 0 sec - in org.apache.commons.codec.net.RFC1522CodecTest
Running org.apache.commons.codec.net.URLCodecTest
Tests run: 16, Failures: 0, Errors: 0, Skipped: 0, Time elapsed: 0.005 sec - in org.apache.commons.codec.net.URLCodecTest
Running org.apache.commons.codec.net.QuotedPrintableCodecTest
Tests run: 21, Failures: 7, Errors: 0, Skipped: 0, Time elapsed: 0.021 sec <<< FAILURE! - in org.apache.commons.codec.net.QuotedPrintableCodecTest
testUTF8RoundTrip(org.apache.commons.codec.net.QuotedPrintableCodecTest)  Time elapsed: 0.005 sec  <<< FAILURE!
org.junit.ComparisonFailure: expected:<...92=D1=81=D0=B5=D0=BC[_]=D0=BF=D1=80=D0=B8=D...> but was:<...92=D1=81=D0=B5=D0=BC[=5F]=D0=BF=D1=80=D0=B8=D...>
	at org.junit.Assert.assertEquals(Assert.java:115)
	at org.junit.Assert.assertEquals(Assert.java:144)
	at org.apache.commons.codec.net.QuotedPrintableCodecTest.testUTF8RoundTrip(QuotedPrintableCodecTest.java:64)

testBasicEncodeDecode(org.apache.commons.codec.net.QuotedPrintableCodecTest)  Time elapsed: 0.001 sec  <<< FAILURE!
org.junit.ComparisonFailure: Basic quoted-printable encoding test expected:<=3D [Hello there] =3D=0D=0A> but was:<=3D [=48=65=6C=6C=6F =74=68=65=72=65] =3D=0D=0A>
	at org.junit.Assert.assertEquals(Assert.java:115)
	at org.apache.commons.codec.net.QuotedPrintableCodecTest.testBasicEncodeDecode(QuotedPrintableCodecTest.java:79)

testSafeCharEncodeDecode(org.apache.commons.codec.net.QuotedPrintableCodecTest)  Time elapsed: 0.001 sec  <<< FAILURE!
org.junit.ComparisonFailure: Safe chars quoted-printable encoding test expected:<[abc123_-.*~!@#$%^&()+{}"\;:`,/[]]> but was:<[=61=62=63123=5F-.*=7E!=40#$%=5E&()+=7B=7D"=5C;:=60,/=5B=5D]>
	at org.junit.Assert.assertEquals(Assert.java:115)
	at org.apache.commons.codec.net.QuotedPrintableCodecTest.testSafeCharEncodeDecode(QuotedPrintableCodecTest.java:90)

testSoftLineBreakEncode(org.apache.commons.codec.net.QuotedPrintableCodecTest)  Time elapsed: 0.001 sec  <<< FAILURE!
org.junit.ComparisonFailure: expected:<[If you believe that truth=3Dbeauty, then surely mathematics is the most b=
eautiful branch of philosophy].> but was:<[=49=66 =79=6F=75 =62=65=6C=69=65=76=65 =74=68=61=74 =74=72=75=74=68=3D=62=65=
=61=75=74=79, =74=68=65=6E =73=75=72=65=6C=79 =6D=61=74=68=65=6D=61=74=69=63=
=73 =69=73 =74=68=65 =6D=6F=73=74 =62=65=61=75=74=69=66=75=6C =62=72=61=6E=63=
=68 =6F=66 =70=68=69=6C=6F=73=6F=70=68=79].>
	at org.junit.Assert.assertEquals(Assert.java:115)
	at org.junit.Assert.assertEquals(Assert.java:144)
	at org.apache.commons.codec.net.QuotedPrintableCodecTest.testSoftLineBreakEncode(QuotedPrintableCodecTest.java:271)

testUltimateSoftBreak(org.apache.commons.codec.net.QuotedPrintableCodecTest)  Time elapsed: 0.001 sec  <<< FAILURE!
org.junit.ComparisonFailure: expected:<[This is a example of a quoted-printable text file. There is no end to i=
t]=09> but was:<[=54=68=69=73 =69=73 =61 =65=78=61=6D=70=6C=65 =6F=66 =61 =71=75=6F=74=65=64=
-=70=72=69=6E=74=61=62=6C=65 =74=65=78=74 =66=69=6C=65. =54=68=65=72=65 =69=
=73 =6E=6F =65=6E=64 =74=6F =69=74]=09>
	at org.junit.Assert.assertEquals(Assert.java:115)
	at org.junit.Assert.assertEquals(Assert.java:144)
	at org.apache.commons.codec.net.QuotedPrintableCodecTest.testUltimateSoftBreak(QuotedPrintableCodecTest.java:309)

testTrailingSpecial(org.apache.commons.codec.net.QuotedPrintableCodecTest)  Time elapsed: 0 sec  <<< FAILURE!
org.junit.ComparisonFailure: expected:<[This is a example of a quoted-printable text file. This might contain sp=3D=
cial chars].> but was:<[=54=68=69=73 =69=73 =61 =65=78=61=6D=70=6C=65 =6F=66 =61 =71=75=6F=74=65=64=
-=70=72=69=6E=74=61=62=6C=65 =74=65=78=74 =66=69=6C=65. =54=68=69=73 =6D=69=
=67=68=74 =63=6F=6E=74=61=69=6E =73=70=3D=63=69=61=6C =63=68=61=72=73].>
	at org.junit.Assert.assertEquals(Assert.java:115)
	at org.junit.Assert.assertEquals(Assert.java:144)
	at org.apache.commons.codec.net.QuotedPrintableCodecTest.testTrailingSpecial(QuotedPrintableCodecTest.java:295)

testFinalBytes(org.apache.commons.codec.net.QuotedPrintableCodecTest)  Time elapsed: 0 sec  <<< FAILURE!
org.junit.ComparisonFailure: expected:<[This is a example of a quoted=3Dprintable text file. There is no tt]> but was:<[=54=68=69=73 =69=73 =61 =65=78=61=6D=70=6C=65 =6F=66 =61 =71=75=6F=74=65=64=
=3D=70=72=69=6E=74=61=62=6C=65 =74=65=78=74 =66=69=6C=65. =54=68=65=72=65=20=
=69=73 =6E=6F =74=74]>
	at org.junit.Assert.assertEquals(Assert.java:115)
	at org.junit.Assert.assertEquals(Assert.java:144)
	at org.apache.commons.codec.net.QuotedPrintableCodecTest.testFinalBytes(QuotedPrintableCodecTest.java:335)

Running org.apache.commons.codec.StringEncoderComparatorTest
Tests run: 3, Failures: 0, Errors: 0, Skipped: 0, Time elapsed: 0.001 sec - in org.apache.commons.codec.StringEncoderComparatorTest
Running org.apache.commons.codec.language.Caverphone1Test
Tests run: 9, Failures: 0, Errors: 0, Skipped: 0, Time elapsed: 0.031 sec - in org.apache.commons.codec.language.Caverphone1Test
Running org.apache.commons.codec.language.NysiisTest
Tests run: 23, Failures: 0, Errors: 0, Skipped: 0, Time elapsed: 0.03 sec - in org.apache.commons.codec.language.NysiisTest
Running org.apache.commons.codec.language.Caverphone2Test
Tests run: 13, Failures: 0, Errors: 0, Skipped: 0, Time elapsed: 0.134 sec - in org.apache.commons.codec.language.Caverphone2Test
Running org.apache.commons.codec.language.DaitchMokotoffSoundexTest
Tests run: 13, Failures: 0, Errors: 0, Skipped: 0, Time elapsed: 0.051 sec - in org.apache.commons.codec.language.DaitchMokotoffSoundexTest
Running org.apache.commons.codec.language.bm.BeiderMorseEncoderTest
Tests run: 22, Failures: 0, Errors: 0, Skipped: 0, Time elapsed: 3.044 sec - in org.apache.commons.codec.language.bm.BeiderMorseEncoderTest
Running org.apache.commons.codec.language.bm.PhoneticEngineTest
Tests run: 8, Failures: 0, Errors: 0, Skipped: 0, Time elapsed: 0.013 sec - in org.apache.commons.codec.language.bm.PhoneticEngineTest
Running org.apache.commons.codec.language.bm.PhoneticEngineRegressionTest
Tests run: 4, Failures: 0, Errors: 0, Skipped: 0, Time elapsed: 0.017 sec - in org.apache.commons.codec.language.bm.PhoneticEngineRegressionTest
Running org.apache.commons.codec.language.bm.RuleTest
Tests run: 3, Failures: 0, Errors: 0, Skipped: 0, Time elapsed: 0.002 sec - in org.apache.commons.codec.language.bm.RuleTest
Running org.apache.commons.codec.language.bm.LanguageGuessingTest
Tests run: 18, Failures: 0, Errors: 0, Skipped: 0, Time elapsed: 0.015 sec - in org.apache.commons.codec.language.bm.LanguageGuessingTest
Running org.apache.commons.codec.language.DoubleMetaphoneTest
Tests run: 16, Failures: 0, Errors: 0, Skipped: 0, Time elapsed: 0.055 sec - in org.apache.commons.codec.language.DoubleMetaphoneTest
Running org.apache.commons.codec.language.SoundexTest
Tests run: 28, Failures: 0, Errors: 0, Skipped: 0, Time elapsed: 0.017 sec - in org.apache.commons.codec.language.SoundexTest
Running org.apache.commons.codec.language.RefinedSoundexTest
Tests run: 10, Failures: 0, Errors: 0, Skipped: 0, Time elapsed: 0 sec - in org.apache.commons.codec.language.RefinedSoundexTest
Running org.apache.commons.codec.language.MatchRatingApproachEncoderTest
Tests run: 96, Failures: 0, Errors: 0, Skipped: 0, Time elapsed: 0.036 sec - in org.apache.commons.codec.language.MatchRatingApproachEncoderTest
Running org.apache.commons.codec.language.ColognePhoneticTest
Tests run: 13, Failures: 0, Errors: 0, Skipped: 0, Time elapsed: 0.001 sec - in org.apache.commons.codec.language.ColognePhoneticTest
Running org.apache.commons.codec.language.DoubleMetaphone2Test
Tests run: 6, Failures: 0, Errors: 0, Skipped: 0, Time elapsed: 0.03 sec - in org.apache.commons.codec.language.DoubleMetaphone2Test
Running org.apache.commons.codec.language.MetaphoneTest
Tests run: 34, Failures: 0, Errors: 0, Skipped: 0, Time elapsed: 0.123 sec - in org.apache.commons.codec.language.MetaphoneTest
Running org.apache.commons.codec.CharEncodingTest
Tests run: 7, Failures: 0, Errors: 0, Skipped: 0, Time elapsed: 0.001 sec - in org.apache.commons.codec.CharEncodingTest

Results :

Failed tests: 
  QuotedPrintableCodecTest.testUTF8RoundTrip:64 expected:<...92=D1=81=D0=B5=D0=BC[_]=D0=BF=D1=80=D0=B8=D...> but was:<...92=D1=81=D0=B5=D0=BC[=5F]=D0=BF=D1=80=D0=B8=D...>
  QuotedPrintableCodecTest.testBasicEncodeDecode:79 Basic quoted-printable encoding test expected:<=3D [Hello there] =3D=0D=0A> but was:<=3D [=48=65=6C=6C=6F =74=68=65=72=65] =3D=0D=0A>
  QuotedPrintableCodecTest.testSafeCharEncodeDecode:90 Safe chars quoted-printable encoding test expected:<[abc123_-.*~!@#$%^&()+{}"\;:`,/[]]> but was:<[=61=62=63123=5F-.*=7E!=40#$%=5E&()+=7B=7D"=5C;:=60,/=5B=5D]>
  QuotedPrintableCodecTest.testSoftLineBreakEncode:271 expected:<[If you believe that truth=3Dbeauty, then surely mathematics is the most b=
eautiful branch of philosophy].> but was:<[=49=66 =79=6F=75 =62=65=6C=69=65=76=65 =74=68=61=74 =74=72=75=74=68=3D=62=65=
=61=75=74=79, =74=68=65=6E =73=75=72=65=6C=79 =6D=61=74=68=65=6D=61=74=69=63=
=73 =69=73 =74=68=65 =6D=6F=73=74 =62=65=61=75=74=69=66=75=6C =62=72=61=6E=63=
=68 =6F=66 =70=68=69=6C=6F=73=6F=70=68=79].>
  QuotedPrintableCodecTest.testUltimateSoftBreak:309 expected:<[This is a example of a quoted-printable text file. There is no end to i=
t]=09> but was:<[=54=68=69=73 =69=73 =61 =65=78=61=6D=70=6C=65 =6F=66 =61 =71=75=6F=74=65=64=
-=70=72=69=6E=74=61=62=6C=65 =74=65=78=74 =66=69=6C=65. =54=68=65=72=65 =69=
=73 =6E=6F =65=6E=64 =74=6F =69=74]=09>
  QuotedPrintableCodecTest.testTrailingSpecial:295 expected:<[This is a example of a quoted-printable text file. This might contain sp=3D=
cial chars].> but was:<[=54=68=69=73 =69=73 =61 =65=78=61=6D=70=6C=65 =6F=66 =61 =71=75=6F=74=65=64=
-=70=72=69=6E=74=61=62=6C=65 =74=65=78=74 =66=69=6C=65. =54=68=69=73 =6D=69=
=67=68=74 =63=6F=6E=74=61=69=6E =73=70=3D=63=69=61=6C =63=68=61=72=73].>
  QuotedPrintableCodecTest.testFinalBytes:335 expected:<[This is a example of a quoted=3Dprintable text file. There is no tt]> but was:<[=54=68=69=73 =69=73 =61 =65=78=61=6D=70=6C=65 =6F=66 =61 =71=75=6F=74=65=64=
=3D=70=72=69=6E=74=61=62=6C=65 =74=65=78=74 =66=69=6C=65. =54=68=65=72=65=20=
=69=73 =6E=6F =74=74]>

Tests run: 662, Failures: 7, Errors: 0, Skipped: 1

[INFO] ------------------------------------------------------------------------
[INFO] BUILD FAILURE
[INFO] ------------------------------------------------------------------------
[INFO] Total time: 13.675s
[INFO] Finished at: Sun Aug 02 13:47:24 BST 2015
[INFO] Final Memory: 20M/286M
[INFO] ------------------------------------------------------------------------
[ERROR] Failed to execute goal org.apache.maven.plugins:maven-surefire-plugin:2.17:test (default-test) on project commons-codec: There are test failures.
[ERROR] 
[ERROR] Please refer to /home/perham/Study/LittleDarwin/Cases/commons-codec-1.10-src/target/surefire-reports for the individual test results.
[ERROR] -> [Help 1]
[ERROR] 
[ERROR] To see the full stack trace of the errors, re-run Maven with the -e switch.
[ERROR] Re-run Maven using the -X switch to enable full debug logging.
[ERROR] 
[ERROR] For more information about the errors and possible solutions, please read the following articles:
[ERROR] [Help 1] http://cwiki.apache.org/confluence/display/MAVEN/MojoFailureException
