[INFO] Scanning for projects...
[INFO]                                                                         
[INFO] ------------------------------------------------------------------------
[INFO] Building Apache Commons Codec 1.10
[INFO] ------------------------------------------------------------------------
[INFO] 
[INFO] --- maven-enforcer-plugin:1.3.1:enforce (enforce-maven-3) @ commons-codec ---
[INFO] 
[INFO] --- maven-antrun-plugin:1.7:run (javadoc.resources) @ commons-codec ---
[INFO] Executing tasks

main:
[INFO] Executed tasks
[INFO] 
[INFO] --- maven-remote-resources-plugin:1.5:process (default) @ commons-codec ---
[INFO] 
[INFO] --- buildnumber-maven-plugin:1.3:create (default) @ commons-codec ---
[INFO] Executing: /bin/sh -c cd /home/perham/Study/LittleDarwin/Cases/commons-codec-1.10-src && svn --non-interactive info
[INFO] Working directory: /home/perham/Study/LittleDarwin/Cases/commons-codec-1.10-src
[INFO] Storing buildNumber: ?????? at timestamp: 1438519231097
[INFO] Executing: /bin/sh -c cd /home/perham/Study/LittleDarwin/Cases/commons-codec-1.10-src && svn --non-interactive info
[INFO] Working directory: /home/perham/Study/LittleDarwin/Cases/commons-codec-1.10-src
[INFO] Storing buildScmBranch: UNKNOWN_BRANCH
[INFO] 
[INFO] --- maven-resources-plugin:2.7:resources (default-resources) @ commons-codec ---
[INFO] Using 'UTF-8' encoding to copy filtered resources.
[INFO] Copying 128 resources
[INFO] Copying 2 resources to META-INF
[INFO] 
[INFO] --- maven-compiler-plugin:3.2:compile (default-compile) @ commons-codec ---
[INFO] Changes detected - recompiling the module!
[INFO] Compiling 60 source files to /home/perham/Study/LittleDarwin/Cases/commons-codec-1.10-src/target/classes
[INFO] /home/perham/Study/LittleDarwin/Cases/commons-codec-1.10-src/src/main/java/org/apache/commons/codec/digest/Sha2Crypt.java: Some input files use or override a deprecated API.
[INFO] /home/perham/Study/LittleDarwin/Cases/commons-codec-1.10-src/src/main/java/org/apache/commons/codec/digest/Sha2Crypt.java: Recompile with -Xlint:deprecation for details.
[INFO] 
[INFO] --- maven-bundle-plugin:2.5.3:manifest (bundle-manifest) @ commons-codec ---
[INFO] 
[INFO] --- maven-resources-plugin:2.7:testResources (default-testResources) @ commons-codec ---
[INFO] Using 'UTF-8' encoding to copy filtered resources.
[INFO] skip non existing resourceDirectory /home/perham/Study/LittleDarwin/Cases/commons-codec-1.10-src/src/test/resources
[INFO] Copying 2 resources to META-INF
[INFO] 
[INFO] --- maven-compiler-plugin:3.2:testCompile (default-testCompile) @ commons-codec ---
[INFO] Nothing to compile - all classes are up to date
[INFO] 
[INFO] --- maven-surefire-plugin:2.17:test (default-test) @ commons-codec ---
[INFO] Surefire report directory: /home/perham/Study/LittleDarwin/Cases/commons-codec-1.10-src/target/surefire-reports

-------------------------------------------------------
 T E S T S
-------------------------------------------------------
Running org.apache.commons.codec.digest.B64Test
Tests run: 2, Failures: 0, Errors: 0, Skipped: 0, Time elapsed: 0.025 sec - in org.apache.commons.codec.digest.B64Test
Running org.apache.commons.codec.digest.DigestUtilsTest
Tests run: 17, Failures: 0, Errors: 0, Skipped: 0, Time elapsed: 0.665 sec - in org.apache.commons.codec.digest.DigestUtilsTest
Running org.apache.commons.codec.digest.Sha512CryptTest
Tests run: 8, Failures: 0, Errors: 0, Skipped: 0, Time elapsed: 0.497 sec - in org.apache.commons.codec.digest.Sha512CryptTest
Running org.apache.commons.codec.digest.Apr1CryptTest
Tests run: 8, Failures: 0, Errors: 0, Skipped: 0, Time elapsed: 0.076 sec - in org.apache.commons.codec.digest.Apr1CryptTest
Running org.apache.commons.codec.digest.HmacUtilsTest
Tests run: 24, Failures: 0, Errors: 0, Skipped: 0, Time elapsed: 0.051 sec - in org.apache.commons.codec.digest.HmacUtilsTest
Running org.apache.commons.codec.digest.Sha2CryptTest
Tests run: 1, Failures: 0, Errors: 0, Skipped: 0, Time elapsed: 0 sec - in org.apache.commons.codec.digest.Sha2CryptTest
Running org.apache.commons.codec.digest.CryptTest
Tests run: 4, Failures: 0, Errors: 0, Skipped: 0, Time elapsed: 0.059 sec - in org.apache.commons.codec.digest.CryptTest
Running org.apache.commons.codec.digest.Sha256CryptTest
Tests run: 7, Failures: 0, Errors: 0, Skipped: 0, Time elapsed: 0.108 sec - in org.apache.commons.codec.digest.Sha256CryptTest
Running org.apache.commons.codec.digest.Md5CryptTest
Tests run: 7, Failures: 0, Errors: 0, Skipped: 0, Time elapsed: 0.025 sec - in org.apache.commons.codec.digest.Md5CryptTest
Running org.apache.commons.codec.digest.UnixCryptTest
Tests run: 9, Failures: 0, Errors: 0, Skipped: 0, Time elapsed: 0.006 sec - in org.apache.commons.codec.digest.UnixCryptTest
Running org.apache.commons.codec.CharsetsTest
Tests run: 7, Failures: 0, Errors: 0, Skipped: 0, Time elapsed: 0.001 sec - in org.apache.commons.codec.CharsetsTest
Running org.apache.commons.codec.binary.Base32Test
Tests run: 8, Failures: 0, Errors: 0, Skipped: 0, Time elapsed: 0.001 sec - in org.apache.commons.codec.binary.Base32Test
Running org.apache.commons.codec.binary.Base64OutputStreamTest
Tests run: 7, Failures: 0, Errors: 0, Skipped: 0, Time elapsed: 0.194 sec - in org.apache.commons.codec.binary.Base64OutputStreamTest
Running org.apache.commons.codec.binary.Base64Codec13Test
Tests run: 8, Failures: 0, Errors: 0, Skipped: 0, Time elapsed: 0.009 sec - in org.apache.commons.codec.binary.Base64Codec13Test
Running org.apache.commons.codec.binary.Base64InputStreamTest
Tests run: 19, Failures: 0, Errors: 0, Skipped: 0, Time elapsed: 0.122 sec - in org.apache.commons.codec.binary.Base64InputStreamTest
Running org.apache.commons.codec.binary.Base32InputStreamTest
Tests run: 16, Failures: 0, Errors: 0, Skipped: 0, Time elapsed: 0.144 sec - in org.apache.commons.codec.binary.Base32InputStreamTest
Running org.apache.commons.codec.binary.Base32OutputStreamTest
Tests run: 6, Failures: 0, Errors: 0, Skipped: 0, Time elapsed: 0.084 sec - in org.apache.commons.codec.binary.Base32OutputStreamTest
Running org.apache.commons.codec.binary.BinaryCodecTest
Tests run: 13, Failures: 0, Errors: 0, Skipped: 0, Time elapsed: 0.003 sec - in org.apache.commons.codec.binary.BinaryCodecTest
Running org.apache.commons.codec.binary.BaseNCodecTest
Tests run: 7, Failures: 0, Errors: 0, Skipped: 0, Time elapsed: 0.001 sec - in org.apache.commons.codec.binary.BaseNCodecTest
Running org.apache.commons.codec.binary.StringUtilsTest
Tests run: 17, Failures: 0, Errors: 0, Skipped: 0, Time elapsed: 0.025 sec - in org.apache.commons.codec.binary.StringUtilsTest
Running org.apache.commons.codec.binary.Base64Test
Tests run: 53, Failures: 0, Errors: 0, Skipped: 1, Time elapsed: 0.042 sec - in org.apache.commons.codec.binary.Base64Test
Running org.apache.commons.codec.binary.HexTest
Tests run: 19, Failures: 0, Errors: 0, Skipped: 0, Time elapsed: 0.183 sec - in org.apache.commons.codec.binary.HexTest
Running org.apache.commons.codec.DecoderExceptionTest
Tests run: 4, Failures: 0, Errors: 0, Skipped: 0, Time elapsed: 0 sec - in org.apache.commons.codec.DecoderExceptionTest
Running org.apache.commons.codec.EncoderExceptionTest
Tests run: 4, Failures: 0, Errors: 0, Skipped: 0, Time elapsed: 0.001 sec - in org.apache.commons.codec.EncoderExceptionTest
Running org.apache.commons.codec.net.BCodecTest
Tests run: 9, Failures: 0, Errors: 0, Skipped: 0, Time elapsed: 0.005 sec - in org.apache.commons.codec.net.BCodecTest
Running org.apache.commons.codec.net.QCodecTest
Tests run: 12, Failures: 4, Errors: 0, Skipped: 0, Time elapsed: 0.011 sec <<< FAILURE! - in org.apache.commons.codec.net.QCodecTest
testUTF8RoundTrip(org.apache.commons.codec.net.QCodecTest)  Time elapsed: 0.006 sec  <<< FAILURE!
org.junit.ComparisonFailure: expected:<=?UTF-8?Q?=[D0=92=D1=81=D0=B5=D0=BC=5F=D0=BF=D1=80=D0=B8=D0=B2=D0=B5=D1=8]2?=> but was:<=?UTF-8?Q?=[00=02=01=01=00=05=00=0C=0F=00=0F=01=00=00=08=00=02=00=05=01=0]2?=>
	at org.junit.Assert.assertEquals(Assert.java:115)
	at org.junit.Assert.assertEquals(Assert.java:144)
	at org.apache.commons.codec.net.QCodecTest.testUTF8RoundTrip(QCodecTest.java:75)

testBasicEncodeDecode(org.apache.commons.codec.net.QCodecTest)  Time elapsed: 0 sec  <<< FAILURE!
org.junit.ComparisonFailure: Basic Q encoding test expected:<=?UTF-8?Q?=[3D Hello there =3]D=0D=0A?=> but was:<=?UTF-8?Q?=[0D Hello there =0]D=0D=0A?=>
	at org.junit.Assert.assertEquals(Assert.java:115)
	at org.apache.commons.codec.net.QCodecTest.testBasicEncodeDecode(QCodecTest.java:91)

testEncodeObjects(org.apache.commons.codec.net.QCodecTest)  Time elapsed: 0 sec  <<< FAILURE!
org.junit.ComparisonFailure: Basic Q encoding test expected:<=?UTF-8?Q?1+1 =[3]D 2?=> but was:<=?UTF-8?Q?1+1 =[0]D 2?=>
	at org.junit.Assert.assertEquals(Assert.java:115)
	at org.apache.commons.codec.net.QCodecTest.testEncodeObjects(QCodecTest.java:139)

testUnsafeEncodeDecode(org.apache.commons.codec.net.QCodecTest)  Time elapsed: 0.001 sec  <<< FAILURE!
org.junit.ComparisonFailure: Unsafe chars Q encoding test expected:<=?UTF-8?Q?=[3F=5F=3]D=0D=0A?=> but was:<=?UTF-8?Q?=[0F=0F=0]D=0D=0A?=>
	at org.junit.Assert.assertEquals(Assert.java:115)
	at org.apache.commons.codec.net.QCodecTest.testUnsafeEncodeDecode(QCodecTest.java:102)

Running org.apache.commons.codec.net.UtilsTest
Tests run: 1, Failures: 0, Errors: 0, Skipped: 0, Time elapsed: 0 sec - in org.apache.commons.codec.net.UtilsTest
Running org.apache.commons.codec.net.RFC1522CodecTest
Tests run: 2, Failures: 0, Errors: 0, Skipped: 0, Time elapsed: 0 sec - in org.apache.commons.codec.net.RFC1522CodecTest
Running org.apache.commons.codec.net.URLCodecTest
Tests run: 16, Failures: 0, Errors: 0, Skipped: 0, Time elapsed: 0.006 sec - in org.apache.commons.codec.net.URLCodecTest
Running org.apache.commons.codec.net.QuotedPrintableCodecTest
Tests run: 21, Failures: 10, Errors: 0, Skipped: 0, Time elapsed: 0.012 sec <<< FAILURE! - in org.apache.commons.codec.net.QuotedPrintableCodecTest
testUTF8RoundTrip(org.apache.commons.codec.net.QuotedPrintableCodecTest)  Time elapsed: 0 sec  <<< FAILURE!
org.junit.ComparisonFailure: expected:<=[D0=92=D1=81=D0=B5=D0=BC_=D0=BF=D1=80=D0=B8=D0=B2=D0=B5=D1=8]2> but was:<=[00=02=01=01=00=05=00=0C_=00=0F=01=00=00=08=00=02=00=05=01=0]2>
	at org.junit.Assert.assertEquals(Assert.java:115)
	at org.junit.Assert.assertEquals(Assert.java:144)
	at org.apache.commons.codec.net.QuotedPrintableCodecTest.testUTF8RoundTrip(QuotedPrintableCodecTest.java:64)

testEncodeUrlWithNullBitSet(org.apache.commons.codec.net.QuotedPrintableCodecTest)  Time elapsed: 0 sec  <<< FAILURE!
org.junit.ComparisonFailure: Basic quoted-printable encoding test expected:<1+1 =[3]D 2> but was:<1+1 =[0]D 2>
	at org.junit.Assert.assertEquals(Assert.java:115)
	at org.apache.commons.codec.net.QuotedPrintableCodecTest.testEncodeUrlWithNullBitSet(QuotedPrintableCodecTest.java:156)

testBasicEncodeDecode(org.apache.commons.codec.net.QuotedPrintableCodecTest)  Time elapsed: 0 sec  <<< FAILURE!
org.junit.ComparisonFailure: Basic quoted-printable encoding test expected:<=[3D Hello there =3]D=0D=0A> but was:<=[0D Hello there =0]D=0D=0A>
	at org.junit.Assert.assertEquals(Assert.java:115)
	at org.apache.commons.codec.net.QuotedPrintableCodecTest.testBasicEncodeDecode(QuotedPrintableCodecTest.java:79)

testSoftLineBreakDecode(org.apache.commons.codec.net.QuotedPrintableCodecTest)  Time elapsed: 0 sec  <<< FAILURE!
org.junit.ComparisonFailure: expected:<...u believe that truth[=]beauty, then surely ...> but was:<...u believe that truth[
]beauty, then surely ...>
	at org.junit.Assert.assertEquals(Assert.java:115)
	at org.junit.Assert.assertEquals(Assert.java:144)
	at org.apache.commons.codec.net.QuotedPrintableCodecTest.testSoftLineBreakDecode(QuotedPrintableCodecTest.java:262)

testSoftLineBreakEncode(org.apache.commons.codec.net.QuotedPrintableCodecTest)  Time elapsed: 0.001 sec  <<< FAILURE!
org.junit.ComparisonFailure: expected:<... believe that truth=[3]Dbeauty, then surely...> but was:<... believe that truth=[0]Dbeauty, then surely...>
	at org.junit.Assert.assertEquals(Assert.java:115)
	at org.junit.Assert.assertEquals(Assert.java:144)
	at org.apache.commons.codec.net.QuotedPrintableCodecTest.testSoftLineBreakEncode(QuotedPrintableCodecTest.java:271)

testUltimateSoftBreak(org.apache.commons.codec.net.QuotedPrintableCodecTest)  Time elapsed: 0.001 sec  <<< FAILURE!
org.junit.ComparisonFailure: expected:<... is no end to i=
t=[2]0> but was:<... is no end to i=
t=[0]0>
	at org.junit.Assert.assertEquals(Assert.java:115)
	at org.junit.Assert.assertEquals(Assert.java:144)
	at org.apache.commons.codec.net.QuotedPrintableCodecTest.testUltimateSoftBreak(QuotedPrintableCodecTest.java:314)

testTrailingSpecial(org.apache.commons.codec.net.QuotedPrintableCodecTest)  Time elapsed: 0 sec  <<< FAILURE!
org.junit.ComparisonFailure: expected:<...is might contain sp=[3]D=
cial chars.> but was:<...is might contain sp=[0]D=
cial chars.>
	at org.junit.Assert.assertEquals(Assert.java:115)
	at org.junit.Assert.assertEquals(Assert.java:144)
	at org.apache.commons.codec.net.QuotedPrintableCodecTest.testTrailingSpecial(QuotedPrintableCodecTest.java:295)

testEncodeObjects(org.apache.commons.codec.net.QuotedPrintableCodecTest)  Time elapsed: 0.001 sec  <<< FAILURE!
org.junit.ComparisonFailure: Basic quoted-printable encoding test expected:<1+1 =[3]D 2> but was:<1+1 =[0]D 2>
	at org.junit.Assert.assertEquals(Assert.java:115)
	at org.apache.commons.codec.net.QuotedPrintableCodecTest.testEncodeObjects(QuotedPrintableCodecTest.java:191)

testUnsafeEncodeDecode(org.apache.commons.codec.net.QuotedPrintableCodecTest)  Time elapsed: 0.001 sec  <<< FAILURE!
org.junit.ComparisonFailure: Unsafe chars quoted-printable encoding test expected:<=[3]D=0D=0A> but was:<=[0]D=0D=0A>
	at org.junit.Assert.assertEquals(Assert.java:115)
	at org.apache.commons.codec.net.QuotedPrintableCodecTest.testUnsafeEncodeDecode(QuotedPrintableCodecTest.java:102)

testFinalBytes(org.apache.commons.codec.net.QuotedPrintableCodecTest)  Time elapsed: 0.001 sec  <<< FAILURE!
org.junit.ComparisonFailure: expected:<...example of a quoted=[3]Dprintable text file...> but was:<...example of a quoted=[0]Dprintable text file...>
	at org.junit.Assert.assertEquals(Assert.java:115)
	at org.junit.Assert.assertEquals(Assert.java:144)
	at org.apache.commons.codec.net.QuotedPrintableCodecTest.testFinalBytes(QuotedPrintableCodecTest.java:335)

Running org.apache.commons.codec.StringEncoderComparatorTest
Tests run: 3, Failures: 0, Errors: 0, Skipped: 0, Time elapsed: 0.002 sec - in org.apache.commons.codec.StringEncoderComparatorTest
Running org.apache.commons.codec.language.Caverphone1Test
Tests run: 9, Failures: 0, Errors: 0, Skipped: 0, Time elapsed: 0.029 sec - in org.apache.commons.codec.language.Caverphone1Test
Running org.apache.commons.codec.language.NysiisTest
Tests run: 23, Failures: 0, Errors: 0, Skipped: 0, Time elapsed: 0.016 sec - in org.apache.commons.codec.language.NysiisTest
Running org.apache.commons.codec.language.Caverphone2Test
Tests run: 13, Failures: 0, Errors: 0, Skipped: 0, Time elapsed: 0.129 sec - in org.apache.commons.codec.language.Caverphone2Test
Running org.apache.commons.codec.language.DaitchMokotoffSoundexTest
Tests run: 13, Failures: 0, Errors: 0, Skipped: 0, Time elapsed: 0.049 sec - in org.apache.commons.codec.language.DaitchMokotoffSoundexTest
Running org.apache.commons.codec.language.bm.BeiderMorseEncoderTest
Tests run: 22, Failures: 0, Errors: 0, Skipped: 0, Time elapsed: 2.923 sec - in org.apache.commons.codec.language.bm.BeiderMorseEncoderTest
Running org.apache.commons.codec.language.bm.PhoneticEngineTest
Tests run: 8, Failures: 0, Errors: 0, Skipped: 0, Time elapsed: 0.019 sec - in org.apache.commons.codec.language.bm.PhoneticEngineTest
Running org.apache.commons.codec.language.bm.PhoneticEngineRegressionTest
Tests run: 4, Failures: 0, Errors: 0, Skipped: 0, Time elapsed: 0.014 sec - in org.apache.commons.codec.language.bm.PhoneticEngineRegressionTest
Running org.apache.commons.codec.language.bm.RuleTest
Tests run: 3, Failures: 0, Errors: 0, Skipped: 0, Time elapsed: 0.002 sec - in org.apache.commons.codec.language.bm.RuleTest
Running org.apache.commons.codec.language.bm.LanguageGuessingTest
Tests run: 18, Failures: 0, Errors: 0, Skipped: 0, Time elapsed: 0.015 sec - in org.apache.commons.codec.language.bm.LanguageGuessingTest
Running org.apache.commons.codec.language.DoubleMetaphoneTest
Tests run: 16, Failures: 0, Errors: 0, Skipped: 0, Time elapsed: 0.04 sec - in org.apache.commons.codec.language.DoubleMetaphoneTest
Running org.apache.commons.codec.language.SoundexTest
Tests run: 28, Failures: 0, Errors: 0, Skipped: 0, Time elapsed: 0.009 sec - in org.apache.commons.codec.language.SoundexTest
Running org.apache.commons.codec.language.RefinedSoundexTest
Tests run: 10, Failures: 0, Errors: 0, Skipped: 0, Time elapsed: 0.002 sec - in org.apache.commons.codec.language.RefinedSoundexTest
Running org.apache.commons.codec.language.MatchRatingApproachEncoderTest
Tests run: 96, Failures: 0, Errors: 0, Skipped: 0, Time elapsed: 0.033 sec - in org.apache.commons.codec.language.MatchRatingApproachEncoderTest
Running org.apache.commons.codec.language.ColognePhoneticTest
Tests run: 13, Failures: 0, Errors: 0, Skipped: 0, Time elapsed: 0.002 sec - in org.apache.commons.codec.language.ColognePhoneticTest
Running org.apache.commons.codec.language.DoubleMetaphone2Test
Tests run: 6, Failures: 0, Errors: 0, Skipped: 0, Time elapsed: 0.026 sec - in org.apache.commons.codec.language.DoubleMetaphone2Test
Running org.apache.commons.codec.language.MetaphoneTest
Tests run: 34, Failures: 0, Errors: 0, Skipped: 0, Time elapsed: 0.085 sec - in org.apache.commons.codec.language.MetaphoneTest
Running org.apache.commons.codec.CharEncodingTest
Tests run: 7, Failures: 0, Errors: 0, Skipped: 0, Time elapsed: 0.002 sec - in org.apache.commons.codec.CharEncodingTest

Results :

Failed tests: 
  QCodecTest.testUTF8RoundTrip:75 expected:<=?UTF-8?Q?=[D0=92=D1=81=D0=B5=D0=BC=5F=D0=BF=D1=80=D0=B8=D0=B2=D0=B5=D1=8]2?=> but was:<=?UTF-8?Q?=[00=02=01=01=00=05=00=0C=0F=00=0F=01=00=00=08=00=02=00=05=01=0]2?=>
  QCodecTest.testBasicEncodeDecode:91 Basic Q encoding test expected:<=?UTF-8?Q?=[3D Hello there =3]D=0D=0A?=> but was:<=?UTF-8?Q?=[0D Hello there =0]D=0D=0A?=>
  QCodecTest.testEncodeObjects:139 Basic Q encoding test expected:<=?UTF-8?Q?1+1 =[3]D 2?=> but was:<=?UTF-8?Q?1+1 =[0]D 2?=>
  QCodecTest.testUnsafeEncodeDecode:102 Unsafe chars Q encoding test expected:<=?UTF-8?Q?=[3F=5F=3]D=0D=0A?=> but was:<=?UTF-8?Q?=[0F=0F=0]D=0D=0A?=>
  QuotedPrintableCodecTest.testUTF8RoundTrip:64 expected:<=[D0=92=D1=81=D0=B5=D0=BC_=D0=BF=D1=80=D0=B8=D0=B2=D0=B5=D1=8]2> but was:<=[00=02=01=01=00=05=00=0C_=00=0F=01=00=00=08=00=02=00=05=01=0]2>
  QuotedPrintableCodecTest.testEncodeUrlWithNullBitSet:156 Basic quoted-printable encoding test expected:<1+1 =[3]D 2> but was:<1+1 =[0]D 2>
  QuotedPrintableCodecTest.testBasicEncodeDecode:79 Basic quoted-printable encoding test expected:<=[3D Hello there =3]D=0D=0A> but was:<=[0D Hello there =0]D=0D=0A>
  QuotedPrintableCodecTest.testSoftLineBreakDecode:262 expected:<...u believe that truth[=]beauty, then surely ...> but was:<...u believe that truth[
]beauty, then surely ...>
  QuotedPrintableCodecTest.testSoftLineBreakEncode:271 expected:<... believe that truth=[3]Dbeauty, then surely...> but was:<... believe that truth=[0]Dbeauty, then surely...>
  QuotedPrintableCodecTest.testUltimateSoftBreak:314 expected:<... is no end to i=
t=[2]0> but was:<... is no end to i=
t=[0]0>
  QuotedPrintableCodecTest.testTrailingSpecial:295 expected:<...is might contain sp=[3]D=
cial chars.> but was:<...is might contain sp=[0]D=
cial chars.>
  QuotedPrintableCodecTest.testEncodeObjects:191 Basic quoted-printable encoding test expected:<1+1 =[3]D 2> but was:<1+1 =[0]D 2>
  QuotedPrintableCodecTest.testUnsafeEncodeDecode:102 Unsafe chars quoted-printable encoding test expected:<=[3]D=0D=0A> but was:<=[0]D=0D=0A>
  QuotedPrintableCodecTest.testFinalBytes:335 expected:<...example of a quoted=[3]Dprintable text file...> but was:<...example of a quoted=[0]Dprintable text file...>

Tests run: 662, Failures: 14, Errors: 0, Skipped: 1

[INFO] ------------------------------------------------------------------------
[INFO] BUILD FAILURE
[INFO] ------------------------------------------------------------------------
[INFO] Total time: 13.391s
[INFO] Finished at: Sun Aug 02 13:40:41 BST 2015
[INFO] Final Memory: 21M/343M
[INFO] ------------------------------------------------------------------------
[ERROR] Failed to execute goal org.apache.maven.plugins:maven-surefire-plugin:2.17:test (default-test) on project commons-codec: There are test failures.
[ERROR] 
[ERROR] Please refer to /home/perham/Study/LittleDarwin/Cases/commons-codec-1.10-src/target/surefire-reports for the individual test results.
[ERROR] -> [Help 1]
[ERROR] 
[ERROR] To see the full stack trace of the errors, re-run Maven with the -e switch.
[ERROR] Re-run Maven using the -X switch to enable full debug logging.
[ERROR] 
[ERROR] For more information about the errors and possible solutions, please read the following articles:
[ERROR] [Help 1] http://cwiki.apache.org/confluence/display/MAVEN/MojoFailureException
