[INFO] Scanning for projects...
[INFO]                                                                         
[INFO] ------------------------------------------------------------------------
[INFO] Building Apache Commons Codec 1.10
[INFO] ------------------------------------------------------------------------
[INFO] 
[INFO] --- maven-enforcer-plugin:1.3.1:enforce (enforce-maven-3) @ commons-codec ---
[INFO] 
[INFO] --- maven-antrun-plugin:1.7:run (javadoc.resources) @ commons-codec ---
[INFO] Executing tasks

main:
[INFO] Executed tasks
[INFO] 
[INFO] --- maven-remote-resources-plugin:1.5:process (default) @ commons-codec ---
[INFO] 
[INFO] --- buildnumber-maven-plugin:1.3:create (default) @ commons-codec ---
[INFO] Executing: /bin/sh -c cd /home/perham/Study/LittleDarwin/Cases/commons-codec-1.10-src && svn --non-interactive info
[INFO] Working directory: /home/perham/Study/LittleDarwin/Cases/commons-codec-1.10-src
[INFO] Storing buildNumber: ?????? at timestamp: 1438519168123
[INFO] Executing: /bin/sh -c cd /home/perham/Study/LittleDarwin/Cases/commons-codec-1.10-src && svn --non-interactive info
[INFO] Working directory: /home/perham/Study/LittleDarwin/Cases/commons-codec-1.10-src
[INFO] Storing buildScmBranch: UNKNOWN_BRANCH
[INFO] 
[INFO] --- maven-resources-plugin:2.7:resources (default-resources) @ commons-codec ---
[INFO] Using 'UTF-8' encoding to copy filtered resources.
[INFO] Copying 128 resources
[INFO] Copying 2 resources to META-INF
[INFO] 
[INFO] --- maven-compiler-plugin:3.2:compile (default-compile) @ commons-codec ---
[INFO] Changes detected - recompiling the module!
[INFO] Compiling 60 source files to /home/perham/Study/LittleDarwin/Cases/commons-codec-1.10-src/target/classes
[INFO] /home/perham/Study/LittleDarwin/Cases/commons-codec-1.10-src/src/main/java/org/apache/commons/codec/digest/Sha2Crypt.java: Some input files use or override a deprecated API.
[INFO] /home/perham/Study/LittleDarwin/Cases/commons-codec-1.10-src/src/main/java/org/apache/commons/codec/digest/Sha2Crypt.java: Recompile with -Xlint:deprecation for details.
[INFO] 
[INFO] --- maven-bundle-plugin:2.5.3:manifest (bundle-manifest) @ commons-codec ---
[INFO] 
[INFO] --- maven-resources-plugin:2.7:testResources (default-testResources) @ commons-codec ---
[INFO] Using 'UTF-8' encoding to copy filtered resources.
[INFO] skip non existing resourceDirectory /home/perham/Study/LittleDarwin/Cases/commons-codec-1.10-src/src/test/resources
[INFO] Copying 2 resources to META-INF
[INFO] 
[INFO] --- maven-compiler-plugin:3.2:testCompile (default-testCompile) @ commons-codec ---
[INFO] Nothing to compile - all classes are up to date
[INFO] 
[INFO] --- maven-surefire-plugin:2.17:test (default-test) @ commons-codec ---
[INFO] Surefire report directory: /home/perham/Study/LittleDarwin/Cases/commons-codec-1.10-src/target/surefire-reports

-------------------------------------------------------
 T E S T S
-------------------------------------------------------
Running org.apache.commons.codec.digest.B64Test
Tests run: 2, Failures: 0, Errors: 0, Skipped: 0, Time elapsed: 0.028 sec - in org.apache.commons.codec.digest.B64Test
Running org.apache.commons.codec.digest.DigestUtilsTest
Tests run: 17, Failures: 0, Errors: 0, Skipped: 0, Time elapsed: 0.671 sec - in org.apache.commons.codec.digest.DigestUtilsTest
Running org.apache.commons.codec.digest.Sha512CryptTest
Tests run: 8, Failures: 0, Errors: 0, Skipped: 0, Time elapsed: 0.481 sec - in org.apache.commons.codec.digest.Sha512CryptTest
Running org.apache.commons.codec.digest.Apr1CryptTest
Tests run: 8, Failures: 0, Errors: 0, Skipped: 0, Time elapsed: 0.081 sec - in org.apache.commons.codec.digest.Apr1CryptTest
Running org.apache.commons.codec.digest.HmacUtilsTest
Tests run: 24, Failures: 0, Errors: 0, Skipped: 0, Time elapsed: 0.041 sec - in org.apache.commons.codec.digest.HmacUtilsTest
Running org.apache.commons.codec.digest.Sha2CryptTest
Tests run: 1, Failures: 0, Errors: 0, Skipped: 0, Time elapsed: 0.001 sec - in org.apache.commons.codec.digest.Sha2CryptTest
Running org.apache.commons.codec.digest.CryptTest
Tests run: 4, Failures: 0, Errors: 0, Skipped: 0, Time elapsed: 0.081 sec - in org.apache.commons.codec.digest.CryptTest
Running org.apache.commons.codec.digest.Sha256CryptTest
Tests run: 7, Failures: 0, Errors: 0, Skipped: 0, Time elapsed: 0.111 sec - in org.apache.commons.codec.digest.Sha256CryptTest
Running org.apache.commons.codec.digest.Md5CryptTest
Tests run: 7, Failures: 0, Errors: 0, Skipped: 0, Time elapsed: 0.017 sec - in org.apache.commons.codec.digest.Md5CryptTest
Running org.apache.commons.codec.digest.UnixCryptTest
Tests run: 9, Failures: 0, Errors: 0, Skipped: 0, Time elapsed: 0.008 sec - in org.apache.commons.codec.digest.UnixCryptTest
Running org.apache.commons.codec.CharsetsTest
Tests run: 7, Failures: 0, Errors: 0, Skipped: 0, Time elapsed: 0.001 sec - in org.apache.commons.codec.CharsetsTest
Running org.apache.commons.codec.binary.Base32Test
Tests run: 8, Failures: 0, Errors: 0, Skipped: 0, Time elapsed: 0.008 sec - in org.apache.commons.codec.binary.Base32Test
Running org.apache.commons.codec.binary.Base64OutputStreamTest
Tests run: 7, Failures: 0, Errors: 0, Skipped: 0, Time elapsed: 0.202 sec - in org.apache.commons.codec.binary.Base64OutputStreamTest
Running org.apache.commons.codec.binary.Base64Codec13Test
Tests run: 8, Failures: 0, Errors: 0, Skipped: 0, Time elapsed: 0.011 sec - in org.apache.commons.codec.binary.Base64Codec13Test
Running org.apache.commons.codec.binary.Base64InputStreamTest
Tests run: 19, Failures: 0, Errors: 0, Skipped: 0, Time elapsed: 0.107 sec - in org.apache.commons.codec.binary.Base64InputStreamTest
Running org.apache.commons.codec.binary.Base32InputStreamTest
Tests run: 16, Failures: 0, Errors: 0, Skipped: 0, Time elapsed: 0.126 sec - in org.apache.commons.codec.binary.Base32InputStreamTest
Running org.apache.commons.codec.binary.Base32OutputStreamTest
Tests run: 6, Failures: 0, Errors: 0, Skipped: 0, Time elapsed: 0.09 sec - in org.apache.commons.codec.binary.Base32OutputStreamTest
Running org.apache.commons.codec.binary.BinaryCodecTest
Tests run: 13, Failures: 0, Errors: 0, Skipped: 0, Time elapsed: 0.014 sec - in org.apache.commons.codec.binary.BinaryCodecTest
Running org.apache.commons.codec.binary.BaseNCodecTest
Tests run: 7, Failures: 0, Errors: 0, Skipped: 0, Time elapsed: 0.003 sec - in org.apache.commons.codec.binary.BaseNCodecTest
Running org.apache.commons.codec.binary.StringUtilsTest
Tests run: 17, Failures: 0, Errors: 0, Skipped: 0, Time elapsed: 0.03 sec - in org.apache.commons.codec.binary.StringUtilsTest
Running org.apache.commons.codec.binary.Base64Test
Tests run: 53, Failures: 0, Errors: 0, Skipped: 1, Time elapsed: 0.047 sec - in org.apache.commons.codec.binary.Base64Test
Running org.apache.commons.codec.binary.HexTest
Tests run: 19, Failures: 0, Errors: 0, Skipped: 0, Time elapsed: 0.191 sec - in org.apache.commons.codec.binary.HexTest
Running org.apache.commons.codec.DecoderExceptionTest
Tests run: 4, Failures: 0, Errors: 0, Skipped: 0, Time elapsed: 0 sec - in org.apache.commons.codec.DecoderExceptionTest
Running org.apache.commons.codec.EncoderExceptionTest
Tests run: 4, Failures: 0, Errors: 0, Skipped: 0, Time elapsed: 0 sec - in org.apache.commons.codec.EncoderExceptionTest
Running org.apache.commons.codec.net.BCodecTest
Tests run: 9, Failures: 0, Errors: 0, Skipped: 0, Time elapsed: 0.005 sec - in org.apache.commons.codec.net.BCodecTest
Running org.apache.commons.codec.net.QCodecTest
Tests run: 12, Failures: 0, Errors: 6, Skipped: 0, Time elapsed: 0.013 sec <<< FAILURE! - in org.apache.commons.codec.net.QCodecTest
testUTF8RoundTrip(org.apache.commons.codec.net.QCodecTest)  Time elapsed: 0.01 sec  <<< ERROR!
java.lang.ExceptionInInitializerError: null
	at java.util.BitSet.set(BitSet.java:436)
	at org.apache.commons.codec.net.QuotedPrintableCodec.<clinit>(QuotedPrintableCodec.java:34)
	at org.apache.commons.codec.net.QCodec.doEncoding(QCodec.java:157)
	at org.apache.commons.codec.net.RFC1522Codec.encodeText(RFC1522Codec.java:78)
	at org.apache.commons.codec.net.QCodec.encode(QCodec.java:211)
	at org.apache.commons.codec.net.QCodec.encode(QCodec.java:250)
	at org.apache.commons.codec.net.QCodecTest.testUTF8RoundTrip(QCodecTest.java:75)

testEncodeDecodeBlanks(org.apache.commons.codec.net.QCodecTest)  Time elapsed: 0 sec  <<< ERROR!
java.lang.NoClassDefFoundError: Could not initialize class org.apache.commons.codec.net.QuotedPrintableCodec
	at org.apache.commons.codec.net.QCodec.doEncoding(QCodec.java:157)
	at org.apache.commons.codec.net.RFC1522Codec.encodeText(RFC1522Codec.java:78)
	at org.apache.commons.codec.net.QCodec.encode(QCodec.java:211)
	at org.apache.commons.codec.net.QCodec.encode(QCodec.java:250)
	at org.apache.commons.codec.net.QCodecTest.testEncodeDecodeBlanks(QCodecTest.java:188)

testBasicEncodeDecode(org.apache.commons.codec.net.QCodecTest)  Time elapsed: 0 sec  <<< ERROR!
java.lang.NoClassDefFoundError: Could not initialize class org.apache.commons.codec.net.QuotedPrintableCodec
	at org.apache.commons.codec.net.QCodec.doEncoding(QCodec.java:157)
	at org.apache.commons.codec.net.RFC1522Codec.encodeText(RFC1522Codec.java:78)
	at org.apache.commons.codec.net.QCodec.encode(QCodec.java:211)
	at org.apache.commons.codec.net.QCodec.encode(QCodec.java:250)
	at org.apache.commons.codec.net.QCodecTest.testBasicEncodeDecode(QCodecTest.java:90)

testDecodeObjects(org.apache.commons.codec.net.QCodecTest)  Time elapsed: 0.001 sec  <<< ERROR!
java.lang.NoClassDefFoundError: Could not initialize class org.apache.commons.codec.net.QuotedPrintableCodec
	at org.apache.commons.codec.net.QCodec.doDecoding(QCodec.java:192)
	at org.apache.commons.codec.net.RFC1522Codec.decodeText(RFC1522Codec.java:154)
	at org.apache.commons.codec.net.QCodec.decode(QCodec.java:269)
	at org.apache.commons.codec.net.QCodec.decode(QCodec.java:313)
	at org.apache.commons.codec.net.QCodecTest.testDecodeObjects(QCodecTest.java:164)

testEncodeObjects(org.apache.commons.codec.net.QCodecTest)  Time elapsed: 0 sec  <<< ERROR!
java.lang.NoClassDefFoundError: Could not initialize class org.apache.commons.codec.net.QuotedPrintableCodec
	at org.apache.commons.codec.net.QCodec.doEncoding(QCodec.java:157)
	at org.apache.commons.codec.net.RFC1522Codec.encodeText(RFC1522Codec.java:78)
	at org.apache.commons.codec.net.QCodec.encode(QCodec.java:211)
	at org.apache.commons.codec.net.QCodec.encode(QCodec.java:250)
	at org.apache.commons.codec.net.QCodec.encode(QCodec.java:289)
	at org.apache.commons.codec.net.QCodecTest.testEncodeObjects(QCodecTest.java:138)

testUnsafeEncodeDecode(org.apache.commons.codec.net.QCodecTest)  Time elapsed: 0 sec  <<< ERROR!
java.lang.NoClassDefFoundError: Could not initialize class org.apache.commons.codec.net.QuotedPrintableCodec
	at org.apache.commons.codec.net.QCodec.doEncoding(QCodec.java:157)
	at org.apache.commons.codec.net.RFC1522Codec.encodeText(RFC1522Codec.java:78)
	at org.apache.commons.codec.net.QCodec.encode(QCodec.java:211)
	at org.apache.commons.codec.net.QCodec.encode(QCodec.java:250)
	at org.apache.commons.codec.net.QCodecTest.testUnsafeEncodeDecode(QCodecTest.java:101)

Running org.apache.commons.codec.net.UtilsTest
Tests run: 1, Failures: 0, Errors: 0, Skipped: 0, Time elapsed: 0 sec - in org.apache.commons.codec.net.UtilsTest
Running org.apache.commons.codec.net.RFC1522CodecTest
Tests run: 2, Failures: 0, Errors: 0, Skipped: 0, Time elapsed: 0 sec - in org.apache.commons.codec.net.RFC1522CodecTest
Running org.apache.commons.codec.net.URLCodecTest
Tests run: 16, Failures: 0, Errors: 0, Skipped: 0, Time elapsed: 0.005 sec - in org.apache.commons.codec.net.URLCodecTest
Running org.apache.commons.codec.net.QuotedPrintableCodecTest
Tests run: 21, Failures: 0, Errors: 21, Skipped: 0, Time elapsed: 0.011 sec <<< FAILURE! - in org.apache.commons.codec.net.QuotedPrintableCodecTest
testUTF8RoundTrip(org.apache.commons.codec.net.QuotedPrintableCodecTest)  Time elapsed: 0 sec  <<< ERROR!
java.lang.NoClassDefFoundError: Could not initialize class org.apache.commons.codec.net.QuotedPrintableCodec
	at org.apache.commons.codec.net.QuotedPrintableCodecTest.testUTF8RoundTrip(QuotedPrintableCodecTest.java:62)

testEncodeNull(org.apache.commons.codec.net.QuotedPrintableCodecTest)  Time elapsed: 0.001 sec  <<< ERROR!
java.lang.NoClassDefFoundError: Could not initialize class org.apache.commons.codec.net.QuotedPrintableCodec
	at org.apache.commons.codec.net.QuotedPrintableCodecTest.testEncodeNull(QuotedPrintableCodecTest.java:143)

testEncodeUrlWithNullBitSet(org.apache.commons.codec.net.QuotedPrintableCodecTest)  Time elapsed: 0 sec  <<< ERROR!
java.lang.NoClassDefFoundError: Could not initialize class org.apache.commons.codec.net.QuotedPrintableCodec
	at org.apache.commons.codec.net.QuotedPrintableCodecTest.testEncodeUrlWithNullBitSet(QuotedPrintableCodecTest.java:152)

testBasicEncodeDecode(org.apache.commons.codec.net.QuotedPrintableCodecTest)  Time elapsed: 0 sec  <<< ERROR!
java.lang.NoClassDefFoundError: Could not initialize class org.apache.commons.codec.net.QuotedPrintableCodec
	at org.apache.commons.codec.net.QuotedPrintableCodecTest.testBasicEncodeDecode(QuotedPrintableCodecTest.java:76)

testDefaultEncoding(org.apache.commons.codec.net.QuotedPrintableCodecTest)  Time elapsed: 0.001 sec  <<< ERROR!
java.lang.NoClassDefFoundError: Could not initialize class org.apache.commons.codec.net.QuotedPrintableCodec
	at org.apache.commons.codec.net.QuotedPrintableCodecTest.testDefaultEncoding(QuotedPrintableCodecTest.java:246)

testSafeCharEncodeDecode(org.apache.commons.codec.net.QuotedPrintableCodecTest)  Time elapsed: 0 sec  <<< ERROR!
java.lang.NoClassDefFoundError: Could not initialize class org.apache.commons.codec.net.QuotedPrintableCodec
	at org.apache.commons.codec.net.QuotedPrintableCodecTest.testSafeCharEncodeDecode(QuotedPrintableCodecTest.java:87)

testDecodeInvalid(org.apache.commons.codec.net.QuotedPrintableCodecTest)  Time elapsed: 0 sec  <<< ERROR!
java.lang.NoClassDefFoundError: Could not initialize class org.apache.commons.codec.net.QuotedPrintableCodec
	at org.apache.commons.codec.net.QuotedPrintableCodecTest.testDecodeInvalid(QuotedPrintableCodecTest.java:120)

testSkipNotEncodedCRLF(org.apache.commons.codec.net.QuotedPrintableCodecTest)  Time elapsed: 0.001 sec  <<< ERROR!
java.lang.NoClassDefFoundError: Could not initialize class org.apache.commons.codec.net.QuotedPrintableCodec
	at org.apache.commons.codec.net.QuotedPrintableCodecTest.testSkipNotEncodedCRLF(QuotedPrintableCodecTest.java:282)

testSoftLineBreakDecode(org.apache.commons.codec.net.QuotedPrintableCodecTest)  Time elapsed: 0 sec  <<< ERROR!
java.lang.NoClassDefFoundError: Could not initialize class org.apache.commons.codec.net.QuotedPrintableCodec
	at org.apache.commons.codec.net.QuotedPrintableCodecTest.testSoftLineBreakDecode(QuotedPrintableCodecTest.java:258)

testSoftLineBreakEncode(org.apache.commons.codec.net.QuotedPrintableCodecTest)  Time elapsed: 0 sec  <<< ERROR!
java.lang.NoClassDefFoundError: Could not initialize class org.apache.commons.codec.net.QuotedPrintableCodec
	at org.apache.commons.codec.net.QuotedPrintableCodecTest.testSoftLineBreakEncode(QuotedPrintableCodecTest.java:270)

testDecodeStringWithNull(org.apache.commons.codec.net.QuotedPrintableCodecTest)  Time elapsed: 0.001 sec  <<< ERROR!
java.lang.NoClassDefFoundError: Could not initialize class org.apache.commons.codec.net.QuotedPrintableCodec
	at org.apache.commons.codec.net.QuotedPrintableCodecTest.testDecodeStringWithNull(QuotedPrintableCodecTest.java:180)

testDecodeObjects(org.apache.commons.codec.net.QuotedPrintableCodecTest)  Time elapsed: 0 sec  <<< ERROR!
java.lang.NoClassDefFoundError: Could not initialize class org.apache.commons.codec.net.QuotedPrintableCodec
	at org.apache.commons.codec.net.QuotedPrintableCodecTest.testDecodeObjects(QuotedPrintableCodecTest.java:219)

testEncodeDecodeNull(org.apache.commons.codec.net.QuotedPrintableCodecTest)  Time elapsed: 0 sec  <<< ERROR!
java.lang.NoClassDefFoundError: Could not initialize class org.apache.commons.codec.net.QuotedPrintableCodec
	at org.apache.commons.codec.net.QuotedPrintableCodecTest.testEncodeDecodeNull(QuotedPrintableCodecTest.java:110)

testInvalidEncoding(org.apache.commons.codec.net.QuotedPrintableCodecTest)  Time elapsed: 0.001 sec  <<< ERROR!
java.lang.Exception: Unexpected exception, expected<java.nio.charset.UnsupportedCharsetException> but was<java.lang.NoClassDefFoundError>
	at org.apache.commons.codec.net.QuotedPrintableCodecTest.testInvalidEncoding(QuotedPrintableCodecTest.java:214)

testUltimateSoftBreak(org.apache.commons.codec.net.QuotedPrintableCodecTest)  Time elapsed: 0 sec  <<< ERROR!
java.lang.NoClassDefFoundError: Could not initialize class org.apache.commons.codec.net.QuotedPrintableCodec
	at org.apache.commons.codec.net.QuotedPrintableCodecTest.testUltimateSoftBreak(QuotedPrintableCodecTest.java:304)

testEncodeStringWithNull(org.apache.commons.codec.net.QuotedPrintableCodecTest)  Time elapsed: 0 sec  <<< ERROR!
java.lang.NoClassDefFoundError: Could not initialize class org.apache.commons.codec.net.QuotedPrintableCodec
	at org.apache.commons.codec.net.QuotedPrintableCodecTest.testEncodeStringWithNull(QuotedPrintableCodecTest.java:172)

testTrailingSpecial(org.apache.commons.codec.net.QuotedPrintableCodecTest)  Time elapsed: 0.001 sec  <<< ERROR!
java.lang.NoClassDefFoundError: Could not initialize class org.apache.commons.codec.net.QuotedPrintableCodec
	at org.apache.commons.codec.net.QuotedPrintableCodecTest.testTrailingSpecial(QuotedPrintableCodecTest.java:291)

testEncodeObjects(org.apache.commons.codec.net.QuotedPrintableCodecTest)  Time elapsed: 0 sec  <<< ERROR!
java.lang.NoClassDefFoundError: Could not initialize class org.apache.commons.codec.net.QuotedPrintableCodec
	at org.apache.commons.codec.net.QuotedPrintableCodecTest.testEncodeObjects(QuotedPrintableCodecTest.java:188)

testUnsafeEncodeDecode(org.apache.commons.codec.net.QuotedPrintableCodecTest)  Time elapsed: 0 sec  <<< ERROR!
java.lang.NoClassDefFoundError: Could not initialize class org.apache.commons.codec.net.QuotedPrintableCodec
	at org.apache.commons.codec.net.QuotedPrintableCodecTest.testUnsafeEncodeDecode(QuotedPrintableCodecTest.java:99)

testDecodeWithNullArray(org.apache.commons.codec.net.QuotedPrintableCodecTest)  Time elapsed: 0 sec  <<< ERROR!
java.lang.NoClassDefFoundError: Could not initialize class org.apache.commons.codec.net.QuotedPrintableCodec
	at org.apache.commons.codec.net.QuotedPrintableCodecTest.testDecodeWithNullArray(QuotedPrintableCodecTest.java:166)

testFinalBytes(org.apache.commons.codec.net.QuotedPrintableCodecTest)  Time elapsed: 0 sec  <<< ERROR!
java.lang.NoClassDefFoundError: Could not initialize class org.apache.commons.codec.net.QuotedPrintableCodec
	at org.apache.commons.codec.net.QuotedPrintableCodecTest.testFinalBytes(QuotedPrintableCodecTest.java:335)

Running org.apache.commons.codec.StringEncoderComparatorTest
Tests run: 3, Failures: 0, Errors: 0, Skipped: 0, Time elapsed: 0.001 sec - in org.apache.commons.codec.StringEncoderComparatorTest
Running org.apache.commons.codec.language.Caverphone1Test
Tests run: 9, Failures: 0, Errors: 0, Skipped: 0, Time elapsed: 0.029 sec - in org.apache.commons.codec.language.Caverphone1Test
Running org.apache.commons.codec.language.NysiisTest
Tests run: 23, Failures: 0, Errors: 0, Skipped: 0, Time elapsed: 0.02 sec - in org.apache.commons.codec.language.NysiisTest
Running org.apache.commons.codec.language.Caverphone2Test
Tests run: 13, Failures: 0, Errors: 0, Skipped: 0, Time elapsed: 0.127 sec - in org.apache.commons.codec.language.Caverphone2Test
Running org.apache.commons.codec.language.DaitchMokotoffSoundexTest
Tests run: 13, Failures: 0, Errors: 0, Skipped: 0, Time elapsed: 0.045 sec - in org.apache.commons.codec.language.DaitchMokotoffSoundexTest
Running org.apache.commons.codec.language.bm.BeiderMorseEncoderTest
Tests run: 22, Failures: 0, Errors: 0, Skipped: 0, Time elapsed: 3.033 sec - in org.apache.commons.codec.language.bm.BeiderMorseEncoderTest
Running org.apache.commons.codec.language.bm.PhoneticEngineTest
Tests run: 8, Failures: 0, Errors: 0, Skipped: 0, Time elapsed: 0.02 sec - in org.apache.commons.codec.language.bm.PhoneticEngineTest
Running org.apache.commons.codec.language.bm.PhoneticEngineRegressionTest
Tests run: 4, Failures: 0, Errors: 0, Skipped: 0, Time elapsed: 0.014 sec - in org.apache.commons.codec.language.bm.PhoneticEngineRegressionTest
Running org.apache.commons.codec.language.bm.RuleTest
Tests run: 3, Failures: 0, Errors: 0, Skipped: 0, Time elapsed: 0.002 sec - in org.apache.commons.codec.language.bm.RuleTest
Running org.apache.commons.codec.language.bm.LanguageGuessingTest
Tests run: 18, Failures: 0, Errors: 0, Skipped: 0, Time elapsed: 0.016 sec - in org.apache.commons.codec.language.bm.LanguageGuessingTest
Running org.apache.commons.codec.language.DoubleMetaphoneTest
Tests run: 16, Failures: 0, Errors: 0, Skipped: 0, Time elapsed: 0.055 sec - in org.apache.commons.codec.language.DoubleMetaphoneTest
Running org.apache.commons.codec.language.SoundexTest
Tests run: 28, Failures: 0, Errors: 0, Skipped: 0, Time elapsed: 0.01 sec - in org.apache.commons.codec.language.SoundexTest
Running org.apache.commons.codec.language.RefinedSoundexTest
Tests run: 10, Failures: 0, Errors: 0, Skipped: 0, Time elapsed: 0.002 sec - in org.apache.commons.codec.language.RefinedSoundexTest
Running org.apache.commons.codec.language.MatchRatingApproachEncoderTest
Tests run: 96, Failures: 0, Errors: 0, Skipped: 0, Time elapsed: 0.038 sec - in org.apache.commons.codec.language.MatchRatingApproachEncoderTest
Running org.apache.commons.codec.language.ColognePhoneticTest
Tests run: 13, Failures: 0, Errors: 0, Skipped: 0, Time elapsed: 0.004 sec - in org.apache.commons.codec.language.ColognePhoneticTest
Running org.apache.commons.codec.language.DoubleMetaphone2Test
Tests run: 6, Failures: 0, Errors: 0, Skipped: 0, Time elapsed: 0.04 sec - in org.apache.commons.codec.language.DoubleMetaphone2Test
Running org.apache.commons.codec.language.MetaphoneTest
Tests run: 34, Failures: 0, Errors: 0, Skipped: 0, Time elapsed: 0.101 sec - in org.apache.commons.codec.language.MetaphoneTest
Running org.apache.commons.codec.CharEncodingTest
Tests run: 7, Failures: 0, Errors: 0, Skipped: 0, Time elapsed: 0 sec - in org.apache.commons.codec.CharEncodingTest

Results :

Tests in error: 
  QCodecTest.testUTF8RoundTrip:75 » ExceptionInInitializer
  QCodecTest.testEncodeDecodeBlanks:188 » NoClassDefFound Could not initialize c...
  QCodecTest.testBasicEncodeDecode:90 » NoClassDefFound Could not initialize cla...
  QCodecTest.testDecodeObjects:164 » NoClassDefFound Could not initialize class ...
  QCodecTest.testEncodeObjects:138 » NoClassDefFound Could not initialize class ...
  QCodecTest.testUnsafeEncodeDecode:101 » NoClassDefFound Could not initialize c...
  QuotedPrintableCodecTest.testUTF8RoundTrip:62 NoClassDefFound Could not initia...
  QuotedPrintableCodecTest.testEncodeNull:143 NoClassDefFound Could not initiali...
  QuotedPrintableCodecTest.testEncodeUrlWithNullBitSet:152 NoClassDefFound Could...
  QuotedPrintableCodecTest.testBasicEncodeDecode:76 NoClassDefFound Could not in...
  QuotedPrintableCodecTest.testDefaultEncoding:246 NoClassDefFound Could not ini...
  QuotedPrintableCodecTest.testSafeCharEncodeDecode:87 NoClassDefFound Could not...
  QuotedPrintableCodecTest.testDecodeInvalid:120 NoClassDefFound Could not initi...
  QuotedPrintableCodecTest.testSkipNotEncodedCRLF:282 NoClassDefFound Could not ...
  QuotedPrintableCodecTest.testSoftLineBreakDecode:258 NoClassDefFound Could not...
  QuotedPrintableCodecTest.testSoftLineBreakEncode:270 NoClassDefFound Could not...
  QuotedPrintableCodecTest.testDecodeStringWithNull:180 NoClassDefFound Could no...
  QuotedPrintableCodecTest.testDecodeObjects:219 NoClassDefFound Could not initi...
  QuotedPrintableCodecTest.testEncodeDecodeNull:110 NoClassDefFound Could not in...
  QuotedPrintableCodecTest.testInvalidEncoding »  Unexpected exception, expected...
  QuotedPrintableCodecTest.testUltimateSoftBreak:304 NoClassDefFound Could not i...
  QuotedPrintableCodecTest.testEncodeStringWithNull:172 NoClassDefFound Could no...
  QuotedPrintableCodecTest.testTrailingSpecial:291 NoClassDefFound Could not ini...
  QuotedPrintableCodecTest.testEncodeObjects:188 NoClassDefFound Could not initi...
  QuotedPrintableCodecTest.testUnsafeEncodeDecode:99 NoClassDefFound Could not i...
  QuotedPrintableCodecTest.testDecodeWithNullArray:166 NoClassDefFound Could not...
  QuotedPrintableCodecTest.testFinalBytes:335 NoClassDefFound Could not initiali...

Tests run: 662, Failures: 0, Errors: 27, Skipped: 1

[INFO] ------------------------------------------------------------------------
[INFO] BUILD FAILURE
[INFO] ------------------------------------------------------------------------
[INFO] Total time: 15.553s
[INFO] Finished at: Sun Aug 02 13:39:40 BST 2015
[INFO] Final Memory: 22M/288M
[INFO] ------------------------------------------------------------------------
[ERROR] Failed to execute goal org.apache.maven.plugins:maven-surefire-plugin:2.17:test (default-test) on project commons-codec: There are test failures.
[ERROR] 
[ERROR] Please refer to /home/perham/Study/LittleDarwin/Cases/commons-codec-1.10-src/target/surefire-reports for the individual test results.
[ERROR] -> [Help 1]
[ERROR] 
[ERROR] To see the full stack trace of the errors, re-run Maven with the -e switch.
[ERROR] Re-run Maven using the -X switch to enable full debug logging.
[ERROR] 
[ERROR] For more information about the errors and possible solutions, please read the following articles:
[ERROR] [Help 1] http://cwiki.apache.org/confluence/display/MAVEN/MojoFailureException
