[INFO] Scanning for projects...
[INFO]                                                                         
[INFO] ------------------------------------------------------------------------
[INFO] Building Apache Commons Codec 1.10
[INFO] ------------------------------------------------------------------------
[INFO] 
[INFO] --- maven-enforcer-plugin:1.3.1:enforce (enforce-maven-3) @ commons-codec ---
[INFO] 
[INFO] --- maven-antrun-plugin:1.7:run (javadoc.resources) @ commons-codec ---
[INFO] Executing tasks

main:
[INFO] Executed tasks
[INFO] 
[INFO] --- maven-remote-resources-plugin:1.5:process (default) @ commons-codec ---
[INFO] 
[INFO] --- buildnumber-maven-plugin:1.3:create (default) @ commons-codec ---
[INFO] Executing: /bin/sh -c cd /home/perham/Study/LittleDarwin/Cases/commons-codec-1.10-src && svn --non-interactive info
[INFO] Working directory: /home/perham/Study/LittleDarwin/Cases/commons-codec-1.10-src
[INFO] Storing buildNumber: ?????? at timestamp: 1438518118020
[INFO] Executing: /bin/sh -c cd /home/perham/Study/LittleDarwin/Cases/commons-codec-1.10-src && svn --non-interactive info
[INFO] Working directory: /home/perham/Study/LittleDarwin/Cases/commons-codec-1.10-src
[INFO] Storing buildScmBranch: UNKNOWN_BRANCH
[INFO] 
[INFO] --- maven-resources-plugin:2.7:resources (default-resources) @ commons-codec ---
[INFO] Using 'UTF-8' encoding to copy filtered resources.
[INFO] Copying 128 resources
[INFO] Copying 2 resources to META-INF
[INFO] 
[INFO] --- maven-compiler-plugin:3.2:compile (default-compile) @ commons-codec ---
[INFO] Changes detected - recompiling the module!
[INFO] Compiling 60 source files to /home/perham/Study/LittleDarwin/Cases/commons-codec-1.10-src/target/classes
[INFO] /home/perham/Study/LittleDarwin/Cases/commons-codec-1.10-src/src/main/java/org/apache/commons/codec/digest/Sha2Crypt.java: Some input files use or override a deprecated API.
[INFO] /home/perham/Study/LittleDarwin/Cases/commons-codec-1.10-src/src/main/java/org/apache/commons/codec/digest/Sha2Crypt.java: Recompile with -Xlint:deprecation for details.
[INFO] 
[INFO] --- maven-bundle-plugin:2.5.3:manifest (bundle-manifest) @ commons-codec ---
[INFO] 
[INFO] --- maven-resources-plugin:2.7:testResources (default-testResources) @ commons-codec ---
[INFO] Using 'UTF-8' encoding to copy filtered resources.
[INFO] skip non existing resourceDirectory /home/perham/Study/LittleDarwin/Cases/commons-codec-1.10-src/src/test/resources
[INFO] Copying 2 resources to META-INF
[INFO] 
[INFO] --- maven-compiler-plugin:3.2:testCompile (default-testCompile) @ commons-codec ---
[INFO] Nothing to compile - all classes are up to date
[INFO] 
[INFO] --- maven-surefire-plugin:2.17:test (default-test) @ commons-codec ---
[INFO] Surefire report directory: /home/perham/Study/LittleDarwin/Cases/commons-codec-1.10-src/target/surefire-reports

-------------------------------------------------------
 T E S T S
-------------------------------------------------------
Running org.apache.commons.codec.digest.B64Test
Tests run: 2, Failures: 0, Errors: 0, Skipped: 0, Time elapsed: 0.027 sec - in org.apache.commons.codec.digest.B64Test
Running org.apache.commons.codec.digest.DigestUtilsTest
Tests run: 17, Failures: 0, Errors: 0, Skipped: 0, Time elapsed: 0.676 sec - in org.apache.commons.codec.digest.DigestUtilsTest
Running org.apache.commons.codec.digest.Sha512CryptTest
Tests run: 8, Failures: 0, Errors: 0, Skipped: 0, Time elapsed: 0.464 sec - in org.apache.commons.codec.digest.Sha512CryptTest
Running org.apache.commons.codec.digest.Apr1CryptTest
Tests run: 8, Failures: 0, Errors: 0, Skipped: 0, Time elapsed: 0.064 sec - in org.apache.commons.codec.digest.Apr1CryptTest
Running org.apache.commons.codec.digest.HmacUtilsTest
Tests run: 24, Failures: 0, Errors: 0, Skipped: 0, Time elapsed: 0.039 sec - in org.apache.commons.codec.digest.HmacUtilsTest
Running org.apache.commons.codec.digest.Sha2CryptTest
Tests run: 1, Failures: 0, Errors: 0, Skipped: 0, Time elapsed: 0.001 sec - in org.apache.commons.codec.digest.Sha2CryptTest
Running org.apache.commons.codec.digest.CryptTest
Tests run: 4, Failures: 0, Errors: 0, Skipped: 0, Time elapsed: 0.108 sec - in org.apache.commons.codec.digest.CryptTest
Running org.apache.commons.codec.digest.Sha256CryptTest
Tests run: 7, Failures: 0, Errors: 0, Skipped: 0, Time elapsed: 0.113 sec - in org.apache.commons.codec.digest.Sha256CryptTest
Running org.apache.commons.codec.digest.Md5CryptTest
Tests run: 7, Failures: 0, Errors: 0, Skipped: 0, Time elapsed: 0.022 sec - in org.apache.commons.codec.digest.Md5CryptTest
Running org.apache.commons.codec.digest.UnixCryptTest
Tests run: 9, Failures: 0, Errors: 0, Skipped: 0, Time elapsed: 0.007 sec - in org.apache.commons.codec.digest.UnixCryptTest
Running org.apache.commons.codec.CharsetsTest
Tests run: 7, Failures: 0, Errors: 0, Skipped: 0, Time elapsed: 0.001 sec - in org.apache.commons.codec.CharsetsTest
Running org.apache.commons.codec.binary.Base32Test
Tests run: 8, Failures: 0, Errors: 0, Skipped: 0, Time elapsed: 0.006 sec - in org.apache.commons.codec.binary.Base32Test
Running org.apache.commons.codec.binary.Base64OutputStreamTest
Tests run: 7, Failures: 0, Errors: 0, Skipped: 0, Time elapsed: 0.202 sec - in org.apache.commons.codec.binary.Base64OutputStreamTest
Running org.apache.commons.codec.binary.Base64Codec13Test
Tests run: 8, Failures: 0, Errors: 0, Skipped: 0, Time elapsed: 0.014 sec - in org.apache.commons.codec.binary.Base64Codec13Test
Running org.apache.commons.codec.binary.Base64InputStreamTest
Tests run: 19, Failures: 0, Errors: 0, Skipped: 0, Time elapsed: 0.126 sec - in org.apache.commons.codec.binary.Base64InputStreamTest
Running org.apache.commons.codec.binary.Base32InputStreamTest
Tests run: 16, Failures: 0, Errors: 0, Skipped: 0, Time elapsed: 0.137 sec - in org.apache.commons.codec.binary.Base32InputStreamTest
Running org.apache.commons.codec.binary.Base32OutputStreamTest
Tests run: 6, Failures: 0, Errors: 0, Skipped: 0, Time elapsed: 0.092 sec - in org.apache.commons.codec.binary.Base32OutputStreamTest
Running org.apache.commons.codec.binary.BinaryCodecTest
Tests run: 13, Failures: 0, Errors: 0, Skipped: 0, Time elapsed: 0.013 sec - in org.apache.commons.codec.binary.BinaryCodecTest
Running org.apache.commons.codec.binary.BaseNCodecTest
Tests run: 7, Failures: 0, Errors: 0, Skipped: 0, Time elapsed: 0.003 sec - in org.apache.commons.codec.binary.BaseNCodecTest
Running org.apache.commons.codec.binary.StringUtilsTest
Tests run: 17, Failures: 0, Errors: 0, Skipped: 0, Time elapsed: 0.029 sec - in org.apache.commons.codec.binary.StringUtilsTest
Running org.apache.commons.codec.binary.Base64Test
Tests run: 53, Failures: 0, Errors: 0, Skipped: 1, Time elapsed: 0.048 sec - in org.apache.commons.codec.binary.Base64Test
Running org.apache.commons.codec.binary.HexTest
Tests run: 19, Failures: 0, Errors: 0, Skipped: 0, Time elapsed: 0.184 sec - in org.apache.commons.codec.binary.HexTest
Running org.apache.commons.codec.DecoderExceptionTest
Tests run: 4, Failures: 0, Errors: 0, Skipped: 0, Time elapsed: 0 sec - in org.apache.commons.codec.DecoderExceptionTest
Running org.apache.commons.codec.EncoderExceptionTest
Tests run: 4, Failures: 0, Errors: 0, Skipped: 0, Time elapsed: 0 sec - in org.apache.commons.codec.EncoderExceptionTest
Running org.apache.commons.codec.net.BCodecTest
Tests run: 9, Failures: 0, Errors: 0, Skipped: 0, Time elapsed: 0.005 sec - in org.apache.commons.codec.net.BCodecTest
Running org.apache.commons.codec.net.QCodecTest
Tests run: 12, Failures: 0, Errors: 0, Skipped: 0, Time elapsed: 0.006 sec - in org.apache.commons.codec.net.QCodecTest
Running org.apache.commons.codec.net.UtilsTest
Tests run: 1, Failures: 0, Errors: 0, Skipped: 0, Time elapsed: 0 sec - in org.apache.commons.codec.net.UtilsTest
Running org.apache.commons.codec.net.RFC1522CodecTest
Tests run: 2, Failures: 0, Errors: 0, Skipped: 0, Time elapsed: 0.001 sec - in org.apache.commons.codec.net.RFC1522CodecTest
Running org.apache.commons.codec.net.URLCodecTest
Tests run: 16, Failures: 0, Errors: 0, Skipped: 0, Time elapsed: 0.005 sec - in org.apache.commons.codec.net.URLCodecTest
Running org.apache.commons.codec.net.QuotedPrintableCodecTest
Tests run: 21, Failures: 0, Errors: 0, Skipped: 0, Time elapsed: 0.014 sec - in org.apache.commons.codec.net.QuotedPrintableCodecTest
Running org.apache.commons.codec.StringEncoderComparatorTest
Tests run: 3, Failures: 0, Errors: 0, Skipped: 0, Time elapsed: 0.003 sec - in org.apache.commons.codec.StringEncoderComparatorTest
Running org.apache.commons.codec.language.Caverphone1Test
Tests run: 9, Failures: 0, Errors: 0, Skipped: 0, Time elapsed: 0.028 sec - in org.apache.commons.codec.language.Caverphone1Test
Running org.apache.commons.codec.language.NysiisTest
Tests run: 23, Failures: 0, Errors: 0, Skipped: 0, Time elapsed: 0.018 sec - in org.apache.commons.codec.language.NysiisTest
Running org.apache.commons.codec.language.Caverphone2Test
Tests run: 13, Failures: 0, Errors: 0, Skipped: 0, Time elapsed: 0.136 sec - in org.apache.commons.codec.language.Caverphone2Test
Running org.apache.commons.codec.language.DaitchMokotoffSoundexTest
Tests run: 13, Failures: 0, Errors: 0, Skipped: 0, Time elapsed: 0.049 sec - in org.apache.commons.codec.language.DaitchMokotoffSoundexTest
Running org.apache.commons.codec.language.bm.BeiderMorseEncoderTest
Tests run: 22, Failures: 0, Errors: 0, Skipped: 0, Time elapsed: 2.922 sec - in org.apache.commons.codec.language.bm.BeiderMorseEncoderTest
Running org.apache.commons.codec.language.bm.PhoneticEngineTest
Tests run: 8, Failures: 3, Errors: 0, Skipped: 0, Time elapsed: 0.025 sec <<< FAILURE! - in org.apache.commons.codec.language.bm.PhoneticEngineTest
testEncode[Renault-rinD|rinDlt|rina|rinalt|rino|rinolt|rinu|rinult-GENERIC-APPROX](org.apache.commons.codec.language.bm.PhoneticEngineTest)  Time elapsed: 0.006 sec  <<< FAILURE!
org.junit.ComparisonFailure: phoneme incorrect expected:<rinD[|rinDlt|rina|rinalt|rino|rinolt|rinu]|rinult> but was:<rinD[lt|rinalt|rinolt]|rinult>
	at org.junit.Assert.assertEquals(Assert.java:115)
	at org.apache.commons.codec.language.bm.PhoneticEngineTest.testEncode(PhoneticEngineTest.java:88)

testEncode[d'ortley-(ortlaj|ortlej)-(dortlaj|dortlej)-GENERIC-EXACT](org.apache.commons.codec.language.bm.PhoneticEngineTest)  Time elapsed: 0.002 sec  <<< FAILURE!
org.junit.ComparisonFailure: phoneme incorrect expected:<(ortlaj|ortl[ej)-(dortla]j|dortlej)> but was:<(ortlaj|ortl[aj|ortlej|ortlej)-(dortlaj|dortlaj|dortle]j|dortlej)>
	at org.junit.Assert.assertEquals(Assert.java:115)
	at org.apache.commons.codec.language.bm.PhoneticEngineTest.testEncode(PhoneticEngineTest.java:88)

testEncode[Judenburg-iudnbYrk|iudnbirk|iudnburk|xudnbirk|xudnburk|zudnbirk|zudnburk-GENERIC-APPROX](org.apache.commons.codec.language.bm.PhoneticEngineTest)  Time elapsed: 0.002 sec  <<< FAILURE!
org.junit.ComparisonFailure: phoneme incorrect expected:<...nburk|zudnbirk|zudnb[]urk> but was:<...nburk|zudnbirk|zudnb[irk|zudnburk|zudnb]urk>
	at org.junit.Assert.assertEquals(Assert.java:115)
	at org.apache.commons.codec.language.bm.PhoneticEngineTest.testEncode(PhoneticEngineTest.java:88)

Running org.apache.commons.codec.language.bm.PhoneticEngineRegressionTest
Tests run: 4, Failures: 3, Errors: 0, Skipped: 0, Time elapsed: 0.003 sec <<< FAILURE! - in org.apache.commons.codec.language.bm.PhoneticEngineRegressionTest
testSolrGENERIC(org.apache.commons.codec.language.bm.PhoneticEngineRegressionTest)  Time elapsed: 0 sec  <<< FAILURE!
org.junit.ComparisonFailure: expected:<...anilo|anxilo|anzilo|[anzilo|ogilo|ongYlo|ongilo|oniilo|onilo|onxilo|onz]ilo|onzilo> but was:<...anilo|anxilo|anzilo|[ogilo|ongYlo|ongilo|oniilo|onilo|onx]ilo|onzilo>
	at org.junit.Assert.assertEquals(Assert.java:115)
	at org.junit.Assert.assertEquals(Assert.java:144)
	at org.apache.commons.codec.language.bm.PhoneticEngineRegressionTest.testSolrGENERIC(PhoneticEngineRegressionTest.java:43)

testSolrSEPHARDIC(org.apache.commons.codec.language.bm.PhoneticEngineRegressionTest)  Time elapsed: 0 sec  <<< FAILURE!
org.junit.ComparisonFailure: expected:<...|anhilu|anzila|anzil[a|anzilu|anzilu|nhila|nhilu|nzila|nzila|nzilu]|nzilu> but was:<...|anhilu|anzila|anzil[u|nhila|nhilu|nzila]|nzilu>
	at org.junit.Assert.assertEquals(Assert.java:115)
	at org.junit.Assert.assertEquals(Assert.java:144)
	at org.apache.commons.codec.language.bm.PhoneticEngineRegressionTest.testSolrSEPHARDIC(PhoneticEngineRegressionTest.java:138)

testCompatibilityWithOriginalVersion(org.apache.commons.codec.language.bm.PhoneticEngineRegressionTest)  Time elapsed: 0.001 sec  <<< FAILURE!
org.junit.ComparisonFailure: expected:<bndzn|bn[dzn|bntsn|bn]tsn|bnzn|vndzn|vntsn> but was:<bndzn|bn[]tsn|bnzn|vndzn|vntsn>
	at org.junit.Assert.assertEquals(Assert.java:115)
	at org.junit.Assert.assertEquals(Assert.java:144)
	at org.apache.commons.codec.language.bm.PhoneticEngineRegressionTest.testCompatibilityWithOriginalVersion(PhoneticEngineRegressionTest.java:190)

Running org.apache.commons.codec.language.bm.RuleTest
Tests run: 3, Failures: 2, Errors: 0, Skipped: 0, Time elapsed: 0.004 sec <<< FAILURE! - in org.apache.commons.codec.language.bm.RuleTest
testPhonemeComparedToLaterIsNegative(org.apache.commons.codec.language.bm.RuleTest)  Time elapsed: 0.003 sec  <<< FAILURE!
java.lang.AssertionError: Comparing rinD to rinDlt should be negative
Expected: value should be negative
     but: was <0>
	at org.hamcrest.MatcherAssert.assertThat(MatcherAssert.java:20)
	at org.junit.Assert.assertThat(Assert.java:865)
	at org.apache.commons.codec.language.bm.RuleTest.testPhonemeComparedToLaterIsNegative(RuleTest.java:69)

testPhonemeComparedToSelfIsZero(org.apache.commons.codec.language.bm.RuleTest)  Time elapsed: 0.001 sec  <<< FAILURE!
java.lang.AssertionError: Phoneme compared to itself should be zero: rinD expected:<0> but was:<-1>
	at org.junit.Assert.fail(Assert.java:88)
	at org.junit.Assert.failNotEquals(Assert.java:743)
	at org.junit.Assert.assertEquals(Assert.java:118)
	at org.junit.Assert.assertEquals(Assert.java:555)
	at org.apache.commons.codec.language.bm.RuleTest.testPhonemeComparedToSelfIsZero(RuleTest.java:80)

Running org.apache.commons.codec.language.bm.LanguageGuessingTest
Tests run: 18, Failures: 0, Errors: 0, Skipped: 0, Time elapsed: 0.017 sec - in org.apache.commons.codec.language.bm.LanguageGuessingTest
Running org.apache.commons.codec.language.DoubleMetaphoneTest
Tests run: 16, Failures: 0, Errors: 0, Skipped: 0, Time elapsed: 0.058 sec - in org.apache.commons.codec.language.DoubleMetaphoneTest
Running org.apache.commons.codec.language.SoundexTest
Tests run: 28, Failures: 0, Errors: 0, Skipped: 0, Time elapsed: 0.01 sec - in org.apache.commons.codec.language.SoundexTest
Running org.apache.commons.codec.language.RefinedSoundexTest
Tests run: 10, Failures: 0, Errors: 0, Skipped: 0, Time elapsed: 0.003 sec - in org.apache.commons.codec.language.RefinedSoundexTest
Running org.apache.commons.codec.language.MatchRatingApproachEncoderTest
Tests run: 96, Failures: 0, Errors: 0, Skipped: 0, Time elapsed: 0.035 sec - in org.apache.commons.codec.language.MatchRatingApproachEncoderTest
Running org.apache.commons.codec.language.ColognePhoneticTest
Tests run: 13, Failures: 0, Errors: 0, Skipped: 0, Time elapsed: 0.004 sec - in org.apache.commons.codec.language.ColognePhoneticTest
Running org.apache.commons.codec.language.DoubleMetaphone2Test
Tests run: 6, Failures: 0, Errors: 0, Skipped: 0, Time elapsed: 0.039 sec - in org.apache.commons.codec.language.DoubleMetaphone2Test
Running org.apache.commons.codec.language.MetaphoneTest
Tests run: 34, Failures: 0, Errors: 0, Skipped: 0, Time elapsed: 0.104 sec - in org.apache.commons.codec.language.MetaphoneTest
Running org.apache.commons.codec.CharEncodingTest
Tests run: 7, Failures: 0, Errors: 0, Skipped: 0, Time elapsed: 0.001 sec - in org.apache.commons.codec.CharEncodingTest

Results :

Failed tests: 
  PhoneticEngineTest.testEncode:88 phoneme incorrect expected:<rinD[|rinDlt|rina|rinalt|rino|rinolt|rinu]|rinult> but was:<rinD[lt|rinalt|rinolt]|rinult>
  PhoneticEngineTest.testEncode:88 phoneme incorrect expected:<(ortlaj|ortl[ej)-(dortla]j|dortlej)> but was:<(ortlaj|ortl[aj|ortlej|ortlej)-(dortlaj|dortlaj|dortle]j|dortlej)>
  PhoneticEngineTest.testEncode:88 phoneme incorrect expected:<...nburk|zudnbirk|zudnb[]urk> but was:<...nburk|zudnbirk|zudnb[irk|zudnburk|zudnb]urk>
  PhoneticEngineRegressionTest.testSolrGENERIC:43 expected:<...anilo|anxilo|anzilo|[anzilo|ogilo|ongYlo|ongilo|oniilo|onilo|onxilo|onz]ilo|onzilo> but was:<...anilo|anxilo|anzilo|[ogilo|ongYlo|ongilo|oniilo|onilo|onx]ilo|onzilo>
  PhoneticEngineRegressionTest.testSolrSEPHARDIC:138 expected:<...|anhilu|anzila|anzil[a|anzilu|anzilu|nhila|nhilu|nzila|nzila|nzilu]|nzilu> but was:<...|anhilu|anzila|anzil[u|nhila|nhilu|nzila]|nzilu>
  PhoneticEngineRegressionTest.testCompatibilityWithOriginalVersion:190 expected:<bndzn|bn[dzn|bntsn|bn]tsn|bnzn|vndzn|vntsn> but was:<bndzn|bn[]tsn|bnzn|vndzn|vntsn>
  RuleTest.testPhonemeComparedToLaterIsNegative:69 Comparing rinD to rinDlt should be negative
Expected: value should be negative
     but: was <0>
  RuleTest.testPhonemeComparedToSelfIsZero:80 Phoneme compared to itself should be zero: rinD expected:<0> but was:<-1>

Tests run: 662, Failures: 8, Errors: 0, Skipped: 1

[INFO] ------------------------------------------------------------------------
[INFO] BUILD FAILURE
[INFO] ------------------------------------------------------------------------
[INFO] Total time: 13.976s
[INFO] Finished at: Sun Aug 02 13:22:09 BST 2015
[INFO] Final Memory: 27M/349M
[INFO] ------------------------------------------------------------------------
[ERROR] Failed to execute goal org.apache.maven.plugins:maven-surefire-plugin:2.17:test (default-test) on project commons-codec: There are test failures.
[ERROR] 
[ERROR] Please refer to /home/perham/Study/LittleDarwin/Cases/commons-codec-1.10-src/target/surefire-reports for the individual test results.
[ERROR] -> [Help 1]
[ERROR] 
[ERROR] To see the full stack trace of the errors, re-run Maven with the -e switch.
[ERROR] Re-run Maven using the -X switch to enable full debug logging.
[ERROR] 
[ERROR] For more information about the errors and possible solutions, please read the following articles:
[ERROR] [Help 1] http://cwiki.apache.org/confluence/display/MAVEN/MojoFailureException
