[INFO] Scanning for projects...
[INFO]                                                                         
[INFO] ------------------------------------------------------------------------
[INFO] Building Apache Commons Codec 1.10
[INFO] ------------------------------------------------------------------------
[INFO] 
[INFO] --- maven-enforcer-plugin:1.3.1:enforce (enforce-maven-3) @ commons-codec ---
[INFO] 
[INFO] --- maven-antrun-plugin:1.7:run (javadoc.resources) @ commons-codec ---
[INFO] Executing tasks

main:
[INFO] Executed tasks
[INFO] 
[INFO] --- maven-remote-resources-plugin:1.5:process (default) @ commons-codec ---
[INFO] 
[INFO] --- buildnumber-maven-plugin:1.3:create (default) @ commons-codec ---
[INFO] Executing: /bin/sh -c cd /home/perham/Study/LittleDarwin/Cases/commons-codec-1.10-src && svn --non-interactive info
[INFO] Working directory: /home/perham/Study/LittleDarwin/Cases/commons-codec-1.10-src
[INFO] Storing buildNumber: ?????? at timestamp: 1438518046220
[INFO] Executing: /bin/sh -c cd /home/perham/Study/LittleDarwin/Cases/commons-codec-1.10-src && svn --non-interactive info
[INFO] Working directory: /home/perham/Study/LittleDarwin/Cases/commons-codec-1.10-src
[INFO] Storing buildScmBranch: UNKNOWN_BRANCH
[INFO] 
[INFO] --- maven-resources-plugin:2.7:resources (default-resources) @ commons-codec ---
[INFO] Using 'UTF-8' encoding to copy filtered resources.
[INFO] Copying 128 resources
[INFO] Copying 2 resources to META-INF
[INFO] 
[INFO] --- maven-compiler-plugin:3.2:compile (default-compile) @ commons-codec ---
[INFO] Changes detected - recompiling the module!
[INFO] Compiling 60 source files to /home/perham/Study/LittleDarwin/Cases/commons-codec-1.10-src/target/classes
[INFO] /home/perham/Study/LittleDarwin/Cases/commons-codec-1.10-src/src/main/java/org/apache/commons/codec/digest/Sha2Crypt.java: Some input files use or override a deprecated API.
[INFO] /home/perham/Study/LittleDarwin/Cases/commons-codec-1.10-src/src/main/java/org/apache/commons/codec/digest/Sha2Crypt.java: Recompile with -Xlint:deprecation for details.
[INFO] 
[INFO] --- maven-bundle-plugin:2.5.3:manifest (bundle-manifest) @ commons-codec ---
[INFO] 
[INFO] --- maven-resources-plugin:2.7:testResources (default-testResources) @ commons-codec ---
[INFO] Using 'UTF-8' encoding to copy filtered resources.
[INFO] skip non existing resourceDirectory /home/perham/Study/LittleDarwin/Cases/commons-codec-1.10-src/src/test/resources
[INFO] Copying 2 resources to META-INF
[INFO] 
[INFO] --- maven-compiler-plugin:3.2:testCompile (default-testCompile) @ commons-codec ---
[INFO] Nothing to compile - all classes are up to date
[INFO] 
[INFO] --- maven-surefire-plugin:2.17:test (default-test) @ commons-codec ---
[INFO] Surefire report directory: /home/perham/Study/LittleDarwin/Cases/commons-codec-1.10-src/target/surefire-reports

-------------------------------------------------------
 T E S T S
-------------------------------------------------------
Running org.apache.commons.codec.digest.B64Test
Tests run: 2, Failures: 0, Errors: 0, Skipped: 0, Time elapsed: 0.026 sec - in org.apache.commons.codec.digest.B64Test
Running org.apache.commons.codec.digest.DigestUtilsTest
Tests run: 17, Failures: 0, Errors: 0, Skipped: 0, Time elapsed: 0.67 sec - in org.apache.commons.codec.digest.DigestUtilsTest
Running org.apache.commons.codec.digest.Sha512CryptTest
Tests run: 8, Failures: 0, Errors: 0, Skipped: 0, Time elapsed: 0.483 sec - in org.apache.commons.codec.digest.Sha512CryptTest
Running org.apache.commons.codec.digest.Apr1CryptTest
Tests run: 8, Failures: 0, Errors: 0, Skipped: 0, Time elapsed: 0.069 sec - in org.apache.commons.codec.digest.Apr1CryptTest
Running org.apache.commons.codec.digest.HmacUtilsTest
Tests run: 24, Failures: 0, Errors: 0, Skipped: 0, Time elapsed: 0.036 sec - in org.apache.commons.codec.digest.HmacUtilsTest
Running org.apache.commons.codec.digest.Sha2CryptTest
Tests run: 1, Failures: 0, Errors: 0, Skipped: 0, Time elapsed: 0.001 sec - in org.apache.commons.codec.digest.Sha2CryptTest
Running org.apache.commons.codec.digest.CryptTest
Tests run: 4, Failures: 0, Errors: 0, Skipped: 0, Time elapsed: 0.083 sec - in org.apache.commons.codec.digest.CryptTest
Running org.apache.commons.codec.digest.Sha256CryptTest
Tests run: 7, Failures: 0, Errors: 0, Skipped: 0, Time elapsed: 0.11 sec - in org.apache.commons.codec.digest.Sha256CryptTest
Running org.apache.commons.codec.digest.Md5CryptTest
Tests run: 7, Failures: 0, Errors: 0, Skipped: 0, Time elapsed: 0.014 sec - in org.apache.commons.codec.digest.Md5CryptTest
Running org.apache.commons.codec.digest.UnixCryptTest
Tests run: 9, Failures: 0, Errors: 0, Skipped: 0, Time elapsed: 0.009 sec - in org.apache.commons.codec.digest.UnixCryptTest
Running org.apache.commons.codec.CharsetsTest
Tests run: 7, Failures: 0, Errors: 0, Skipped: 0, Time elapsed: 0.002 sec - in org.apache.commons.codec.CharsetsTest
Running org.apache.commons.codec.binary.Base32Test
Tests run: 8, Failures: 0, Errors: 0, Skipped: 0, Time elapsed: 0.006 sec - in org.apache.commons.codec.binary.Base32Test
Running org.apache.commons.codec.binary.Base64OutputStreamTest
Tests run: 7, Failures: 0, Errors: 0, Skipped: 0, Time elapsed: 0.194 sec - in org.apache.commons.codec.binary.Base64OutputStreamTest
Running org.apache.commons.codec.binary.Base64Codec13Test
Tests run: 8, Failures: 0, Errors: 0, Skipped: 0, Time elapsed: 0.011 sec - in org.apache.commons.codec.binary.Base64Codec13Test
Running org.apache.commons.codec.binary.Base64InputStreamTest
Tests run: 19, Failures: 0, Errors: 0, Skipped: 0, Time elapsed: 0.109 sec - in org.apache.commons.codec.binary.Base64InputStreamTest
Running org.apache.commons.codec.binary.Base32InputStreamTest
Tests run: 16, Failures: 0, Errors: 0, Skipped: 0, Time elapsed: 0.127 sec - in org.apache.commons.codec.binary.Base32InputStreamTest
Running org.apache.commons.codec.binary.Base32OutputStreamTest
Tests run: 6, Failures: 0, Errors: 0, Skipped: 0, Time elapsed: 0.094 sec - in org.apache.commons.codec.binary.Base32OutputStreamTest
Running org.apache.commons.codec.binary.BinaryCodecTest
Tests run: 13, Failures: 0, Errors: 0, Skipped: 0, Time elapsed: 0.013 sec - in org.apache.commons.codec.binary.BinaryCodecTest
Running org.apache.commons.codec.binary.BaseNCodecTest
Tests run: 7, Failures: 0, Errors: 0, Skipped: 0, Time elapsed: 0.003 sec - in org.apache.commons.codec.binary.BaseNCodecTest
Running org.apache.commons.codec.binary.StringUtilsTest
Tests run: 17, Failures: 0, Errors: 0, Skipped: 0, Time elapsed: 0.03 sec - in org.apache.commons.codec.binary.StringUtilsTest
Running org.apache.commons.codec.binary.Base64Test
Tests run: 53, Failures: 0, Errors: 0, Skipped: 1, Time elapsed: 0.048 sec - in org.apache.commons.codec.binary.Base64Test
Running org.apache.commons.codec.binary.HexTest
Tests run: 19, Failures: 0, Errors: 0, Skipped: 0, Time elapsed: 0.178 sec - in org.apache.commons.codec.binary.HexTest
Running org.apache.commons.codec.DecoderExceptionTest
Tests run: 4, Failures: 0, Errors: 0, Skipped: 0, Time elapsed: 0.001 sec - in org.apache.commons.codec.DecoderExceptionTest
Running org.apache.commons.codec.EncoderExceptionTest
Tests run: 4, Failures: 0, Errors: 0, Skipped: 0, Time elapsed: 0 sec - in org.apache.commons.codec.EncoderExceptionTest
Running org.apache.commons.codec.net.BCodecTest
Tests run: 9, Failures: 0, Errors: 0, Skipped: 0, Time elapsed: 0.005 sec - in org.apache.commons.codec.net.BCodecTest
Running org.apache.commons.codec.net.QCodecTest
Tests run: 12, Failures: 0, Errors: 0, Skipped: 0, Time elapsed: 0.009 sec - in org.apache.commons.codec.net.QCodecTest
Running org.apache.commons.codec.net.UtilsTest
Tests run: 1, Failures: 0, Errors: 0, Skipped: 0, Time elapsed: 0.001 sec - in org.apache.commons.codec.net.UtilsTest
Running org.apache.commons.codec.net.RFC1522CodecTest
Tests run: 2, Failures: 0, Errors: 0, Skipped: 0, Time elapsed: 0 sec - in org.apache.commons.codec.net.RFC1522CodecTest
Running org.apache.commons.codec.net.URLCodecTest
Tests run: 16, Failures: 0, Errors: 0, Skipped: 0, Time elapsed: 0.003 sec - in org.apache.commons.codec.net.URLCodecTest
Running org.apache.commons.codec.net.QuotedPrintableCodecTest
Tests run: 21, Failures: 0, Errors: 0, Skipped: 0, Time elapsed: 0.01 sec - in org.apache.commons.codec.net.QuotedPrintableCodecTest
Running org.apache.commons.codec.StringEncoderComparatorTest
Tests run: 3, Failures: 0, Errors: 0, Skipped: 0, Time elapsed: 0.004 sec - in org.apache.commons.codec.StringEncoderComparatorTest
Running org.apache.commons.codec.language.Caverphone1Test
Tests run: 9, Failures: 0, Errors: 0, Skipped: 0, Time elapsed: 0.029 sec - in org.apache.commons.codec.language.Caverphone1Test
Running org.apache.commons.codec.language.NysiisTest
Tests run: 23, Failures: 0, Errors: 0, Skipped: 0, Time elapsed: 0.016 sec - in org.apache.commons.codec.language.NysiisTest
Running org.apache.commons.codec.language.Caverphone2Test
Tests run: 13, Failures: 0, Errors: 0, Skipped: 0, Time elapsed: 0.138 sec - in org.apache.commons.codec.language.Caverphone2Test
Running org.apache.commons.codec.language.DaitchMokotoffSoundexTest
Tests run: 13, Failures: 0, Errors: 0, Skipped: 0, Time elapsed: 0.05 sec - in org.apache.commons.codec.language.DaitchMokotoffSoundexTest
Running org.apache.commons.codec.language.bm.BeiderMorseEncoderTest
Tests run: 22, Failures: 0, Errors: 6, Skipped: 0, Time elapsed: 0.638 sec <<< FAILURE! - in org.apache.commons.codec.language.bm.BeiderMorseEncoderTest
testAsciiEncodeNotEmpty1Letter(org.apache.commons.codec.language.bm.BeiderMorseEncoderTest)  Time elapsed: 0.01 sec  <<< ERROR!
java.lang.StringIndexOutOfBoundsException: String index out of range: -1
	at java.lang.String.charAt(String.java:658)
	at org.apache.commons.codec.language.bm.Rule.endsWith(Rule.java:83)
	at org.apache.commons.codec.language.bm.Rule.access$200(Rule.java:24)
	at org.apache.commons.codec.language.bm.Rule$6.isMatch(Rule.java:160)
	at org.apache.commons.codec.language.bm.Rule.patternAndContextMatches(Rule.java:205)
	at org.apache.commons.codec.language.bm.PhoneticEngine$RulesApplication.invoke(PhoneticEngine.java:214)
	at org.apache.commons.codec.language.bm.PhoneticEngine.applyFinalRules(PhoneticEngine.java:346)
	at org.apache.commons.codec.language.bm.PhoneticEngine.encode(PhoneticEngine.java:477)
	at org.apache.commons.codec.language.bm.PhoneticEngine.encode(PhoneticEngine.java:385)
	at org.apache.commons.codec.language.bm.BeiderMorseEncoder.encode(BeiderMorseEncoder.java:96)
	at org.apache.commons.codec.language.bm.BeiderMorseEncoderTest.assertNotEmpty(BeiderMorseEncoderTest.java:39)
	at org.apache.commons.codec.language.bm.BeiderMorseEncoderTest.testAsciiEncodeNotEmpty1Letter(BeiderMorseEncoderTest.java:73)

testAllChars(org.apache.commons.codec.language.bm.BeiderMorseEncoderTest)  Time elapsed: 0.017 sec  <<< ERROR!
java.lang.StringIndexOutOfBoundsException: String index out of range: -1
	at java.lang.String.charAt(String.java:658)
	at org.apache.commons.codec.language.bm.Rule.endsWith(Rule.java:83)
	at org.apache.commons.codec.language.bm.Rule.access$200(Rule.java:24)
	at org.apache.commons.codec.language.bm.Rule$6.isMatch(Rule.java:160)
	at org.apache.commons.codec.language.bm.Rule.patternAndContextMatches(Rule.java:205)
	at org.apache.commons.codec.language.bm.PhoneticEngine$RulesApplication.invoke(PhoneticEngine.java:214)
	at org.apache.commons.codec.language.bm.PhoneticEngine.applyFinalRules(PhoneticEngine.java:346)
	at org.apache.commons.codec.language.bm.PhoneticEngine.encode(PhoneticEngine.java:477)
	at org.apache.commons.codec.language.bm.PhoneticEngine.encode(PhoneticEngine.java:385)
	at org.apache.commons.codec.language.bm.BeiderMorseEncoder.encode(BeiderMorseEncoder.java:96)
	at org.apache.commons.codec.language.bm.BeiderMorseEncoderTest.testAllChars(BeiderMorseEncoderTest.java:63)

testEncodeAtzNotEmpty(org.apache.commons.codec.language.bm.BeiderMorseEncoderTest)  Time elapsed: 0.001 sec  <<< ERROR!
java.lang.StringIndexOutOfBoundsException: String index out of range: -1
	at java.lang.String.charAt(String.java:658)
	at org.apache.commons.codec.language.bm.Rule.endsWith(Rule.java:83)
	at org.apache.commons.codec.language.bm.Rule.access$200(Rule.java:24)
	at org.apache.commons.codec.language.bm.Rule$6.isMatch(Rule.java:160)
	at org.apache.commons.codec.language.bm.Rule.patternAndContextMatches(Rule.java:205)
	at org.apache.commons.codec.language.bm.PhoneticEngine$RulesApplication.invoke(PhoneticEngine.java:214)
	at org.apache.commons.codec.language.bm.PhoneticEngine.applyFinalRules(PhoneticEngine.java:346)
	at org.apache.commons.codec.language.bm.PhoneticEngine.encode(PhoneticEngine.java:477)
	at org.apache.commons.codec.language.bm.PhoneticEngine.encode(PhoneticEngine.java:385)
	at org.apache.commons.codec.language.bm.BeiderMorseEncoder.encode(BeiderMorseEncoder.java:96)
	at org.apache.commons.codec.language.bm.BeiderMorseEncoderTest.assertNotEmpty(BeiderMorseEncoderTest.java:39)
	at org.apache.commons.codec.language.bm.BeiderMorseEncoderTest.testEncodeAtzNotEmpty(BeiderMorseEncoderTest.java:97)

testAsciiEncodeNotEmpty2Letters(org.apache.commons.codec.language.bm.BeiderMorseEncoderTest)  Time elapsed: 0.004 sec  <<< ERROR!
java.lang.StringIndexOutOfBoundsException: String index out of range: -1
	at java.lang.String.charAt(String.java:658)
	at org.apache.commons.codec.language.bm.Rule.endsWith(Rule.java:83)
	at org.apache.commons.codec.language.bm.Rule.access$200(Rule.java:24)
	at org.apache.commons.codec.language.bm.Rule$6.isMatch(Rule.java:160)
	at org.apache.commons.codec.language.bm.Rule.patternAndContextMatches(Rule.java:205)
	at org.apache.commons.codec.language.bm.PhoneticEngine$RulesApplication.invoke(PhoneticEngine.java:214)
	at org.apache.commons.codec.language.bm.PhoneticEngine.applyFinalRules(PhoneticEngine.java:346)
	at org.apache.commons.codec.language.bm.PhoneticEngine.encode(PhoneticEngine.java:477)
	at org.apache.commons.codec.language.bm.PhoneticEngine.encode(PhoneticEngine.java:385)
	at org.apache.commons.codec.language.bm.BeiderMorseEncoder.encode(BeiderMorseEncoder.java:96)
	at org.apache.commons.codec.language.bm.BeiderMorseEncoderTest.assertNotEmpty(BeiderMorseEncoderTest.java:39)
	at org.apache.commons.codec.language.bm.BeiderMorseEncoderTest.testAsciiEncodeNotEmpty2Letters(BeiderMorseEncoderTest.java:85)

testSpeedCheck(org.apache.commons.codec.language.bm.BeiderMorseEncoderTest)  Time elapsed: 0.001 sec  <<< ERROR!
java.lang.StringIndexOutOfBoundsException: String index out of range: -1
	at java.lang.String.charAt(String.java:658)
	at org.apache.commons.codec.language.bm.Rule.endsWith(Rule.java:83)
	at org.apache.commons.codec.language.bm.Rule.access$200(Rule.java:24)
	at org.apache.commons.codec.language.bm.Rule$6.isMatch(Rule.java:160)
	at org.apache.commons.codec.language.bm.Rule.patternAndContextMatches(Rule.java:205)
	at org.apache.commons.codec.language.bm.PhoneticEngine$RulesApplication.invoke(PhoneticEngine.java:214)
	at org.apache.commons.codec.language.bm.PhoneticEngine.applyFinalRules(PhoneticEngine.java:346)
	at org.apache.commons.codec.language.bm.PhoneticEngine.encode(PhoneticEngine.java:477)
	at org.apache.commons.codec.language.bm.PhoneticEngine.encode(PhoneticEngine.java:385)
	at org.apache.commons.codec.language.bm.BeiderMorseEncoder.encode(BeiderMorseEncoder.java:96)
	at org.apache.commons.codec.language.bm.BeiderMorseEncoderTest.testSpeedCheck(BeiderMorseEncoderTest.java:199)

testSpeedCheck3(org.apache.commons.codec.language.bm.BeiderMorseEncoderTest)  Time elapsed: 0.001 sec  <<< ERROR!
java.lang.StringIndexOutOfBoundsException: String index out of range: -1
	at java.lang.String.charAt(String.java:658)
	at org.apache.commons.codec.language.bm.Rule.endsWith(Rule.java:83)
	at org.apache.commons.codec.language.bm.Rule.access$200(Rule.java:24)
	at org.apache.commons.codec.language.bm.Rule$6.isMatch(Rule.java:160)
	at org.apache.commons.codec.language.bm.Rule.patternAndContextMatches(Rule.java:205)
	at org.apache.commons.codec.language.bm.PhoneticEngine$RulesApplication.invoke(PhoneticEngine.java:214)
	at org.apache.commons.codec.language.bm.PhoneticEngine.applyFinalRules(PhoneticEngine.java:346)
	at org.apache.commons.codec.language.bm.PhoneticEngine.encode(PhoneticEngine.java:477)
	at org.apache.commons.codec.language.bm.PhoneticEngine.encode(PhoneticEngine.java:385)
	at org.apache.commons.codec.language.bm.BeiderMorseEncoder.encode(BeiderMorseEncoder.java:96)
	at org.apache.commons.codec.language.bm.BeiderMorseEncoder.encode(BeiderMorseEncoder.java:88)
	at org.apache.commons.codec.language.bm.BeiderMorseEncoderTest.testSpeedCheck3(BeiderMorseEncoderTest.java:220)

Running org.apache.commons.codec.language.bm.PhoneticEngineTest
Tests run: 8, Failures: 1, Errors: 0, Skipped: 0, Time elapsed: 0.016 sec <<< FAILURE! - in org.apache.commons.codec.language.bm.PhoneticEngineTest
testEncode[Renault-rinD|rinDlt|rina|rinalt|rino|rinolt|rinu|rinult-GENERIC-APPROX](org.apache.commons.codec.language.bm.PhoneticEngineTest)  Time elapsed: 0.001 sec  <<< FAILURE!
org.junit.ComparisonFailure: phoneme incorrect expected:<rinD[|rinDlt|rina|rinalt|rino|rinolt|rinu]|rinult> but was:<rinD[l|rinDlt|rinal|rinalt|rinol|rinolt|rinul]|rinult>
	at org.junit.Assert.assertEquals(Assert.java:115)
	at org.apache.commons.codec.language.bm.PhoneticEngineTest.testEncode(PhoneticEngineTest.java:88)

Running org.apache.commons.codec.language.bm.PhoneticEngineRegressionTest
Tests run: 4, Failures: 0, Errors: 0, Skipped: 0, Time elapsed: 0.023 sec - in org.apache.commons.codec.language.bm.PhoneticEngineRegressionTest
Running org.apache.commons.codec.language.bm.RuleTest
Tests run: 3, Failures: 0, Errors: 0, Skipped: 0, Time elapsed: 0.001 sec - in org.apache.commons.codec.language.bm.RuleTest
Running org.apache.commons.codec.language.bm.LanguageGuessingTest
Tests run: 18, Failures: 0, Errors: 0, Skipped: 0, Time elapsed: 0.012 sec - in org.apache.commons.codec.language.bm.LanguageGuessingTest
Running org.apache.commons.codec.language.DoubleMetaphoneTest
Tests run: 16, Failures: 0, Errors: 0, Skipped: 0, Time elapsed: 0.07 sec - in org.apache.commons.codec.language.DoubleMetaphoneTest
Running org.apache.commons.codec.language.SoundexTest
Tests run: 28, Failures: 0, Errors: 0, Skipped: 0, Time elapsed: 0.014 sec - in org.apache.commons.codec.language.SoundexTest
Running org.apache.commons.codec.language.RefinedSoundexTest
Tests run: 10, Failures: 0, Errors: 0, Skipped: 0, Time elapsed: 0.003 sec - in org.apache.commons.codec.language.RefinedSoundexTest
Running org.apache.commons.codec.language.MatchRatingApproachEncoderTest
Tests run: 96, Failures: 0, Errors: 0, Skipped: 0, Time elapsed: 0.039 sec - in org.apache.commons.codec.language.MatchRatingApproachEncoderTest
Running org.apache.commons.codec.language.ColognePhoneticTest
Tests run: 13, Failures: 0, Errors: 0, Skipped: 0, Time elapsed: 0.005 sec - in org.apache.commons.codec.language.ColognePhoneticTest
Running org.apache.commons.codec.language.DoubleMetaphone2Test
Tests run: 6, Failures: 0, Errors: 0, Skipped: 0, Time elapsed: 0.038 sec - in org.apache.commons.codec.language.DoubleMetaphone2Test
Running org.apache.commons.codec.language.MetaphoneTest
Tests run: 34, Failures: 0, Errors: 0, Skipped: 0, Time elapsed: 0.104 sec - in org.apache.commons.codec.language.MetaphoneTest
Running org.apache.commons.codec.CharEncodingTest
Tests run: 7, Failures: 0, Errors: 0, Skipped: 0, Time elapsed: 0.001 sec - in org.apache.commons.codec.CharEncodingTest

Results :

Failed tests: 
  PhoneticEngineTest.testEncode:88 phoneme incorrect expected:<rinD[|rinDlt|rina|rinalt|rino|rinolt|rinu]|rinult> but was:<rinD[l|rinDlt|rinal|rinalt|rinol|rinolt|rinul]|rinult>

Tests in error: 
  BeiderMorseEncoderTest.testAsciiEncodeNotEmpty1Letter:73->assertNotEmpty:39 » StringIndexOutOfBounds
  BeiderMorseEncoderTest.testAllChars:63 » StringIndexOutOfBounds String index o...
  BeiderMorseEncoderTest.testEncodeAtzNotEmpty:97->assertNotEmpty:39 » StringIndexOutOfBounds
  BeiderMorseEncoderTest.testAsciiEncodeNotEmpty2Letters:85->assertNotEmpty:39 » StringIndexOutOfBounds
  BeiderMorseEncoderTest.testSpeedCheck:199 » StringIndexOutOfBounds String inde...
  BeiderMorseEncoderTest.testSpeedCheck3:220 » StringIndexOutOfBounds String ind...

Tests run: 662, Failures: 1, Errors: 6, Skipped: 1

[INFO] ------------------------------------------------------------------------
[INFO] BUILD FAILURE
[INFO] ------------------------------------------------------------------------
[INFO] Total time: 11.398s
[INFO] Finished at: Sun Aug 02 13:20:55 BST 2015
[INFO] Final Memory: 23M/343M
[INFO] ------------------------------------------------------------------------
[ERROR] Failed to execute goal org.apache.maven.plugins:maven-surefire-plugin:2.17:test (default-test) on project commons-codec: There are test failures.
[ERROR] 
[ERROR] Please refer to /home/perham/Study/LittleDarwin/Cases/commons-codec-1.10-src/target/surefire-reports for the individual test results.
[ERROR] -> [Help 1]
[ERROR] 
[ERROR] To see the full stack trace of the errors, re-run Maven with the -e switch.
[ERROR] Re-run Maven using the -X switch to enable full debug logging.
[ERROR] 
[ERROR] For more information about the errors and possible solutions, please read the following articles:
[ERROR] [Help 1] http://cwiki.apache.org/confluence/display/MAVEN/MojoFailureException
