[INFO] Scanning for projects...
[INFO]                                                                         
[INFO] ------------------------------------------------------------------------
[INFO] Building Apache Commons Codec 1.10
[INFO] ------------------------------------------------------------------------
[INFO] 
[INFO] --- maven-enforcer-plugin:1.3.1:enforce (enforce-maven-3) @ commons-codec ---
[INFO] 
[INFO] --- maven-antrun-plugin:1.7:run (javadoc.resources) @ commons-codec ---
[INFO] Executing tasks

main:
[INFO] Executed tasks
[INFO] 
[INFO] --- maven-remote-resources-plugin:1.5:process (default) @ commons-codec ---
[INFO] 
[INFO] --- buildnumber-maven-plugin:1.3:create (default) @ commons-codec ---
[INFO] Executing: /bin/sh -c cd /home/perham/Study/LittleDarwin/Cases/commons-codec-1.10-src && svn --non-interactive info
[INFO] Working directory: /home/perham/Study/LittleDarwin/Cases/commons-codec-1.10-src
[INFO] Storing buildNumber: ?????? at timestamp: 1438517453394
[INFO] Executing: /bin/sh -c cd /home/perham/Study/LittleDarwin/Cases/commons-codec-1.10-src && svn --non-interactive info
[INFO] Working directory: /home/perham/Study/LittleDarwin/Cases/commons-codec-1.10-src
[INFO] Storing buildScmBranch: UNKNOWN_BRANCH
[INFO] 
[INFO] --- maven-resources-plugin:2.7:resources (default-resources) @ commons-codec ---
[INFO] Using 'UTF-8' encoding to copy filtered resources.
[INFO] Copying 128 resources
[INFO] Copying 2 resources to META-INF
[INFO] 
[INFO] --- maven-compiler-plugin:3.2:compile (default-compile) @ commons-codec ---
[INFO] Changes detected - recompiling the module!
[INFO] Compiling 60 source files to /home/perham/Study/LittleDarwin/Cases/commons-codec-1.10-src/target/classes
[INFO] /home/perham/Study/LittleDarwin/Cases/commons-codec-1.10-src/src/main/java/org/apache/commons/codec/digest/Sha2Crypt.java: Some input files use or override a deprecated API.
[INFO] /home/perham/Study/LittleDarwin/Cases/commons-codec-1.10-src/src/main/java/org/apache/commons/codec/digest/Sha2Crypt.java: Recompile with -Xlint:deprecation for details.
[INFO] 
[INFO] --- maven-bundle-plugin:2.5.3:manifest (bundle-manifest) @ commons-codec ---
[INFO] 
[INFO] --- maven-resources-plugin:2.7:testResources (default-testResources) @ commons-codec ---
[INFO] Using 'UTF-8' encoding to copy filtered resources.
[INFO] skip non existing resourceDirectory /home/perham/Study/LittleDarwin/Cases/commons-codec-1.10-src/src/test/resources
[INFO] Copying 2 resources to META-INF
[INFO] 
[INFO] --- maven-compiler-plugin:3.2:testCompile (default-testCompile) @ commons-codec ---
[INFO] Nothing to compile - all classes are up to date
[INFO] 
[INFO] --- maven-surefire-plugin:2.17:test (default-test) @ commons-codec ---
[INFO] Surefire report directory: /home/perham/Study/LittleDarwin/Cases/commons-codec-1.10-src/target/surefire-reports

-------------------------------------------------------
 T E S T S
-------------------------------------------------------
Running org.apache.commons.codec.digest.B64Test
Tests run: 2, Failures: 0, Errors: 0, Skipped: 0, Time elapsed: 0.019 sec - in org.apache.commons.codec.digest.B64Test
Running org.apache.commons.codec.digest.DigestUtilsTest
Tests run: 17, Failures: 0, Errors: 0, Skipped: 0, Time elapsed: 0.673 sec - in org.apache.commons.codec.digest.DigestUtilsTest
Running org.apache.commons.codec.digest.Sha512CryptTest
Tests run: 8, Failures: 0, Errors: 0, Skipped: 0, Time elapsed: 0.472 sec - in org.apache.commons.codec.digest.Sha512CryptTest
Running org.apache.commons.codec.digest.Apr1CryptTest
Tests run: 8, Failures: 0, Errors: 0, Skipped: 0, Time elapsed: 0.073 sec - in org.apache.commons.codec.digest.Apr1CryptTest
Running org.apache.commons.codec.digest.HmacUtilsTest
Tests run: 24, Failures: 0, Errors: 0, Skipped: 0, Time elapsed: 0.04 sec - in org.apache.commons.codec.digest.HmacUtilsTest
Running org.apache.commons.codec.digest.Sha2CryptTest
Tests run: 1, Failures: 0, Errors: 0, Skipped: 0, Time elapsed: 0.001 sec - in org.apache.commons.codec.digest.Sha2CryptTest
Running org.apache.commons.codec.digest.CryptTest
Tests run: 4, Failures: 0, Errors: 0, Skipped: 0, Time elapsed: 0.085 sec - in org.apache.commons.codec.digest.CryptTest
Running org.apache.commons.codec.digest.Sha256CryptTest
Tests run: 7, Failures: 0, Errors: 0, Skipped: 0, Time elapsed: 0.115 sec - in org.apache.commons.codec.digest.Sha256CryptTest
Running org.apache.commons.codec.digest.Md5CryptTest
Tests run: 7, Failures: 0, Errors: 0, Skipped: 0, Time elapsed: 0.022 sec - in org.apache.commons.codec.digest.Md5CryptTest
Running org.apache.commons.codec.digest.UnixCryptTest
Tests run: 9, Failures: 0, Errors: 0, Skipped: 0, Time elapsed: 0.006 sec - in org.apache.commons.codec.digest.UnixCryptTest
Running org.apache.commons.codec.CharsetsTest
Tests run: 7, Failures: 0, Errors: 0, Skipped: 0, Time elapsed: 0 sec - in org.apache.commons.codec.CharsetsTest
Running org.apache.commons.codec.binary.Base32Test
Tests run: 8, Failures: 0, Errors: 0, Skipped: 0, Time elapsed: 0.004 sec - in org.apache.commons.codec.binary.Base32Test
Running org.apache.commons.codec.binary.Base64OutputStreamTest
Tests run: 7, Failures: 0, Errors: 0, Skipped: 0, Time elapsed: 0.192 sec - in org.apache.commons.codec.binary.Base64OutputStreamTest
Running org.apache.commons.codec.binary.Base64Codec13Test
Tests run: 8, Failures: 0, Errors: 0, Skipped: 0, Time elapsed: 0.01 sec - in org.apache.commons.codec.binary.Base64Codec13Test
Running org.apache.commons.codec.binary.Base64InputStreamTest
Tests run: 19, Failures: 0, Errors: 0, Skipped: 0, Time elapsed: 0.117 sec - in org.apache.commons.codec.binary.Base64InputStreamTest
Running org.apache.commons.codec.binary.Base32InputStreamTest
Tests run: 16, Failures: 0, Errors: 0, Skipped: 0, Time elapsed: 0.122 sec - in org.apache.commons.codec.binary.Base32InputStreamTest
Running org.apache.commons.codec.binary.Base32OutputStreamTest
Tests run: 6, Failures: 0, Errors: 0, Skipped: 0, Time elapsed: 0.095 sec - in org.apache.commons.codec.binary.Base32OutputStreamTest
Running org.apache.commons.codec.binary.BinaryCodecTest
Tests run: 13, Failures: 0, Errors: 0, Skipped: 0, Time elapsed: 0.001 sec - in org.apache.commons.codec.binary.BinaryCodecTest
Running org.apache.commons.codec.binary.BaseNCodecTest
Tests run: 7, Failures: 0, Errors: 0, Skipped: 0, Time elapsed: 0.002 sec - in org.apache.commons.codec.binary.BaseNCodecTest
Running org.apache.commons.codec.binary.StringUtilsTest
Tests run: 17, Failures: 0, Errors: 0, Skipped: 0, Time elapsed: 0.03 sec - in org.apache.commons.codec.binary.StringUtilsTest
Running org.apache.commons.codec.binary.Base64Test
Tests run: 53, Failures: 0, Errors: 0, Skipped: 1, Time elapsed: 0.048 sec - in org.apache.commons.codec.binary.Base64Test
Running org.apache.commons.codec.binary.HexTest
Tests run: 19, Failures: 0, Errors: 0, Skipped: 0, Time elapsed: 0.177 sec - in org.apache.commons.codec.binary.HexTest
Running org.apache.commons.codec.DecoderExceptionTest
Tests run: 4, Failures: 0, Errors: 0, Skipped: 0, Time elapsed: 0 sec - in org.apache.commons.codec.DecoderExceptionTest
Running org.apache.commons.codec.EncoderExceptionTest
Tests run: 4, Failures: 0, Errors: 0, Skipped: 0, Time elapsed: 0.001 sec - in org.apache.commons.codec.EncoderExceptionTest
Running org.apache.commons.codec.net.BCodecTest
Tests run: 9, Failures: 0, Errors: 0, Skipped: 0, Time elapsed: 0.006 sec - in org.apache.commons.codec.net.BCodecTest
Running org.apache.commons.codec.net.QCodecTest
Tests run: 12, Failures: 0, Errors: 0, Skipped: 0, Time elapsed: 0.009 sec - in org.apache.commons.codec.net.QCodecTest
Running org.apache.commons.codec.net.UtilsTest
Tests run: 1, Failures: 0, Errors: 0, Skipped: 0, Time elapsed: 0 sec - in org.apache.commons.codec.net.UtilsTest
Running org.apache.commons.codec.net.RFC1522CodecTest
Tests run: 2, Failures: 0, Errors: 0, Skipped: 0, Time elapsed: 0 sec - in org.apache.commons.codec.net.RFC1522CodecTest
Running org.apache.commons.codec.net.URLCodecTest
Tests run: 16, Failures: 0, Errors: 0, Skipped: 0, Time elapsed: 0.007 sec - in org.apache.commons.codec.net.URLCodecTest
Running org.apache.commons.codec.net.QuotedPrintableCodecTest
Tests run: 21, Failures: 0, Errors: 0, Skipped: 0, Time elapsed: 0.01 sec - in org.apache.commons.codec.net.QuotedPrintableCodecTest
Running org.apache.commons.codec.StringEncoderComparatorTest
Tests run: 3, Failures: 0, Errors: 0, Skipped: 0, Time elapsed: 0.005 sec - in org.apache.commons.codec.StringEncoderComparatorTest
Running org.apache.commons.codec.language.Caverphone1Test
Tests run: 9, Failures: 0, Errors: 0, Skipped: 0, Time elapsed: 0.028 sec - in org.apache.commons.codec.language.Caverphone1Test
Running org.apache.commons.codec.language.NysiisTest
Tests run: 23, Failures: 0, Errors: 0, Skipped: 0, Time elapsed: 0.017 sec - in org.apache.commons.codec.language.NysiisTest
Running org.apache.commons.codec.language.Caverphone2Test
Tests run: 13, Failures: 0, Errors: 0, Skipped: 0, Time elapsed: 0.132 sec - in org.apache.commons.codec.language.Caverphone2Test
Running org.apache.commons.codec.language.DaitchMokotoffSoundexTest
Tests run: 13, Failures: 0, Errors: 0, Skipped: 0, Time elapsed: 0.053 sec - in org.apache.commons.codec.language.DaitchMokotoffSoundexTest
Running org.apache.commons.codec.language.bm.BeiderMorseEncoderTest
Tests run: 22, Failures: 0, Errors: 14, Skipped: 0, Time elapsed: 0.089 sec <<< FAILURE! - in org.apache.commons.codec.language.bm.BeiderMorseEncoderTest
testEncodeGna(org.apache.commons.codec.language.bm.BeiderMorseEncoderTest)  Time elapsed: 0.015 sec  <<< ERROR!
java.lang.ExceptionInInitializerError: null
	at java.lang.String.substring(String.java:1907)
	at org.apache.commons.codec.language.bm.Rule.stripQuotes(Rule.java:185)
	at org.apache.commons.codec.language.bm.Rule.parseRules(Rule.java:125)
	at org.apache.commons.codec.language.bm.Rule.parseRules(Rule.java:122)
	at org.apache.commons.codec.language.bm.Rule.<clinit>(Rule.java:62)
	at org.apache.commons.codec.language.bm.PhoneticEngine.encode(PhoneticEngine.java:399)
	at org.apache.commons.codec.language.bm.PhoneticEngine.encode(PhoneticEngine.java:385)
	at org.apache.commons.codec.language.bm.BeiderMorseEncoder.encode(BeiderMorseEncoder.java:96)
	at org.apache.commons.codec.language.bm.BeiderMorseEncoderTest.testEncodeGna(BeiderMorseEncoderTest.java:110)

testAsciiEncodeNotEmpty1Letter(org.apache.commons.codec.language.bm.BeiderMorseEncoderTest)  Time elapsed: 0 sec  <<< ERROR!
java.lang.NoClassDefFoundError: Could not initialize class org.apache.commons.codec.language.bm.Rule
	at org.apache.commons.codec.language.bm.PhoneticEngine.encode(PhoneticEngine.java:399)
	at org.apache.commons.codec.language.bm.PhoneticEngine.encode(PhoneticEngine.java:385)
	at org.apache.commons.codec.language.bm.BeiderMorseEncoder.encode(BeiderMorseEncoder.java:96)
	at org.apache.commons.codec.language.bm.BeiderMorseEncoderTest.assertNotEmpty(BeiderMorseEncoderTest.java:39)
	at org.apache.commons.codec.language.bm.BeiderMorseEncoderTest.testAsciiEncodeNotEmpty1Letter(BeiderMorseEncoderTest.java:73)

testAllChars(org.apache.commons.codec.language.bm.BeiderMorseEncoderTest)  Time elapsed: 0 sec  <<< ERROR!
java.lang.NoClassDefFoundError: Could not initialize class org.apache.commons.codec.language.bm.Rule
	at org.apache.commons.codec.language.bm.PhoneticEngine.encode(PhoneticEngine.java:399)
	at org.apache.commons.codec.language.bm.PhoneticEngine.encode(PhoneticEngine.java:385)
	at org.apache.commons.codec.language.bm.BeiderMorseEncoder.encode(BeiderMorseEncoder.java:96)
	at org.apache.commons.codec.language.bm.BeiderMorseEncoderTest.testAllChars(BeiderMorseEncoderTest.java:63)

testEncodeAtzNotEmpty(org.apache.commons.codec.language.bm.BeiderMorseEncoderTest)  Time elapsed: 0.001 sec  <<< ERROR!
java.lang.NoClassDefFoundError: Could not initialize class org.apache.commons.codec.language.bm.Rule
	at org.apache.commons.codec.language.bm.PhoneticEngine.encode(PhoneticEngine.java:399)
	at org.apache.commons.codec.language.bm.PhoneticEngine.encode(PhoneticEngine.java:385)
	at org.apache.commons.codec.language.bm.BeiderMorseEncoder.encode(BeiderMorseEncoder.java:96)
	at org.apache.commons.codec.language.bm.BeiderMorseEncoderTest.assertNotEmpty(BeiderMorseEncoderTest.java:39)
	at org.apache.commons.codec.language.bm.BeiderMorseEncoderTest.testEncodeAtzNotEmpty(BeiderMorseEncoderTest.java:97)

testOOM(org.apache.commons.codec.language.bm.BeiderMorseEncoderTest)  Time elapsed: 0.004 sec  <<< ERROR!
java.lang.NoClassDefFoundError: Could not initialize class org.apache.commons.codec.language.bm.Rule
	at org.apache.commons.codec.language.bm.PhoneticEngine.encode(PhoneticEngine.java:399)
	at org.apache.commons.codec.language.bm.PhoneticEngine.encode(PhoneticEngine.java:385)
	at org.apache.commons.codec.language.bm.BeiderMorseEncoder.encode(BeiderMorseEncoder.java:96)
	at org.apache.commons.codec.language.bm.BeiderMorseEncoderTest.testOOM(BeiderMorseEncoderTest.java:151)

testNegativeIndexForRuleMatchIndexOutOfBoundsException(org.apache.commons.codec.language.bm.BeiderMorseEncoderTest)  Time elapsed: 0.001 sec  <<< ERROR!
java.lang.Exception: Unexpected exception, expected<java.lang.IndexOutOfBoundsException> but was<java.lang.NoClassDefFoundError>
	at org.apache.commons.codec.language.bm.BeiderMorseEncoderTest.testNegativeIndexForRuleMatchIndexOutOfBoundsException(BeiderMorseEncoderTest.java:136)

testInvalidLangIllegalArgumentException(org.apache.commons.codec.language.bm.BeiderMorseEncoderTest)  Time elapsed: 0 sec  <<< ERROR!
java.lang.Exception: Unexpected exception, expected<java.lang.IllegalArgumentException> but was<java.lang.NoClassDefFoundError>
	at org.apache.commons.codec.language.bm.BeiderMorseEncoderTest.testInvalidLangIllegalArgumentException(BeiderMorseEncoderTest.java:115)

testAsciiEncodeNotEmpty2Letters(org.apache.commons.codec.language.bm.BeiderMorseEncoderTest)  Time elapsed: 0 sec  <<< ERROR!
java.lang.NoClassDefFoundError: Could not initialize class org.apache.commons.codec.language.bm.Rule
	at org.apache.commons.codec.language.bm.PhoneticEngine.encode(PhoneticEngine.java:399)
	at org.apache.commons.codec.language.bm.PhoneticEngine.encode(PhoneticEngine.java:385)
	at org.apache.commons.codec.language.bm.BeiderMorseEncoder.encode(BeiderMorseEncoder.java:96)
	at org.apache.commons.codec.language.bm.BeiderMorseEncoderTest.assertNotEmpty(BeiderMorseEncoderTest.java:39)
	at org.apache.commons.codec.language.bm.BeiderMorseEncoderTest.testAsciiEncodeNotEmpty2Letters(BeiderMorseEncoderTest.java:85)

testSpeedCheck(org.apache.commons.codec.language.bm.BeiderMorseEncoderTest)  Time elapsed: 0 sec  <<< ERROR!
java.lang.NoClassDefFoundError: Could not initialize class org.apache.commons.codec.language.bm.Rule
	at org.apache.commons.codec.language.bm.PhoneticEngine.encode(PhoneticEngine.java:399)
	at org.apache.commons.codec.language.bm.PhoneticEngine.encode(PhoneticEngine.java:385)
	at org.apache.commons.codec.language.bm.BeiderMorseEncoder.encode(BeiderMorseEncoder.java:96)
	at org.apache.commons.codec.language.bm.BeiderMorseEncoderTest.testSpeedCheck(BeiderMorseEncoderTest.java:199)

testSpeedCheck2(org.apache.commons.codec.language.bm.BeiderMorseEncoderTest)  Time elapsed: 0.001 sec  <<< ERROR!
java.lang.NoClassDefFoundError: Could not initialize class org.apache.commons.codec.language.bm.Rule
	at org.apache.commons.codec.language.bm.PhoneticEngine.encode(PhoneticEngine.java:399)
	at org.apache.commons.codec.language.bm.PhoneticEngine.encode(PhoneticEngine.java:385)
	at org.apache.commons.codec.language.bm.BeiderMorseEncoder.encode(BeiderMorseEncoder.java:96)
	at org.apache.commons.codec.language.bm.BeiderMorseEncoder.encode(BeiderMorseEncoder.java:88)
	at org.apache.commons.codec.language.bm.BeiderMorseEncoderTest.testSpeedCheck2(BeiderMorseEncoderTest.java:210)

testSpeedCheck3(org.apache.commons.codec.language.bm.BeiderMorseEncoderTest)  Time elapsed: 0.001 sec  <<< ERROR!
java.lang.NoClassDefFoundError: Could not initialize class org.apache.commons.codec.language.bm.Rule
	at org.apache.commons.codec.language.bm.PhoneticEngine.encode(PhoneticEngine.java:399)
	at org.apache.commons.codec.language.bm.PhoneticEngine.encode(PhoneticEngine.java:385)
	at org.apache.commons.codec.language.bm.BeiderMorseEncoder.encode(BeiderMorseEncoder.java:96)
	at org.apache.commons.codec.language.bm.BeiderMorseEncoder.encode(BeiderMorseEncoder.java:88)
	at org.apache.commons.codec.language.bm.BeiderMorseEncoderTest.testSpeedCheck3(BeiderMorseEncoderTest.java:220)

testLongestEnglishSurname(org.apache.commons.codec.language.bm.BeiderMorseEncoderTest)  Time elapsed: 0.002 sec  <<< ERROR!
java.lang.NoClassDefFoundError: Could not initialize class org.apache.commons.codec.language.bm.Rule
	at org.apache.commons.codec.language.bm.PhoneticEngine.encode(PhoneticEngine.java:399)
	at org.apache.commons.codec.language.bm.PhoneticEngine.encode(PhoneticEngine.java:385)
	at org.apache.commons.codec.language.bm.BeiderMorseEncoder.encode(BeiderMorseEncoder.java:96)
	at org.apache.commons.codec.language.bm.BeiderMorseEncoderTest.testLongestEnglishSurname(BeiderMorseEncoderTest.java:131)

testEncodeEmpty(org.apache.commons.codec.language.bm.BeiderMorseEncoderTest)  Time elapsed: 0.001 sec  <<< ERROR!
java.lang.NoClassDefFoundError: Could not initialize class org.apache.commons.codec.language.bm.Rule
	at org.apache.commons.codec.language.bm.PhoneticEngine.encode(PhoneticEngine.java:399)
	at org.apache.commons.codec.language.bm.PhoneticEngine.encode(PhoneticEngine.java:385)
	at org.apache.commons.codec.language.bm.BeiderMorseEncoder.encode(BeiderMorseEncoder.java:96)
	at org.apache.commons.codec.language.bm.BeiderMorseEncoder.encode(BeiderMorseEncoder.java:88)
	at org.apache.commons.codec.StringEncoderAbstractTest.testEncodeEmpty(StringEncoderAbstractTest.java:57)
	at sun.reflect.NativeMethodAccessorImpl.invoke0(Native Method)
	at sun.reflect.NativeMethodAccessorImpl.invoke(NativeMethodAccessorImpl.java:57)
	at sun.reflect.DelegatingMethodAccessorImpl.invoke(DelegatingMethodAccessorImpl.java:43)
	at java.lang.reflect.Method.invoke(Method.java:606)
	at org.junit.runners.model.FrameworkMethod$1.runReflectiveCall(FrameworkMethod.java:47)
	at org.junit.internal.runners.model.ReflectiveCallable.run(ReflectiveCallable.java:12)
	at org.junit.runners.model.FrameworkMethod.invokeExplosively(FrameworkMethod.java:44)
	at org.junit.internal.runners.statements.InvokeMethod.evaluate(InvokeMethod.java:17)
	at org.junit.runners.ParentRunner.runLeaf(ParentRunner.java:271)
	at org.junit.runners.BlockJUnit4ClassRunner.runChild(BlockJUnit4ClassRunner.java:70)
	at org.junit.runners.BlockJUnit4ClassRunner.runChild(BlockJUnit4ClassRunner.java:50)
	at org.junit.runners.ParentRunner$3.run(ParentRunner.java:238)
	at org.junit.runners.ParentRunner$1.schedule(ParentRunner.java:63)
	at org.junit.runners.ParentRunner.runChildren(ParentRunner.java:236)
	at org.junit.runners.ParentRunner.access$000(ParentRunner.java:53)
	at org.junit.runners.ParentRunner$2.evaluate(ParentRunner.java:229)
	at org.junit.runners.ParentRunner.run(ParentRunner.java:309)
	at org.apache.maven.surefire.junit4.JUnit4Provider.execute(JUnit4Provider.java:264)
	at org.apache.maven.surefire.junit4.JUnit4Provider.executeTestSet(JUnit4Provider.java:153)
	at org.apache.maven.surefire.junit4.JUnit4Provider.invoke(JUnit4Provider.java:124)
	at org.apache.maven.surefire.booter.ForkedBooter.invokeProviderInSameClassLoader(ForkedBooter.java:200)
	at org.apache.maven.surefire.booter.ForkedBooter.runSuitesInProcess(ForkedBooter.java:153)
	at org.apache.maven.surefire.booter.ForkedBooter.main(ForkedBooter.java:103)

testLocaleIndependence(org.apache.commons.codec.language.bm.BeiderMorseEncoderTest)  Time elapsed: 0.001 sec  <<< ERROR!
java.lang.NoClassDefFoundError: Could not initialize class org.apache.commons.codec.language.bm.Rule
	at org.apache.commons.codec.language.bm.PhoneticEngine.encode(PhoneticEngine.java:399)
	at org.apache.commons.codec.language.bm.PhoneticEngine.encode(PhoneticEngine.java:385)
	at org.apache.commons.codec.language.bm.BeiderMorseEncoder.encode(BeiderMorseEncoder.java:96)
	at org.apache.commons.codec.StringEncoderAbstractTest.testLocaleIndependence(StringEncoderAbstractTest.java:99)
	at sun.reflect.NativeMethodAccessorImpl.invoke0(Native Method)
	at sun.reflect.NativeMethodAccessorImpl.invoke(NativeMethodAccessorImpl.java:57)
	at sun.reflect.DelegatingMethodAccessorImpl.invoke(DelegatingMethodAccessorImpl.java:43)
	at java.lang.reflect.Method.invoke(Method.java:606)
	at org.junit.runners.model.FrameworkMethod$1.runReflectiveCall(FrameworkMethod.java:47)
	at org.junit.internal.runners.model.ReflectiveCallable.run(ReflectiveCallable.java:12)
	at org.junit.runners.model.FrameworkMethod.invokeExplosively(FrameworkMethod.java:44)
	at org.junit.internal.runners.statements.InvokeMethod.evaluate(InvokeMethod.java:17)
	at org.junit.runners.ParentRunner.runLeaf(ParentRunner.java:271)
	at org.junit.runners.BlockJUnit4ClassRunner.runChild(BlockJUnit4ClassRunner.java:70)
	at org.junit.runners.BlockJUnit4ClassRunner.runChild(BlockJUnit4ClassRunner.java:50)
	at org.junit.runners.ParentRunner$3.run(ParentRunner.java:238)
	at org.junit.runners.ParentRunner$1.schedule(ParentRunner.java:63)
	at org.junit.runners.ParentRunner.runChildren(ParentRunner.java:236)
	at org.junit.runners.ParentRunner.access$000(ParentRunner.java:53)
	at org.junit.runners.ParentRunner$2.evaluate(ParentRunner.java:229)
	at org.junit.runners.ParentRunner.run(ParentRunner.java:309)
	at org.apache.maven.surefire.junit4.JUnit4Provider.execute(JUnit4Provider.java:264)
	at org.apache.maven.surefire.junit4.JUnit4Provider.executeTestSet(JUnit4Provider.java:153)
	at org.apache.maven.surefire.junit4.JUnit4Provider.invoke(JUnit4Provider.java:124)
	at org.apache.maven.surefire.booter.ForkedBooter.invokeProviderInSameClassLoader(ForkedBooter.java:200)
	at org.apache.maven.surefire.booter.ForkedBooter.runSuitesInProcess(ForkedBooter.java:153)
	at org.apache.maven.surefire.booter.ForkedBooter.main(ForkedBooter.java:103)

Running org.apache.commons.codec.language.bm.PhoneticEngineTest
Tests run: 8, Failures: 0, Errors: 8, Skipped: 0, Time elapsed: 0.022 sec <<< FAILURE! - in org.apache.commons.codec.language.bm.PhoneticEngineTest
testEncode[Renault-rinD|rinDlt|rina|rinalt|rino|rinolt|rinu|rinult-GENERIC-APPROX](org.apache.commons.codec.language.bm.PhoneticEngineTest)  Time elapsed: 0.002 sec  <<< ERROR!
java.lang.NoClassDefFoundError: Could not initialize class org.apache.commons.codec.language.bm.Rule
	at org.apache.commons.codec.language.bm.PhoneticEngine.encode(PhoneticEngine.java:399)
	at org.apache.commons.codec.language.bm.PhoneticEngine.encode(PhoneticEngine.java:385)
	at org.apache.commons.codec.language.bm.PhoneticEngineTest.testEncode(PhoneticEngineTest.java:84)

testEncode[Renault-rYnDlt|rYnalt|rYnult|rinDlt|rinalt|rinolt|rinult-ASHKENAZI-APPROX](org.apache.commons.codec.language.bm.PhoneticEngineTest)  Time elapsed: 0.008 sec  <<< ERROR!
java.lang.NoClassDefFoundError: Could not initialize class org.apache.commons.codec.language.bm.Rule
	at org.apache.commons.codec.language.bm.PhoneticEngine.encode(PhoneticEngine.java:399)
	at org.apache.commons.codec.language.bm.PhoneticEngine.encode(PhoneticEngine.java:385)
	at org.apache.commons.codec.language.bm.PhoneticEngineTest.testEncode(PhoneticEngineTest.java:84)

testEncode[Renault-rinDlt-ASHKENAZI-APPROX](org.apache.commons.codec.language.bm.PhoneticEngineTest)  Time elapsed: 0.001 sec  <<< ERROR!
java.lang.NoClassDefFoundError: Could not initialize class org.apache.commons.codec.language.bm.Rule
	at org.apache.commons.codec.language.bm.PhoneticEngine.encode(PhoneticEngine.java:399)
	at org.apache.commons.codec.language.bm.PhoneticEngine.encode(PhoneticEngine.java:385)
	at org.apache.commons.codec.language.bm.PhoneticEngineTest.testEncode(PhoneticEngineTest.java:84)

testEncode[Renault-rinDlt-SEPHARDIC-APPROX](org.apache.commons.codec.language.bm.PhoneticEngineTest)  Time elapsed: 0 sec  <<< ERROR!
java.lang.NoClassDefFoundError: Could not initialize class org.apache.commons.codec.language.bm.Rule
	at org.apache.commons.codec.language.bm.PhoneticEngine.encode(PhoneticEngine.java:399)
	at org.apache.commons.codec.language.bm.PhoneticEngine.encode(PhoneticEngine.java:385)
	at org.apache.commons.codec.language.bm.PhoneticEngineTest.testEncode(PhoneticEngineTest.java:84)

testEncode[SntJohn-Smith-sntjonsmit-GENERIC-EXACT](org.apache.commons.codec.language.bm.PhoneticEngineTest)  Time elapsed: 0 sec  <<< ERROR!
java.lang.NoClassDefFoundError: Could not initialize class org.apache.commons.codec.language.bm.Rule
	at org.apache.commons.codec.language.bm.PhoneticEngine.encode(PhoneticEngine.java:399)
	at org.apache.commons.codec.language.bm.PhoneticEngine.encode(PhoneticEngine.java:385)
	at org.apache.commons.codec.language.bm.PhoneticEngineTest.testEncode(PhoneticEngineTest.java:84)

testEncode[d'ortley-(ortlaj|ortlej)-(dortlaj|dortlej)-GENERIC-EXACT](org.apache.commons.codec.language.bm.PhoneticEngineTest)  Time elapsed: 0 sec  <<< ERROR!
java.lang.NoClassDefFoundError: Could not initialize class org.apache.commons.codec.language.bm.Rule
	at org.apache.commons.codec.language.bm.PhoneticEngine.encode(PhoneticEngine.java:399)
	at org.apache.commons.codec.language.bm.PhoneticEngine.encode(PhoneticEngine.java:385)
	at org.apache.commons.codec.language.bm.PhoneticEngineTest.testEncode(PhoneticEngineTest.java:84)

testEncode[van helsing-(elSink|elsink|helSink|helsink|helzink|xelsink)-(banhelsink|fanhelsink|fanhelzink|vanhelsink|vanhelzink|vanjelsink)-GENERIC-EXACT](org.apache.commons.codec.language.bm.PhoneticEngineTest)  Time elapsed: 0 sec  <<< ERROR!
java.lang.NoClassDefFoundError: Could not initialize class org.apache.commons.codec.language.bm.Rule
	at org.apache.commons.codec.language.bm.PhoneticEngine.encode(PhoneticEngine.java:399)
	at org.apache.commons.codec.language.bm.PhoneticEngine.encode(PhoneticEngine.java:385)
	at org.apache.commons.codec.language.bm.PhoneticEngineTest.testEncode(PhoneticEngineTest.java:84)

testEncode[Judenburg-iudnbYrk|iudnbirk|iudnburk|xudnbirk|xudnburk|zudnbirk|zudnburk-GENERIC-APPROX](org.apache.commons.codec.language.bm.PhoneticEngineTest)  Time elapsed: 0 sec  <<< ERROR!
java.lang.NoClassDefFoundError: Could not initialize class org.apache.commons.codec.language.bm.Rule
	at org.apache.commons.codec.language.bm.PhoneticEngine.encode(PhoneticEngine.java:399)
	at org.apache.commons.codec.language.bm.PhoneticEngine.encode(PhoneticEngine.java:385)
	at org.apache.commons.codec.language.bm.PhoneticEngineTest.testEncode(PhoneticEngineTest.java:84)

Running org.apache.commons.codec.language.bm.PhoneticEngineRegressionTest
Tests run: 4, Failures: 0, Errors: 4, Skipped: 0, Time elapsed: 0.007 sec <<< FAILURE! - in org.apache.commons.codec.language.bm.PhoneticEngineRegressionTest
testSolrGENERIC(org.apache.commons.codec.language.bm.PhoneticEngineRegressionTest)  Time elapsed: 0.005 sec  <<< ERROR!
java.lang.NoClassDefFoundError: Could not initialize class org.apache.commons.codec.language.bm.Rule
	at org.apache.commons.codec.language.bm.PhoneticEngine.encode(PhoneticEngine.java:399)
	at org.apache.commons.codec.language.bm.PhoneticEngine.encode(PhoneticEngine.java:385)
	at org.apache.commons.codec.language.bm.PhoneticEngineRegressionTest.encode(PhoneticEngineRegressionTest.java:239)
	at org.apache.commons.codec.language.bm.PhoneticEngineRegressionTest.testSolrGENERIC(PhoneticEngineRegressionTest.java:43)

testSolrSEPHARDIC(org.apache.commons.codec.language.bm.PhoneticEngineRegressionTest)  Time elapsed: 0 sec  <<< ERROR!
java.lang.NoClassDefFoundError: Could not initialize class org.apache.commons.codec.language.bm.Rule
	at org.apache.commons.codec.language.bm.PhoneticEngine.encode(PhoneticEngine.java:399)
	at org.apache.commons.codec.language.bm.PhoneticEngine.encode(PhoneticEngine.java:385)
	at org.apache.commons.codec.language.bm.PhoneticEngineRegressionTest.encode(PhoneticEngineRegressionTest.java:239)
	at org.apache.commons.codec.language.bm.PhoneticEngineRegressionTest.testSolrSEPHARDIC(PhoneticEngineRegressionTest.java:138)

testCompatibilityWithOriginalVersion(org.apache.commons.codec.language.bm.PhoneticEngineRegressionTest)  Time elapsed: 0.001 sec  <<< ERROR!
java.lang.NoClassDefFoundError: Could not initialize class org.apache.commons.codec.language.bm.Rule
	at org.apache.commons.codec.language.bm.PhoneticEngine.encode(PhoneticEngine.java:399)
	at org.apache.commons.codec.language.bm.PhoneticEngine.encode(PhoneticEngine.java:385)
	at org.apache.commons.codec.language.bm.PhoneticEngineRegressionTest.encode(PhoneticEngineRegressionTest.java:239)
	at org.apache.commons.codec.language.bm.PhoneticEngineRegressionTest.testCompatibilityWithOriginalVersion(PhoneticEngineRegressionTest.java:189)

testSolrASHKENAZI(org.apache.commons.codec.language.bm.PhoneticEngineRegressionTest)  Time elapsed: 0.001 sec  <<< ERROR!
java.lang.NoClassDefFoundError: Could not initialize class org.apache.commons.codec.language.bm.Rule
	at org.apache.commons.codec.language.bm.PhoneticEngine.encode(PhoneticEngine.java:399)
	at org.apache.commons.codec.language.bm.PhoneticEngine.encode(PhoneticEngine.java:385)
	at org.apache.commons.codec.language.bm.PhoneticEngineRegressionTest.encode(PhoneticEngineRegressionTest.java:239)
	at org.apache.commons.codec.language.bm.PhoneticEngineRegressionTest.testSolrASHKENAZI(PhoneticEngineRegressionTest.java:89)

Running org.apache.commons.codec.language.bm.RuleTest
Tests run: 3, Failures: 0, Errors: 0, Skipped: 0, Time elapsed: 0.006 sec - in org.apache.commons.codec.language.bm.RuleTest
Running org.apache.commons.codec.language.bm.LanguageGuessingTest
Tests run: 18, Failures: 0, Errors: 0, Skipped: 0, Time elapsed: 0.027 sec - in org.apache.commons.codec.language.bm.LanguageGuessingTest
Running org.apache.commons.codec.language.DoubleMetaphoneTest
Tests run: 16, Failures: 0, Errors: 0, Skipped: 0, Time elapsed: 0.063 sec - in org.apache.commons.codec.language.DoubleMetaphoneTest
Running org.apache.commons.codec.language.SoundexTest
Tests run: 28, Failures: 0, Errors: 0, Skipped: 0, Time elapsed: 0.012 sec - in org.apache.commons.codec.language.SoundexTest
Running org.apache.commons.codec.language.RefinedSoundexTest
Tests run: 10, Failures: 0, Errors: 0, Skipped: 0, Time elapsed: 0.003 sec - in org.apache.commons.codec.language.RefinedSoundexTest
Running org.apache.commons.codec.language.MatchRatingApproachEncoderTest
Tests run: 96, Failures: 0, Errors: 0, Skipped: 0, Time elapsed: 0.049 sec - in org.apache.commons.codec.language.MatchRatingApproachEncoderTest
Running org.apache.commons.codec.language.ColognePhoneticTest
Tests run: 13, Failures: 0, Errors: 0, Skipped: 0, Time elapsed: 0.006 sec - in org.apache.commons.codec.language.ColognePhoneticTest
Running org.apache.commons.codec.language.DoubleMetaphone2Test
Tests run: 6, Failures: 0, Errors: 0, Skipped: 0, Time elapsed: 0.034 sec - in org.apache.commons.codec.language.DoubleMetaphone2Test
Running org.apache.commons.codec.language.MetaphoneTest
Tests run: 34, Failures: 0, Errors: 0, Skipped: 0, Time elapsed: 0.122 sec - in org.apache.commons.codec.language.MetaphoneTest
Running org.apache.commons.codec.CharEncodingTest
Tests run: 7, Failures: 0, Errors: 0, Skipped: 0, Time elapsed: 0.001 sec - in org.apache.commons.codec.CharEncodingTest

Results :

Tests in error: 
  BeiderMorseEncoderTest.testEncodeGna:110 » ExceptionInInitializer
  BeiderMorseEncoderTest.testAsciiEncodeNotEmpty1Letter:73->assertNotEmpty:39 » NoClassDefFound
  BeiderMorseEncoderTest.testAllChars:63 » NoClassDefFound Could not initialize ...
  BeiderMorseEncoderTest.testEncodeAtzNotEmpty:97->assertNotEmpty:39 » NoClassDefFound
  BeiderMorseEncoderTest.testOOM:151 » NoClassDefFound Could not initialize clas...
  BeiderMorseEncoderTest.testNegativeIndexForRuleMatchIndexOutOfBoundsException » 
  BeiderMorseEncoderTest.testInvalidLangIllegalArgumentException »  Unexpected e...
  BeiderMorseEncoderTest.testAsciiEncodeNotEmpty2Letters:85->assertNotEmpty:39 » NoClassDefFound
  BeiderMorseEncoderTest.testSpeedCheck:199 » NoClassDefFound Could not initiali...
  BeiderMorseEncoderTest.testSpeedCheck2:210 » NoClassDefFound Could not initial...
  BeiderMorseEncoderTest.testSpeedCheck3:220 » NoClassDefFound Could not initial...
  BeiderMorseEncoderTest.testLongestEnglishSurname:131 » NoClassDefFound Could n...
  BeiderMorseEncoderTest>StringEncoderAbstractTest.testEncodeEmpty:57 » NoClassDefFound
  BeiderMorseEncoderTest>StringEncoderAbstractTest.testLocaleIndependence:99 » NoClassDefFound
  PhoneticEngineTest.testEncode:84 » NoClassDefFound Could not initialize class ...
  PhoneticEngineTest.testEncode:84 » NoClassDefFound Could not initialize class ...
  PhoneticEngineTest.testEncode:84 » NoClassDefFound Could not initialize class ...
  PhoneticEngineTest.testEncode:84 » NoClassDefFound Could not initialize class ...
  PhoneticEngineTest.testEncode:84 » NoClassDefFound Could not initialize class ...
  PhoneticEngineTest.testEncode:84 » NoClassDefFound Could not initialize class ...
  PhoneticEngineTest.testEncode:84 » NoClassDefFound Could not initialize class ...
  PhoneticEngineTest.testEncode:84 » NoClassDefFound Could not initialize class ...
  PhoneticEngineRegressionTest.testSolrGENERIC:43->encode:239 » NoClassDefFound ...
  PhoneticEngineRegressionTest.testSolrSEPHARDIC:138->encode:239 » NoClassDefFound
  PhoneticEngineRegressionTest.testCompatibilityWithOriginalVersion:189->encode:239 » NoClassDefFound
  PhoneticEngineRegressionTest.testSolrASHKENAZI:89->encode:239 » NoClassDefFound

Tests run: 662, Failures: 0, Errors: 26, Skipped: 1

[INFO] ------------------------------------------------------------------------
[INFO] BUILD FAILURE
[INFO] ------------------------------------------------------------------------
[INFO] Total time: 10.563s
[INFO] Finished at: Sun Aug 02 13:11:01 BST 2015
[INFO] Final Memory: 20M/287M
[INFO] ------------------------------------------------------------------------
[ERROR] Failed to execute goal org.apache.maven.plugins:maven-surefire-plugin:2.17:test (default-test) on project commons-codec: There are test failures.
[ERROR] 
[ERROR] Please refer to /home/perham/Study/LittleDarwin/Cases/commons-codec-1.10-src/target/surefire-reports for the individual test results.
[ERROR] -> [Help 1]
[ERROR] 
[ERROR] To see the full stack trace of the errors, re-run Maven with the -e switch.
[ERROR] Re-run Maven using the -X switch to enable full debug logging.
[ERROR] 
[ERROR] For more information about the errors and possible solutions, please read the following articles:
[ERROR] [Help 1] http://cwiki.apache.org/confluence/display/MAVEN/MojoFailureException
