[INFO] Scanning for projects...
[INFO]                                                                         
[INFO] ------------------------------------------------------------------------
[INFO] Building Apache Commons Codec 1.10
[INFO] ------------------------------------------------------------------------
[INFO] 
[INFO] --- maven-enforcer-plugin:1.3.1:enforce (enforce-maven-3) @ commons-codec ---
[INFO] 
[INFO] --- maven-antrun-plugin:1.7:run (javadoc.resources) @ commons-codec ---
[INFO] Executing tasks

main:
[INFO] Executed tasks
[INFO] 
[INFO] --- maven-remote-resources-plugin:1.5:process (default) @ commons-codec ---
[INFO] 
[INFO] --- buildnumber-maven-plugin:1.3:create (default) @ commons-codec ---
[INFO] Executing: /bin/sh -c cd /home/perham/Study/LittleDarwin/Cases/commons-codec-1.10-src && svn --non-interactive info
[INFO] Working directory: /home/perham/Study/LittleDarwin/Cases/commons-codec-1.10-src
[INFO] Storing buildNumber: ?????? at timestamp: 1438516763138
[INFO] Executing: /bin/sh -c cd /home/perham/Study/LittleDarwin/Cases/commons-codec-1.10-src && svn --non-interactive info
[INFO] Working directory: /home/perham/Study/LittleDarwin/Cases/commons-codec-1.10-src
[INFO] Storing buildScmBranch: UNKNOWN_BRANCH
[INFO] 
[INFO] --- maven-resources-plugin:2.7:resources (default-resources) @ commons-codec ---
[INFO] Using 'UTF-8' encoding to copy filtered resources.
[INFO] Copying 128 resources
[INFO] Copying 2 resources to META-INF
[INFO] 
[INFO] --- maven-compiler-plugin:3.2:compile (default-compile) @ commons-codec ---
[INFO] Changes detected - recompiling the module!
[INFO] Compiling 60 source files to /home/perham/Study/LittleDarwin/Cases/commons-codec-1.10-src/target/classes
[INFO] /home/perham/Study/LittleDarwin/Cases/commons-codec-1.10-src/src/main/java/org/apache/commons/codec/digest/Sha2Crypt.java: Some input files use or override a deprecated API.
[INFO] /home/perham/Study/LittleDarwin/Cases/commons-codec-1.10-src/src/main/java/org/apache/commons/codec/digest/Sha2Crypt.java: Recompile with -Xlint:deprecation for details.
[INFO] 
[INFO] --- maven-bundle-plugin:2.5.3:manifest (bundle-manifest) @ commons-codec ---
[INFO] 
[INFO] --- maven-resources-plugin:2.7:testResources (default-testResources) @ commons-codec ---
[INFO] Using 'UTF-8' encoding to copy filtered resources.
[INFO] skip non existing resourceDirectory /home/perham/Study/LittleDarwin/Cases/commons-codec-1.10-src/src/test/resources
[INFO] Copying 2 resources to META-INF
[INFO] 
[INFO] --- maven-compiler-plugin:3.2:testCompile (default-testCompile) @ commons-codec ---
[INFO] Nothing to compile - all classes are up to date
[INFO] 
[INFO] --- maven-surefire-plugin:2.17:test (default-test) @ commons-codec ---
[INFO] Surefire report directory: /home/perham/Study/LittleDarwin/Cases/commons-codec-1.10-src/target/surefire-reports

-------------------------------------------------------
 T E S T S
-------------------------------------------------------
Running org.apache.commons.codec.digest.B64Test
Tests run: 2, Failures: 0, Errors: 0, Skipped: 0, Time elapsed: 0.026 sec - in org.apache.commons.codec.digest.B64Test
Running org.apache.commons.codec.digest.DigestUtilsTest
Tests run: 17, Failures: 0, Errors: 0, Skipped: 0, Time elapsed: 0.675 sec - in org.apache.commons.codec.digest.DigestUtilsTest
Running org.apache.commons.codec.digest.Sha512CryptTest
Tests run: 8, Failures: 0, Errors: 0, Skipped: 0, Time elapsed: 0.485 sec - in org.apache.commons.codec.digest.Sha512CryptTest
Running org.apache.commons.codec.digest.Apr1CryptTest
Tests run: 8, Failures: 0, Errors: 0, Skipped: 0, Time elapsed: 0.072 sec - in org.apache.commons.codec.digest.Apr1CryptTest
Running org.apache.commons.codec.digest.HmacUtilsTest
Tests run: 24, Failures: 0, Errors: 0, Skipped: 0, Time elapsed: 0.038 sec - in org.apache.commons.codec.digest.HmacUtilsTest
Running org.apache.commons.codec.digest.Sha2CryptTest
Tests run: 1, Failures: 0, Errors: 0, Skipped: 0, Time elapsed: 0 sec - in org.apache.commons.codec.digest.Sha2CryptTest
Running org.apache.commons.codec.digest.CryptTest
Tests run: 4, Failures: 0, Errors: 0, Skipped: 0, Time elapsed: 0.085 sec - in org.apache.commons.codec.digest.CryptTest
Running org.apache.commons.codec.digest.Sha256CryptTest
Tests run: 7, Failures: 0, Errors: 0, Skipped: 0, Time elapsed: 0.111 sec - in org.apache.commons.codec.digest.Sha256CryptTest
Running org.apache.commons.codec.digest.Md5CryptTest
Tests run: 7, Failures: 0, Errors: 0, Skipped: 0, Time elapsed: 0.02 sec - in org.apache.commons.codec.digest.Md5CryptTest
Running org.apache.commons.codec.digest.UnixCryptTest
Tests run: 9, Failures: 0, Errors: 0, Skipped: 0, Time elapsed: 0.007 sec - in org.apache.commons.codec.digest.UnixCryptTest
Running org.apache.commons.codec.CharsetsTest
Tests run: 7, Failures: 0, Errors: 0, Skipped: 0, Time elapsed: 0.001 sec - in org.apache.commons.codec.CharsetsTest
Running org.apache.commons.codec.binary.Base32Test
Tests run: 8, Failures: 0, Errors: 0, Skipped: 0, Time elapsed: 0.008 sec - in org.apache.commons.codec.binary.Base32Test
Running org.apache.commons.codec.binary.Base64OutputStreamTest
Tests run: 7, Failures: 0, Errors: 0, Skipped: 0, Time elapsed: 0.192 sec - in org.apache.commons.codec.binary.Base64OutputStreamTest
Running org.apache.commons.codec.binary.Base64Codec13Test
Tests run: 8, Failures: 0, Errors: 0, Skipped: 0, Time elapsed: 0.01 sec - in org.apache.commons.codec.binary.Base64Codec13Test
Running org.apache.commons.codec.binary.Base64InputStreamTest
Tests run: 19, Failures: 0, Errors: 0, Skipped: 0, Time elapsed: 0.103 sec - in org.apache.commons.codec.binary.Base64InputStreamTest
Running org.apache.commons.codec.binary.Base32InputStreamTest
Tests run: 16, Failures: 0, Errors: 0, Skipped: 0, Time elapsed: 0.125 sec - in org.apache.commons.codec.binary.Base32InputStreamTest
Running org.apache.commons.codec.binary.Base32OutputStreamTest
Tests run: 6, Failures: 0, Errors: 0, Skipped: 0, Time elapsed: 0.083 sec - in org.apache.commons.codec.binary.Base32OutputStreamTest
Running org.apache.commons.codec.binary.BinaryCodecTest
Tests run: 13, Failures: 0, Errors: 0, Skipped: 0, Time elapsed: 0.002 sec - in org.apache.commons.codec.binary.BinaryCodecTest
Running org.apache.commons.codec.binary.BaseNCodecTest
Tests run: 7, Failures: 0, Errors: 0, Skipped: 0, Time elapsed: 0.001 sec - in org.apache.commons.codec.binary.BaseNCodecTest
Running org.apache.commons.codec.binary.StringUtilsTest
Tests run: 17, Failures: 0, Errors: 0, Skipped: 0, Time elapsed: 0.028 sec - in org.apache.commons.codec.binary.StringUtilsTest
Running org.apache.commons.codec.binary.Base64Test
Tests run: 53, Failures: 0, Errors: 0, Skipped: 1, Time elapsed: 0.043 sec - in org.apache.commons.codec.binary.Base64Test
Running org.apache.commons.codec.binary.HexTest
Tests run: 19, Failures: 0, Errors: 0, Skipped: 0, Time elapsed: 0.183 sec - in org.apache.commons.codec.binary.HexTest
Running org.apache.commons.codec.DecoderExceptionTest
Tests run: 4, Failures: 0, Errors: 0, Skipped: 0, Time elapsed: 0.001 sec - in org.apache.commons.codec.DecoderExceptionTest
Running org.apache.commons.codec.EncoderExceptionTest
Tests run: 4, Failures: 0, Errors: 0, Skipped: 0, Time elapsed: 0.001 sec - in org.apache.commons.codec.EncoderExceptionTest
Running org.apache.commons.codec.net.BCodecTest
Tests run: 9, Failures: 0, Errors: 0, Skipped: 0, Time elapsed: 0.004 sec - in org.apache.commons.codec.net.BCodecTest
Running org.apache.commons.codec.net.QCodecTest
Tests run: 12, Failures: 0, Errors: 0, Skipped: 0, Time elapsed: 0.007 sec - in org.apache.commons.codec.net.QCodecTest
Running org.apache.commons.codec.net.UtilsTest
Tests run: 1, Failures: 0, Errors: 0, Skipped: 0, Time elapsed: 0 sec - in org.apache.commons.codec.net.UtilsTest
Running org.apache.commons.codec.net.RFC1522CodecTest
Tests run: 2, Failures: 0, Errors: 0, Skipped: 0, Time elapsed: 0 sec - in org.apache.commons.codec.net.RFC1522CodecTest
Running org.apache.commons.codec.net.URLCodecTest
Tests run: 16, Failures: 0, Errors: 0, Skipped: 0, Time elapsed: 0.007 sec - in org.apache.commons.codec.net.URLCodecTest
Running org.apache.commons.codec.net.QuotedPrintableCodecTest
Tests run: 21, Failures: 0, Errors: 0, Skipped: 0, Time elapsed: 0.01 sec - in org.apache.commons.codec.net.QuotedPrintableCodecTest
Running org.apache.commons.codec.StringEncoderComparatorTest
Tests run: 3, Failures: 0, Errors: 1, Skipped: 0, Time elapsed: 0.015 sec <<< FAILURE! - in org.apache.commons.codec.StringEncoderComparatorTest
testComparatorWithSoundex(org.apache.commons.codec.StringEncoderComparatorTest)  Time elapsed: 0.012 sec  <<< ERROR!
java.lang.StringIndexOutOfBoundsException: String index out of range: -1
	at java.lang.String.charAt(String.java:658)
	at org.apache.commons.codec.language.SoundexUtils.clean(SoundexUtils.java:17)
	at org.apache.commons.codec.language.Soundex.soundex(Soundex.java:262)
	at org.apache.commons.codec.language.Soundex.encode(Soundex.java:153)
	at org.apache.commons.codec.StringEncoderComparator.compare(StringEncoderComparator.java:82)
	at org.apache.commons.codec.StringEncoderComparatorTest.testComparatorWithSoundex(StringEncoderComparatorTest.java:43)

Running org.apache.commons.codec.language.Caverphone1Test
Tests run: 9, Failures: 0, Errors: 0, Skipped: 0, Time elapsed: 0.027 sec - in org.apache.commons.codec.language.Caverphone1Test
Running org.apache.commons.codec.language.NysiisTest
Tests run: 23, Failures: 0, Errors: 21, Skipped: 0, Time elapsed: 0.018 sec <<< FAILURE! - in org.apache.commons.codec.language.NysiisTest
testRule4Dot1(org.apache.commons.codec.language.NysiisTest)  Time elapsed: 0 sec  <<< ERROR!
java.lang.StringIndexOutOfBoundsException: String index out of range: -1
	at java.lang.String.charAt(String.java:658)
	at org.apache.commons.codec.language.SoundexUtils.clean(SoundexUtils.java:17)
	at org.apache.commons.codec.language.Nysiis.nysiis(Nysiis.java:253)
	at org.apache.commons.codec.language.Nysiis.encode(Nysiis.java:228)
	at org.apache.commons.codec.language.NysiisTest.assertEncodings(NysiisTest.java:46)
	at org.apache.commons.codec.language.NysiisTest.testRule4Dot1(NysiisTest.java:209)

testRule4Dot2(org.apache.commons.codec.language.NysiisTest)  Time elapsed: 0.001 sec  <<< ERROR!
java.lang.StringIndexOutOfBoundsException: String index out of range: -1
	at java.lang.String.charAt(String.java:658)
	at org.apache.commons.codec.language.SoundexUtils.clean(SoundexUtils.java:17)
	at org.apache.commons.codec.language.Nysiis.nysiis(Nysiis.java:253)
	at org.apache.commons.codec.language.Nysiis.encode(Nysiis.java:228)
	at org.apache.commons.codec.language.NysiisTest.assertEncodings(NysiisTest.java:46)
	at org.apache.commons.codec.language.NysiisTest.testRule4Dot2(NysiisTest.java:225)

testCap(org.apache.commons.codec.language.NysiisTest)  Time elapsed: 0 sec  <<< ERROR!
java.lang.StringIndexOutOfBoundsException: String index out of range: -1
	at java.lang.String.charAt(String.java:658)
	at org.apache.commons.codec.language.SoundexUtils.clean(SoundexUtils.java:17)
	at org.apache.commons.codec.language.Nysiis.nysiis(Nysiis.java:253)
	at org.apache.commons.codec.language.Nysiis.encode(Nysiis.java:228)
	at org.apache.commons.codec.language.NysiisTest.encodeAll(NysiisTest.java:57)
	at org.apache.commons.codec.language.NysiisTest.testCap(NysiisTest.java:68)

testDad(org.apache.commons.codec.language.NysiisTest)  Time elapsed: 0.001 sec  <<< ERROR!
java.lang.StringIndexOutOfBoundsException: String index out of range: -1
	at java.lang.String.charAt(String.java:658)
	at org.apache.commons.codec.language.SoundexUtils.clean(SoundexUtils.java:17)
	at org.apache.commons.codec.language.Nysiis.nysiis(Nysiis.java:253)
	at org.apache.commons.codec.language.Nysiis.encode(Nysiis.java:228)
	at org.apache.commons.codec.language.NysiisTest.encodeAll(NysiisTest.java:57)
	at org.apache.commons.codec.language.NysiisTest.testDad(NysiisTest.java:75)

testDan(org.apache.commons.codec.language.NysiisTest)  Time elapsed: 0 sec  <<< ERROR!
java.lang.StringIndexOutOfBoundsException: String index out of range: -1
	at java.lang.String.charAt(String.java:658)
	at org.apache.commons.codec.language.SoundexUtils.clean(SoundexUtils.java:17)
	at org.apache.commons.codec.language.Nysiis.nysiis(Nysiis.java:253)
	at org.apache.commons.codec.language.Nysiis.encode(Nysiis.java:228)
	at org.apache.commons.codec.language.NysiisTest.encodeAll(NysiisTest.java:57)
	at org.apache.commons.codec.language.NysiisTest.testDan(NysiisTest.java:80)

testFal(org.apache.commons.codec.language.NysiisTest)  Time elapsed: 0 sec  <<< ERROR!
java.lang.StringIndexOutOfBoundsException: String index out of range: -1
	at java.lang.String.charAt(String.java:658)
	at org.apache.commons.codec.language.SoundexUtils.clean(SoundexUtils.java:17)
	at org.apache.commons.codec.language.Nysiis.nysiis(Nysiis.java:253)
	at org.apache.commons.codec.language.Nysiis.encode(Nysiis.java:228)
	at org.apache.commons.codec.language.NysiisTest.encodeAll(NysiisTest.java:57)
	at org.apache.commons.codec.language.NysiisTest.testFal(NysiisTest.java:149)

testRule1(org.apache.commons.codec.language.NysiisTest)  Time elapsed: 0.001 sec  <<< ERROR!
java.lang.StringIndexOutOfBoundsException: String index out of range: -1
	at java.lang.String.charAt(String.java:658)
	at org.apache.commons.codec.language.SoundexUtils.clean(SoundexUtils.java:17)
	at org.apache.commons.codec.language.Nysiis.nysiis(Nysiis.java:253)
	at org.apache.commons.codec.language.Nysiis.encode(Nysiis.java:228)
	at org.apache.commons.codec.language.NysiisTest.assertEncodings(NysiisTest.java:46)
	at org.apache.commons.codec.language.NysiisTest.testRule1(NysiisTest.java:176)

testRule2(org.apache.commons.codec.language.NysiisTest)  Time elapsed: 0 sec  <<< ERROR!
java.lang.StringIndexOutOfBoundsException: String index out of range: -1
	at java.lang.String.charAt(String.java:658)
	at org.apache.commons.codec.language.SoundexUtils.clean(SoundexUtils.java:17)
	at org.apache.commons.codec.language.Nysiis.nysiis(Nysiis.java:253)
	at org.apache.commons.codec.language.Nysiis.encode(Nysiis.java:228)
	at org.apache.commons.codec.language.NysiisTest.assertEncodings(NysiisTest.java:46)
	at org.apache.commons.codec.language.NysiisTest.testRule2(NysiisTest.java:192)

testRule5(org.apache.commons.codec.language.NysiisTest)  Time elapsed: 0.001 sec  <<< ERROR!
java.lang.StringIndexOutOfBoundsException: String index out of range: -1
	at java.lang.String.charAt(String.java:658)
	at org.apache.commons.codec.language.SoundexUtils.clean(SoundexUtils.java:17)
	at org.apache.commons.codec.language.Nysiis.nysiis(Nysiis.java:253)
	at org.apache.commons.codec.language.Nysiis.encode(Nysiis.java:228)
	at org.apache.commons.codec.language.NysiisTest.assertEncodings(NysiisTest.java:46)
	at org.apache.commons.codec.language.NysiisTest.testRule5(NysiisTest.java:238)

testRule6(org.apache.commons.codec.language.NysiisTest)  Time elapsed: 0 sec  <<< ERROR!
java.lang.StringIndexOutOfBoundsException: String index out of range: -1
	at java.lang.String.charAt(String.java:658)
	at org.apache.commons.codec.language.SoundexUtils.clean(SoundexUtils.java:17)
	at org.apache.commons.codec.language.Nysiis.nysiis(Nysiis.java:253)
	at org.apache.commons.codec.language.Nysiis.encode(Nysiis.java:228)
	at org.apache.commons.codec.language.NysiisTest.assertEncodings(NysiisTest.java:46)
	at org.apache.commons.codec.language.NysiisTest.testRule6(NysiisTest.java:250)

testRule7(org.apache.commons.codec.language.NysiisTest)  Time elapsed: 0 sec  <<< ERROR!
java.lang.StringIndexOutOfBoundsException: String index out of range: -1
	at java.lang.String.charAt(String.java:658)
	at org.apache.commons.codec.language.SoundexUtils.clean(SoundexUtils.java:17)
	at org.apache.commons.codec.language.Nysiis.nysiis(Nysiis.java:253)
	at org.apache.commons.codec.language.Nysiis.encode(Nysiis.java:228)
	at org.apache.commons.codec.language.NysiisTest.assertEncodings(NysiisTest.java:46)
	at org.apache.commons.codec.language.NysiisTest.testRule7(NysiisTest.java:262)

testBran(org.apache.commons.codec.language.NysiisTest)  Time elapsed: 0.001 sec  <<< ERROR!
java.lang.StringIndexOutOfBoundsException: String index out of range: -1
	at java.lang.String.charAt(String.java:658)
	at org.apache.commons.codec.language.SoundexUtils.clean(SoundexUtils.java:17)
	at org.apache.commons.codec.language.Nysiis.nysiis(Nysiis.java:253)
	at org.apache.commons.codec.language.Nysiis.encode(Nysiis.java:228)
	at org.apache.commons.codec.language.NysiisTest.encodeAll(NysiisTest.java:57)
	at org.apache.commons.codec.language.NysiisTest.testBran(NysiisTest.java:63)

testSnad(org.apache.commons.codec.language.NysiisTest)  Time elapsed: 0.001 sec  <<< ERROR!
java.lang.StringIndexOutOfBoundsException: String index out of range: -1
	at java.lang.String.charAt(String.java:658)
	at org.apache.commons.codec.language.SoundexUtils.clean(SoundexUtils.java:17)
	at org.apache.commons.codec.language.Nysiis.nysiis(Nysiis.java:253)
	at org.apache.commons.codec.language.Nysiis.encode(Nysiis.java:228)
	at org.apache.commons.codec.language.NysiisTest.encodeAll(NysiisTest.java:57)
	at org.apache.commons.codec.language.NysiisTest.testSnad(NysiisTest.java:270)

testSnat(org.apache.commons.codec.language.NysiisTest)  Time elapsed: 0 sec  <<< ERROR!
java.lang.StringIndexOutOfBoundsException: String index out of range: -1
	at java.lang.String.charAt(String.java:658)
	at org.apache.commons.codec.language.SoundexUtils.clean(SoundexUtils.java:17)
	at org.apache.commons.codec.language.Nysiis.nysiis(Nysiis.java:253)
	at org.apache.commons.codec.language.Nysiis.encode(Nysiis.java:228)
	at org.apache.commons.codec.language.NysiisTest.encodeAll(NysiisTest.java:57)
	at org.apache.commons.codec.language.NysiisTest.testSnat(NysiisTest.java:275)

testTrueVariant(org.apache.commons.codec.language.NysiisTest)  Time elapsed: 0 sec  <<< ERROR!
java.lang.StringIndexOutOfBoundsException: String index out of range: -1
	at java.lang.String.charAt(String.java:658)
	at org.apache.commons.codec.language.SoundexUtils.clean(SoundexUtils.java:17)
	at org.apache.commons.codec.language.Nysiis.nysiis(Nysiis.java:253)
	at org.apache.commons.codec.language.Nysiis.encode(Nysiis.java:228)
	at org.apache.commons.codec.language.NysiisTest.testTrueVariant(NysiisTest.java:298)

testDropBy(org.apache.commons.codec.language.NysiisTest)  Time elapsed: 0 sec  <<< ERROR!
java.lang.StringIndexOutOfBoundsException: String index out of range: -1
	at java.lang.String.charAt(String.java:658)
	at org.apache.commons.codec.language.SoundexUtils.clean(SoundexUtils.java:17)
	at org.apache.commons.codec.language.Nysiis.nysiis(Nysiis.java:253)
	at org.apache.commons.codec.language.Nysiis.encode(Nysiis.java:228)
	at org.apache.commons.codec.language.NysiisTest.assertEncodings(NysiisTest.java:46)
	at org.apache.commons.codec.language.NysiisTest.testDropBy(NysiisTest.java:95)

testOthers(org.apache.commons.codec.language.NysiisTest)  Time elapsed: 0 sec  <<< ERROR!
java.lang.StringIndexOutOfBoundsException: String index out of range: -1
	at java.lang.String.charAt(String.java:658)
	at org.apache.commons.codec.language.SoundexUtils.clean(SoundexUtils.java:17)
	at org.apache.commons.codec.language.Nysiis.nysiis(Nysiis.java:253)
	at org.apache.commons.codec.language.Nysiis.encode(Nysiis.java:228)
	at org.apache.commons.codec.language.NysiisTest.assertEncodings(NysiisTest.java:46)
	at org.apache.commons.codec.language.NysiisTest.testOthers(NysiisTest.java:159)

testTranan(org.apache.commons.codec.language.NysiisTest)  Time elapsed: 0.001 sec  <<< ERROR!
java.lang.StringIndexOutOfBoundsException: String index out of range: -1
	at java.lang.String.charAt(String.java:658)
	at org.apache.commons.codec.language.SoundexUtils.clean(SoundexUtils.java:17)
	at org.apache.commons.codec.language.Nysiis.nysiis(Nysiis.java:253)
	at org.apache.commons.codec.language.Nysiis.encode(Nysiis.java:228)
	at org.apache.commons.codec.language.NysiisTest.encodeAll(NysiisTest.java:57)
	at org.apache.commons.codec.language.NysiisTest.testTranan(NysiisTest.java:291)

testSpecialBranches(org.apache.commons.codec.language.NysiisTest)  Time elapsed: 0 sec  <<< ERROR!
java.lang.StringIndexOutOfBoundsException: String index out of range: -1
	at java.lang.String.charAt(String.java:658)
	at org.apache.commons.codec.language.SoundexUtils.clean(SoundexUtils.java:17)
	at org.apache.commons.codec.language.Nysiis.nysiis(Nysiis.java:253)
	at org.apache.commons.codec.language.Nysiis.encode(Nysiis.java:228)
	at org.apache.commons.codec.language.NysiisTest.encodeAll(NysiisTest.java:57)
	at org.apache.commons.codec.language.NysiisTest.testSpecialBranches(NysiisTest.java:280)

testEncodeEmpty(org.apache.commons.codec.language.NysiisTest)  Time elapsed: 0.001 sec  <<< ERROR!
java.lang.StringIndexOutOfBoundsException: String index out of range: -1
	at java.lang.String.charAt(String.java:658)
	at org.apache.commons.codec.language.SoundexUtils.clean(SoundexUtils.java:17)
	at org.apache.commons.codec.language.Nysiis.nysiis(Nysiis.java:253)
	at org.apache.commons.codec.language.Nysiis.encode(Nysiis.java:214)
	at org.apache.commons.codec.StringEncoderAbstractTest.testEncodeEmpty(StringEncoderAbstractTest.java:58)
	at sun.reflect.NativeMethodAccessorImpl.invoke0(Native Method)
	at sun.reflect.NativeMethodAccessorImpl.invoke(NativeMethodAccessorImpl.java:57)
	at sun.reflect.DelegatingMethodAccessorImpl.invoke(DelegatingMethodAccessorImpl.java:43)
	at java.lang.reflect.Method.invoke(Method.java:606)
	at org.junit.runners.model.FrameworkMethod$1.runReflectiveCall(FrameworkMethod.java:47)
	at org.junit.internal.runners.model.ReflectiveCallable.run(ReflectiveCallable.java:12)
	at org.junit.runners.model.FrameworkMethod.invokeExplosively(FrameworkMethod.java:44)
	at org.junit.internal.runners.statements.InvokeMethod.evaluate(InvokeMethod.java:17)
	at org.junit.runners.ParentRunner.runLeaf(ParentRunner.java:271)
	at org.junit.runners.BlockJUnit4ClassRunner.runChild(BlockJUnit4ClassRunner.java:70)
	at org.junit.runners.BlockJUnit4ClassRunner.runChild(BlockJUnit4ClassRunner.java:50)
	at org.junit.runners.ParentRunner$3.run(ParentRunner.java:238)
	at org.junit.runners.ParentRunner$1.schedule(ParentRunner.java:63)
	at org.junit.runners.ParentRunner.runChildren(ParentRunner.java:236)
	at org.junit.runners.ParentRunner.access$000(ParentRunner.java:53)
	at org.junit.runners.ParentRunner$2.evaluate(ParentRunner.java:229)
	at org.junit.runners.ParentRunner.run(ParentRunner.java:309)
	at org.apache.maven.surefire.junit4.JUnit4Provider.execute(JUnit4Provider.java:264)
	at org.apache.maven.surefire.junit4.JUnit4Provider.executeTestSet(JUnit4Provider.java:153)
	at org.apache.maven.surefire.junit4.JUnit4Provider.invoke(JUnit4Provider.java:124)
	at org.apache.maven.surefire.booter.ForkedBooter.invokeProviderInSameClassLoader(ForkedBooter.java:200)
	at org.apache.maven.surefire.booter.ForkedBooter.runSuitesInProcess(ForkedBooter.java:153)
	at org.apache.maven.surefire.booter.ForkedBooter.main(ForkedBooter.java:103)

testLocaleIndependence(org.apache.commons.codec.language.NysiisTest)  Time elapsed: 0.001 sec  <<< ERROR!
java.lang.StringIndexOutOfBoundsException: String index out of range: -1
	at java.lang.String.charAt(String.java:658)
	at org.apache.commons.codec.language.SoundexUtils.clean(SoundexUtils.java:17)
	at org.apache.commons.codec.language.Nysiis.nysiis(Nysiis.java:253)
	at org.apache.commons.codec.language.Nysiis.encode(Nysiis.java:228)
	at org.apache.commons.codec.StringEncoderAbstractTest.testLocaleIndependence(StringEncoderAbstractTest.java:99)
	at sun.reflect.NativeMethodAccessorImpl.invoke0(Native Method)
	at sun.reflect.NativeMethodAccessorImpl.invoke(NativeMethodAccessorImpl.java:57)
	at sun.reflect.DelegatingMethodAccessorImpl.invoke(DelegatingMethodAccessorImpl.java:43)
	at java.lang.reflect.Method.invoke(Method.java:606)
	at org.junit.runners.model.FrameworkMethod$1.runReflectiveCall(FrameworkMethod.java:47)
	at org.junit.internal.runners.model.ReflectiveCallable.run(ReflectiveCallable.java:12)
	at org.junit.runners.model.FrameworkMethod.invokeExplosively(FrameworkMethod.java:44)
	at org.junit.internal.runners.statements.InvokeMethod.evaluate(InvokeMethod.java:17)
	at org.junit.runners.ParentRunner.runLeaf(ParentRunner.java:271)
	at org.junit.runners.BlockJUnit4ClassRunner.runChild(BlockJUnit4ClassRunner.java:70)
	at org.junit.runners.BlockJUnit4ClassRunner.runChild(BlockJUnit4ClassRunner.java:50)
	at org.junit.runners.ParentRunner$3.run(ParentRunner.java:238)
	at org.junit.runners.ParentRunner$1.schedule(ParentRunner.java:63)
	at org.junit.runners.ParentRunner.runChildren(ParentRunner.java:236)
	at org.junit.runners.ParentRunner.access$000(ParentRunner.java:53)
	at org.junit.runners.ParentRunner$2.evaluate(ParentRunner.java:229)
	at org.junit.runners.ParentRunner.run(ParentRunner.java:309)
	at org.apache.maven.surefire.junit4.JUnit4Provider.execute(JUnit4Provider.java:264)
	at org.apache.maven.surefire.junit4.JUnit4Provider.executeTestSet(JUnit4Provider.java:153)
	at org.apache.maven.surefire.junit4.JUnit4Provider.invoke(JUnit4Provider.java:124)
	at org.apache.maven.surefire.booter.ForkedBooter.invokeProviderInSameClassLoader(ForkedBooter.java:200)
	at org.apache.maven.surefire.booter.ForkedBooter.runSuitesInProcess(ForkedBooter.java:153)
	at org.apache.maven.surefire.booter.ForkedBooter.main(ForkedBooter.java:103)

Running org.apache.commons.codec.language.Caverphone2Test
Tests run: 13, Failures: 0, Errors: 0, Skipped: 0, Time elapsed: 0.146 sec - in org.apache.commons.codec.language.Caverphone2Test
Running org.apache.commons.codec.language.DaitchMokotoffSoundexTest
Tests run: 13, Failures: 0, Errors: 0, Skipped: 0, Time elapsed: 0.062 sec - in org.apache.commons.codec.language.DaitchMokotoffSoundexTest
Running org.apache.commons.codec.language.bm.BeiderMorseEncoderTest
Tests run: 22, Failures: 0, Errors: 0, Skipped: 0, Time elapsed: 3.046 sec - in org.apache.commons.codec.language.bm.BeiderMorseEncoderTest
Running org.apache.commons.codec.language.bm.PhoneticEngineTest
Tests run: 8, Failures: 0, Errors: 0, Skipped: 0, Time elapsed: 0.02 sec - in org.apache.commons.codec.language.bm.PhoneticEngineTest
Running org.apache.commons.codec.language.bm.PhoneticEngineRegressionTest
Tests run: 4, Failures: 0, Errors: 0, Skipped: 0, Time elapsed: 0.015 sec - in org.apache.commons.codec.language.bm.PhoneticEngineRegressionTest
Running org.apache.commons.codec.language.bm.RuleTest
Tests run: 3, Failures: 0, Errors: 0, Skipped: 0, Time elapsed: 0.002 sec - in org.apache.commons.codec.language.bm.RuleTest
Running org.apache.commons.codec.language.bm.LanguageGuessingTest
Tests run: 18, Failures: 0, Errors: 0, Skipped: 0, Time elapsed: 0.016 sec - in org.apache.commons.codec.language.bm.LanguageGuessingTest
Running org.apache.commons.codec.language.DoubleMetaphoneTest
Tests run: 16, Failures: 0, Errors: 0, Skipped: 0, Time elapsed: 0.054 sec - in org.apache.commons.codec.language.DoubleMetaphoneTest
Running org.apache.commons.codec.language.SoundexTest
Tests run: 28, Failures: 0, Errors: 24, Skipped: 0, Time elapsed: 0.016 sec <<< FAILURE! - in org.apache.commons.codec.language.SoundexTest
testBadCharacters(org.apache.commons.codec.language.SoundexTest)  Time elapsed: 0 sec  <<< ERROR!
java.lang.StringIndexOutOfBoundsException: String index out of range: -1
	at java.lang.String.charAt(String.java:658)
	at org.apache.commons.codec.language.SoundexUtils.clean(SoundexUtils.java:17)
	at org.apache.commons.codec.language.Soundex.soundex(Soundex.java:262)
	at org.apache.commons.codec.language.Soundex.encode(Soundex.java:167)
	at org.apache.commons.codec.language.SoundexTest.testBadCharacters(SoundexTest.java:88)

testUsEnglishStatic(org.apache.commons.codec.language.SoundexTest)  Time elapsed: 0 sec  <<< ERROR!
java.lang.StringIndexOutOfBoundsException: String index out of range: -1
	at java.lang.String.charAt(String.java:658)
	at org.apache.commons.codec.language.SoundexUtils.clean(SoundexUtils.java:17)
	at org.apache.commons.codec.language.Soundex.soundex(Soundex.java:262)
	at org.apache.commons.codec.language.SoundexTest.testUsEnglishStatic(SoundexTest.java:346)

testMsSqlServer1(org.apache.commons.codec.language.SoundexTest)  Time elapsed: 0.001 sec  <<< ERROR!
java.lang.StringIndexOutOfBoundsException: String index out of range: -1
	at java.lang.String.charAt(String.java:658)
	at org.apache.commons.codec.language.SoundexUtils.clean(SoundexUtils.java:17)
	at org.apache.commons.codec.language.Soundex.soundex(Soundex.java:262)
	at org.apache.commons.codec.language.Soundex.encode(Soundex.java:167)
	at org.apache.commons.codec.language.SoundexTest.testMsSqlServer1(SoundexTest.java:278)

testMsSqlServer2(org.apache.commons.codec.language.SoundexTest)  Time elapsed: 0 sec  <<< ERROR!
java.lang.StringIndexOutOfBoundsException: String index out of range: -1
	at java.lang.String.charAt(String.java:658)
	at org.apache.commons.codec.language.SoundexUtils.clean(SoundexUtils.java:17)
	at org.apache.commons.codec.language.Soundex.soundex(Soundex.java:262)
	at org.apache.commons.codec.language.Soundex.encode(Soundex.java:167)
	at org.apache.commons.codec.StringEncoderAbstractTest.checkEncoding(StringEncoderAbstractTest.java:33)
	at org.apache.commons.codec.StringEncoderAbstractTest.checkEncodingVariations(StringEncoderAbstractTest.java:44)
	at org.apache.commons.codec.language.SoundexTest.testMsSqlServer2(SoundexTest.java:291)

testMsSqlServer3(org.apache.commons.codec.language.SoundexTest)  Time elapsed: 0 sec  <<< ERROR!
java.lang.StringIndexOutOfBoundsException: String index out of range: -1
	at java.lang.String.charAt(String.java:658)
	at org.apache.commons.codec.language.SoundexUtils.clean(SoundexUtils.java:17)
	at org.apache.commons.codec.language.Soundex.soundex(Soundex.java:262)
	at org.apache.commons.codec.language.Soundex.encode(Soundex.java:167)
	at org.apache.commons.codec.language.SoundexTest.testMsSqlServer3(SoundexTest.java:299)

testB650(org.apache.commons.codec.language.SoundexTest)  Time elapsed: 0.001 sec  <<< ERROR!
java.lang.StringIndexOutOfBoundsException: String index out of range: -1
	at java.lang.String.charAt(String.java:658)
	at org.apache.commons.codec.language.SoundexUtils.clean(SoundexUtils.java:17)
	at org.apache.commons.codec.language.Soundex.soundex(Soundex.java:262)
	at org.apache.commons.codec.language.Soundex.encode(Soundex.java:167)
	at org.apache.commons.codec.StringEncoderAbstractTest.checkEncoding(StringEncoderAbstractTest.java:33)
	at org.apache.commons.codec.StringEncoderAbstractTest.checkEncodingVariations(StringEncoderAbstractTest.java:44)
	at org.apache.commons.codec.language.SoundexTest.testB650(SoundexTest.java:43)

testEncodeBatch2(org.apache.commons.codec.language.SoundexTest)  Time elapsed: 0 sec  <<< ERROR!
java.lang.StringIndexOutOfBoundsException: String index out of range: -1
	at java.lang.String.charAt(String.java:658)
	at org.apache.commons.codec.language.SoundexUtils.clean(SoundexUtils.java:17)
	at org.apache.commons.codec.language.Soundex.soundex(Soundex.java:262)
	at org.apache.commons.codec.language.Soundex.encode(Soundex.java:167)
	at org.apache.commons.codec.language.SoundexTest.testEncodeBatch2(SoundexTest.java:131)

testEncodeBatch3(org.apache.commons.codec.language.SoundexTest)  Time elapsed: 0.001 sec  <<< ERROR!
java.lang.StringIndexOutOfBoundsException: String index out of range: -1
	at java.lang.String.charAt(String.java:658)
	at org.apache.commons.codec.language.SoundexUtils.clean(SoundexUtils.java:17)
	at org.apache.commons.codec.language.Soundex.soundex(Soundex.java:262)
	at org.apache.commons.codec.language.Soundex.encode(Soundex.java:167)
	at org.apache.commons.codec.language.SoundexTest.testEncodeBatch3(SoundexTest.java:154)

testEncodeBatch4(org.apache.commons.codec.language.SoundexTest)  Time elapsed: 0 sec  <<< ERROR!
java.lang.StringIndexOutOfBoundsException: String index out of range: -1
	at java.lang.String.charAt(String.java:658)
	at org.apache.commons.codec.language.SoundexUtils.clean(SoundexUtils.java:17)
	at org.apache.commons.codec.language.Soundex.soundex(Soundex.java:262)
	at org.apache.commons.codec.language.Soundex.encode(Soundex.java:167)
	at org.apache.commons.codec.language.SoundexTest.testEncodeBatch4(SoundexTest.java:170)

testEncodeIgnoreHyphens(org.apache.commons.codec.language.SoundexTest)  Time elapsed: 0 sec  <<< ERROR!
java.lang.StringIndexOutOfBoundsException: String index out of range: -1
	at java.lang.String.charAt(String.java:658)
	at org.apache.commons.codec.language.SoundexUtils.clean(SoundexUtils.java:17)
	at org.apache.commons.codec.language.Soundex.soundex(Soundex.java:262)
	at org.apache.commons.codec.language.Soundex.encode(Soundex.java:167)
	at org.apache.commons.codec.StringEncoderAbstractTest.checkEncoding(StringEncoderAbstractTest.java:33)
	at org.apache.commons.codec.StringEncoderAbstractTest.checkEncodingVariations(StringEncoderAbstractTest.java:44)
	at org.apache.commons.codec.language.SoundexTest.testEncodeIgnoreHyphens(SoundexTest.java:201)

testEncodeIgnoreTrimmable(org.apache.commons.codec.language.SoundexTest)  Time elapsed: 0 sec  <<< ERROR!
java.lang.StringIndexOutOfBoundsException: String index out of range: -1
	at java.lang.String.charAt(String.java:658)
	at org.apache.commons.codec.language.SoundexUtils.clean(SoundexUtils.java:17)
	at org.apache.commons.codec.language.Soundex.soundex(Soundex.java:262)
	at org.apache.commons.codec.language.Soundex.encode(Soundex.java:167)
	at org.apache.commons.codec.language.SoundexTest.testEncodeIgnoreTrimmable(SoundexTest.java:217)

testEncodeIgnoreApostrophes(org.apache.commons.codec.language.SoundexTest)  Time elapsed: 0.001 sec  <<< ERROR!
java.lang.StringIndexOutOfBoundsException: String index out of range: -1
	at java.lang.String.charAt(String.java:658)
	at org.apache.commons.codec.language.SoundexUtils.clean(SoundexUtils.java:17)
	at org.apache.commons.codec.language.Soundex.soundex(Soundex.java:262)
	at org.apache.commons.codec.language.Soundex.encode(Soundex.java:167)
	at org.apache.commons.codec.StringEncoderAbstractTest.checkEncoding(StringEncoderAbstractTest.java:33)
	at org.apache.commons.codec.StringEncoderAbstractTest.checkEncodingVariations(StringEncoderAbstractTest.java:44)
	at org.apache.commons.codec.language.SoundexTest.testEncodeIgnoreApostrophes(SoundexTest.java:183)

testDifference(org.apache.commons.codec.language.SoundexTest)  Time elapsed: 0 sec  <<< ERROR!
java.lang.StringIndexOutOfBoundsException: String index out of range: -1
	at java.lang.String.charAt(String.java:658)
	at org.apache.commons.codec.language.SoundexUtils.clean(SoundexUtils.java:17)
	at org.apache.commons.codec.language.Soundex.soundex(Soundex.java:262)
	at org.apache.commons.codec.language.Soundex.encode(Soundex.java:167)
	at org.apache.commons.codec.language.SoundexUtils.difference(SoundexUtils.java:20)
	at org.apache.commons.codec.language.Soundex.difference(Soundex.java:132)
	at org.apache.commons.codec.language.SoundexTest.testDifference(SoundexTest.java:97)

testNewInstance(org.apache.commons.codec.language.SoundexTest)  Time elapsed: 0 sec  <<< ERROR!
java.lang.StringIndexOutOfBoundsException: String index out of range: -1
	at java.lang.String.charAt(String.java:658)
	at org.apache.commons.codec.language.SoundexUtils.clean(SoundexUtils.java:17)
	at org.apache.commons.codec.language.Soundex.soundex(Soundex.java:262)
	at org.apache.commons.codec.language.SoundexTest.testNewInstance(SoundexTest.java:315)

testEncodeBasic(org.apache.commons.codec.language.SoundexTest)  Time elapsed: 0 sec  <<< ERROR!
java.lang.StringIndexOutOfBoundsException: String index out of range: -1
	at java.lang.String.charAt(String.java:658)
	at org.apache.commons.codec.language.SoundexUtils.clean(SoundexUtils.java:17)
	at org.apache.commons.codec.language.Soundex.soundex(Soundex.java:262)
	at org.apache.commons.codec.language.Soundex.encode(Soundex.java:167)
	at org.apache.commons.codec.language.SoundexTest.testEncodeBasic(SoundexTest.java:114)

testUsMappingEWithAcute(org.apache.commons.codec.language.SoundexTest)  Time elapsed: 0 sec  <<< ERROR!
java.lang.StringIndexOutOfBoundsException: String index out of range: -1
	at java.lang.String.charAt(String.java:658)
	at org.apache.commons.codec.language.SoundexUtils.clean(SoundexUtils.java:17)
	at org.apache.commons.codec.language.Soundex.soundex(Soundex.java:262)
	at org.apache.commons.codec.language.Soundex.encode(Soundex.java:167)
	at org.apache.commons.codec.language.SoundexTest.testUsMappingEWithAcute(SoundexTest.java:356)

testNewInstance2(org.apache.commons.codec.language.SoundexTest)  Time elapsed: 0 sec  <<< ERROR!
java.lang.StringIndexOutOfBoundsException: String index out of range: -1
	at java.lang.String.charAt(String.java:658)
	at org.apache.commons.codec.language.SoundexUtils.clean(SoundexUtils.java:17)
	at org.apache.commons.codec.language.Soundex.soundex(Soundex.java:262)
	at org.apache.commons.codec.language.SoundexTest.testNewInstance2(SoundexTest.java:320)

testNewInstance3(org.apache.commons.codec.language.SoundexTest)  Time elapsed: 0 sec  <<< ERROR!
java.lang.StringIndexOutOfBoundsException: String index out of range: -1
	at java.lang.String.charAt(String.java:658)
	at org.apache.commons.codec.language.SoundexUtils.clean(SoundexUtils.java:17)
	at org.apache.commons.codec.language.Soundex.soundex(Soundex.java:262)
	at org.apache.commons.codec.language.SoundexTest.testNewInstance3(SoundexTest.java:325)

testUsMappingOWithDiaeresis(org.apache.commons.codec.language.SoundexTest)  Time elapsed: 0.001 sec  <<< ERROR!
java.lang.StringIndexOutOfBoundsException: String index out of range: -1
	at java.lang.String.charAt(String.java:658)
	at org.apache.commons.codec.language.SoundexUtils.clean(SoundexUtils.java:17)
	at org.apache.commons.codec.language.Soundex.soundex(Soundex.java:262)
	at org.apache.commons.codec.language.Soundex.encode(Soundex.java:167)
	at org.apache.commons.codec.language.SoundexTest.testUsMappingOWithDiaeresis(SoundexTest.java:377)

testHWRuleEx1(org.apache.commons.codec.language.SoundexTest)  Time elapsed: 0 sec  <<< ERROR!
java.lang.StringIndexOutOfBoundsException: String index out of range: -1
	at java.lang.String.charAt(String.java:658)
	at org.apache.commons.codec.language.SoundexUtils.clean(SoundexUtils.java:17)
	at org.apache.commons.codec.language.Soundex.soundex(Soundex.java:262)
	at org.apache.commons.codec.language.Soundex.encode(Soundex.java:167)
	at org.apache.commons.codec.language.SoundexTest.testHWRuleEx1(SoundexTest.java:229)

testHWRuleEx2(org.apache.commons.codec.language.SoundexTest)  Time elapsed: 0 sec  <<< ERROR!
java.lang.StringIndexOutOfBoundsException: String index out of range: -1
	at java.lang.String.charAt(String.java:658)
	at org.apache.commons.codec.language.SoundexUtils.clean(SoundexUtils.java:17)
	at org.apache.commons.codec.language.Soundex.soundex(Soundex.java:262)
	at org.apache.commons.codec.language.Soundex.encode(Soundex.java:167)
	at org.apache.commons.codec.language.SoundexTest.testHWRuleEx2(SoundexTest.java:239)

testHWRuleEx3(org.apache.commons.codec.language.SoundexTest)  Time elapsed: 0.001 sec  <<< ERROR!
java.lang.StringIndexOutOfBoundsException: String index out of range: -1
	at java.lang.String.charAt(String.java:658)
	at org.apache.commons.codec.language.SoundexUtils.clean(SoundexUtils.java:17)
	at org.apache.commons.codec.language.Soundex.soundex(Soundex.java:262)
	at org.apache.commons.codec.language.Soundex.encode(Soundex.java:167)
	at org.apache.commons.codec.language.SoundexTest.testHWRuleEx3(SoundexTest.java:250)

testEncodeEmpty(org.apache.commons.codec.language.SoundexTest)  Time elapsed: 0.001 sec  <<< ERROR!
java.lang.StringIndexOutOfBoundsException: String index out of range: -1
	at java.lang.String.charAt(String.java:658)
	at org.apache.commons.codec.language.SoundexUtils.clean(SoundexUtils.java:17)
	at org.apache.commons.codec.language.Soundex.soundex(Soundex.java:262)
	at org.apache.commons.codec.language.Soundex.encode(Soundex.java:153)
	at org.apache.commons.codec.StringEncoderAbstractTest.testEncodeEmpty(StringEncoderAbstractTest.java:58)
	at sun.reflect.NativeMethodAccessorImpl.invoke0(Native Method)
	at sun.reflect.NativeMethodAccessorImpl.invoke(NativeMethodAccessorImpl.java:57)
	at sun.reflect.DelegatingMethodAccessorImpl.invoke(DelegatingMethodAccessorImpl.java:43)
	at java.lang.reflect.Method.invoke(Method.java:606)
	at org.junit.runners.model.FrameworkMethod$1.runReflectiveCall(FrameworkMethod.java:47)
	at org.junit.internal.runners.model.ReflectiveCallable.run(ReflectiveCallable.java:12)
	at org.junit.runners.model.FrameworkMethod.invokeExplosively(FrameworkMethod.java:44)
	at org.junit.internal.runners.statements.InvokeMethod.evaluate(InvokeMethod.java:17)
	at org.junit.runners.ParentRunner.runLeaf(ParentRunner.java:271)
	at org.junit.runners.BlockJUnit4ClassRunner.runChild(BlockJUnit4ClassRunner.java:70)
	at org.junit.runners.BlockJUnit4ClassRunner.runChild(BlockJUnit4ClassRunner.java:50)
	at org.junit.runners.ParentRunner$3.run(ParentRunner.java:238)
	at org.junit.runners.ParentRunner$1.schedule(ParentRunner.java:63)
	at org.junit.runners.ParentRunner.runChildren(ParentRunner.java:236)
	at org.junit.runners.ParentRunner.access$000(ParentRunner.java:53)
	at org.junit.runners.ParentRunner$2.evaluate(ParentRunner.java:229)
	at org.junit.runners.ParentRunner.run(ParentRunner.java:309)
	at org.apache.maven.surefire.junit4.JUnit4Provider.execute(JUnit4Provider.java:264)
	at org.apache.maven.surefire.junit4.JUnit4Provider.executeTestSet(JUnit4Provider.java:153)
	at org.apache.maven.surefire.junit4.JUnit4Provider.invoke(JUnit4Provider.java:124)
	at org.apache.maven.surefire.booter.ForkedBooter.invokeProviderInSameClassLoader(ForkedBooter.java:200)
	at org.apache.maven.surefire.booter.ForkedBooter.runSuitesInProcess(ForkedBooter.java:153)
	at org.apache.maven.surefire.booter.ForkedBooter.main(ForkedBooter.java:103)

testLocaleIndependence(org.apache.commons.codec.language.SoundexTest)  Time elapsed: 0 sec  <<< ERROR!
java.lang.StringIndexOutOfBoundsException: String index out of range: -1
	at java.lang.String.charAt(String.java:658)
	at org.apache.commons.codec.language.SoundexUtils.clean(SoundexUtils.java:17)
	at org.apache.commons.codec.language.Soundex.soundex(Soundex.java:262)
	at org.apache.commons.codec.language.Soundex.encode(Soundex.java:167)
	at org.apache.commons.codec.StringEncoderAbstractTest.testLocaleIndependence(StringEncoderAbstractTest.java:99)
	at sun.reflect.NativeMethodAccessorImpl.invoke0(Native Method)
	at sun.reflect.NativeMethodAccessorImpl.invoke(NativeMethodAccessorImpl.java:57)
	at sun.reflect.DelegatingMethodAccessorImpl.invoke(DelegatingMethodAccessorImpl.java:43)
	at java.lang.reflect.Method.invoke(Method.java:606)
	at org.junit.runners.model.FrameworkMethod$1.runReflectiveCall(FrameworkMethod.java:47)
	at org.junit.internal.runners.model.ReflectiveCallable.run(ReflectiveCallable.java:12)
	at org.junit.runners.model.FrameworkMethod.invokeExplosively(FrameworkMethod.java:44)
	at org.junit.internal.runners.statements.InvokeMethod.evaluate(InvokeMethod.java:17)
	at org.junit.runners.ParentRunner.runLeaf(ParentRunner.java:271)
	at org.junit.runners.BlockJUnit4ClassRunner.runChild(BlockJUnit4ClassRunner.java:70)
	at org.junit.runners.BlockJUnit4ClassRunner.runChild(BlockJUnit4ClassRunner.java:50)
	at org.junit.runners.ParentRunner$3.run(ParentRunner.java:238)
	at org.junit.runners.ParentRunner$1.schedule(ParentRunner.java:63)
	at org.junit.runners.ParentRunner.runChildren(ParentRunner.java:236)
	at org.junit.runners.ParentRunner.access$000(ParentRunner.java:53)
	at org.junit.runners.ParentRunner$2.evaluate(ParentRunner.java:229)
	at org.junit.runners.ParentRunner.run(ParentRunner.java:309)
	at org.apache.maven.surefire.junit4.JUnit4Provider.execute(JUnit4Provider.java:264)
	at org.apache.maven.surefire.junit4.JUnit4Provider.executeTestSet(JUnit4Provider.java:153)
	at org.apache.maven.surefire.junit4.JUnit4Provider.invoke(JUnit4Provider.java:124)
	at org.apache.maven.surefire.booter.ForkedBooter.invokeProviderInSameClassLoader(ForkedBooter.java:200)
	at org.apache.maven.surefire.booter.ForkedBooter.runSuitesInProcess(ForkedBooter.java:153)
	at org.apache.maven.surefire.booter.ForkedBooter.main(ForkedBooter.java:103)

Running org.apache.commons.codec.language.RefinedSoundexTest
Tests run: 10, Failures: 0, Errors: 7, Skipped: 0, Time elapsed: 0.001 sec <<< FAILURE! - in org.apache.commons.codec.language.RefinedSoundexTest
testDifference(org.apache.commons.codec.language.RefinedSoundexTest)  Time elapsed: 0 sec  <<< ERROR!
java.lang.StringIndexOutOfBoundsException: String index out of range: -1
	at java.lang.String.charAt(String.java:658)
	at org.apache.commons.codec.language.SoundexUtils.clean(SoundexUtils.java:17)
	at org.apache.commons.codec.language.RefinedSoundex.soundex(RefinedSoundex.java:179)
	at org.apache.commons.codec.language.RefinedSoundex.encode(RefinedSoundex.java:149)
	at org.apache.commons.codec.language.SoundexUtils.difference(SoundexUtils.java:20)
	at org.apache.commons.codec.language.RefinedSoundex.difference(RefinedSoundex.java:116)
	at org.apache.commons.codec.language.RefinedSoundexTest.testDifference(RefinedSoundexTest.java:43)

testNewInstance(org.apache.commons.codec.language.RefinedSoundexTest)  Time elapsed: 0 sec  <<< ERROR!
java.lang.StringIndexOutOfBoundsException: String index out of range: -1
	at java.lang.String.charAt(String.java:658)
	at org.apache.commons.codec.language.SoundexUtils.clean(SoundexUtils.java:17)
	at org.apache.commons.codec.language.RefinedSoundex.soundex(RefinedSoundex.java:179)
	at org.apache.commons.codec.language.RefinedSoundexTest.testNewInstance(RefinedSoundexTest.java:86)

testEncode(org.apache.commons.codec.language.RefinedSoundexTest)  Time elapsed: 0 sec  <<< ERROR!
java.lang.StringIndexOutOfBoundsException: String index out of range: -1
	at java.lang.String.charAt(String.java:658)
	at org.apache.commons.codec.language.SoundexUtils.clean(SoundexUtils.java:17)
	at org.apache.commons.codec.language.RefinedSoundex.soundex(RefinedSoundex.java:179)
	at org.apache.commons.codec.language.RefinedSoundex.encode(RefinedSoundex.java:149)
	at org.apache.commons.codec.language.RefinedSoundexTest.testEncode(RefinedSoundexTest.java:62)

testNewInstance2(org.apache.commons.codec.language.RefinedSoundexTest)  Time elapsed: 0 sec  <<< ERROR!
java.lang.StringIndexOutOfBoundsException: String index out of range: -1
	at java.lang.String.charAt(String.java:658)
	at org.apache.commons.codec.language.SoundexUtils.clean(SoundexUtils.java:17)
	at org.apache.commons.codec.language.RefinedSoundex.soundex(RefinedSoundex.java:179)
	at org.apache.commons.codec.language.RefinedSoundexTest.testNewInstance2(RefinedSoundexTest.java:91)

testNewInstance3(org.apache.commons.codec.language.RefinedSoundexTest)  Time elapsed: 0 sec  <<< ERROR!
java.lang.StringIndexOutOfBoundsException: String index out of range: -1
	at java.lang.String.charAt(String.java:658)
	at org.apache.commons.codec.language.SoundexUtils.clean(SoundexUtils.java:17)
	at org.apache.commons.codec.language.RefinedSoundex.soundex(RefinedSoundex.java:179)
	at org.apache.commons.codec.language.RefinedSoundexTest.testNewInstance3(RefinedSoundexTest.java:96)

testEncodeEmpty(org.apache.commons.codec.language.RefinedSoundexTest)  Time elapsed: 0 sec  <<< ERROR!
java.lang.StringIndexOutOfBoundsException: String index out of range: -1
	at java.lang.String.charAt(String.java:658)
	at org.apache.commons.codec.language.SoundexUtils.clean(SoundexUtils.java:17)
	at org.apache.commons.codec.language.RefinedSoundex.soundex(RefinedSoundex.java:179)
	at org.apache.commons.codec.language.RefinedSoundex.encode(RefinedSoundex.java:137)
	at org.apache.commons.codec.StringEncoderAbstractTest.testEncodeEmpty(StringEncoderAbstractTest.java:58)
	at sun.reflect.NativeMethodAccessorImpl.invoke0(Native Method)
	at sun.reflect.NativeMethodAccessorImpl.invoke(NativeMethodAccessorImpl.java:57)
	at sun.reflect.DelegatingMethodAccessorImpl.invoke(DelegatingMethodAccessorImpl.java:43)
	at java.lang.reflect.Method.invoke(Method.java:606)
	at org.junit.runners.model.FrameworkMethod$1.runReflectiveCall(FrameworkMethod.java:47)
	at org.junit.internal.runners.model.ReflectiveCallable.run(ReflectiveCallable.java:12)
	at org.junit.runners.model.FrameworkMethod.invokeExplosively(FrameworkMethod.java:44)
	at org.junit.internal.runners.statements.InvokeMethod.evaluate(InvokeMethod.java:17)
	at org.junit.runners.ParentRunner.runLeaf(ParentRunner.java:271)
	at org.junit.runners.BlockJUnit4ClassRunner.runChild(BlockJUnit4ClassRunner.java:70)
	at org.junit.runners.BlockJUnit4ClassRunner.runChild(BlockJUnit4ClassRunner.java:50)
	at org.junit.runners.ParentRunner$3.run(ParentRunner.java:238)
	at org.junit.runners.ParentRunner$1.schedule(ParentRunner.java:63)
	at org.junit.runners.ParentRunner.runChildren(ParentRunner.java:236)
	at org.junit.runners.ParentRunner.access$000(ParentRunner.java:53)
	at org.junit.runners.ParentRunner$2.evaluate(ParentRunner.java:229)
	at org.junit.runners.ParentRunner.run(ParentRunner.java:309)
	at org.apache.maven.surefire.junit4.JUnit4Provider.execute(JUnit4Provider.java:264)
	at org.apache.maven.surefire.junit4.JUnit4Provider.executeTestSet(JUnit4Provider.java:153)
	at org.apache.maven.surefire.junit4.JUnit4Provider.invoke(JUnit4Provider.java:124)
	at org.apache.maven.surefire.booter.ForkedBooter.invokeProviderInSameClassLoader(ForkedBooter.java:200)
	at org.apache.maven.surefire.booter.ForkedBooter.runSuitesInProcess(ForkedBooter.java:153)
	at org.apache.maven.surefire.booter.ForkedBooter.main(ForkedBooter.java:103)

testLocaleIndependence(org.apache.commons.codec.language.RefinedSoundexTest)  Time elapsed: 0.001 sec  <<< ERROR!
java.lang.StringIndexOutOfBoundsException: String index out of range: -1
	at java.lang.String.charAt(String.java:658)
	at org.apache.commons.codec.language.SoundexUtils.clean(SoundexUtils.java:17)
	at org.apache.commons.codec.language.RefinedSoundex.soundex(RefinedSoundex.java:179)
	at org.apache.commons.codec.language.RefinedSoundex.encode(RefinedSoundex.java:149)
	at org.apache.commons.codec.StringEncoderAbstractTest.testLocaleIndependence(StringEncoderAbstractTest.java:99)
	at sun.reflect.NativeMethodAccessorImpl.invoke0(Native Method)
	at sun.reflect.NativeMethodAccessorImpl.invoke(NativeMethodAccessorImpl.java:57)
	at sun.reflect.DelegatingMethodAccessorImpl.invoke(DelegatingMethodAccessorImpl.java:43)
	at java.lang.reflect.Method.invoke(Method.java:606)
	at org.junit.runners.model.FrameworkMethod$1.runReflectiveCall(FrameworkMethod.java:47)
	at org.junit.internal.runners.model.ReflectiveCallable.run(ReflectiveCallable.java:12)
	at org.junit.runners.model.FrameworkMethod.invokeExplosively(FrameworkMethod.java:44)
	at org.junit.internal.runners.statements.InvokeMethod.evaluate(InvokeMethod.java:17)
	at org.junit.runners.ParentRunner.runLeaf(ParentRunner.java:271)
	at org.junit.runners.BlockJUnit4ClassRunner.runChild(BlockJUnit4ClassRunner.java:70)
	at org.junit.runners.BlockJUnit4ClassRunner.runChild(BlockJUnit4ClassRunner.java:50)
	at org.junit.runners.ParentRunner$3.run(ParentRunner.java:238)
	at org.junit.runners.ParentRunner$1.schedule(ParentRunner.java:63)
	at org.junit.runners.ParentRunner.runChildren(ParentRunner.java:236)
	at org.junit.runners.ParentRunner.access$000(ParentRunner.java:53)
	at org.junit.runners.ParentRunner$2.evaluate(ParentRunner.java:229)
	at org.junit.runners.ParentRunner.run(ParentRunner.java:309)
	at org.apache.maven.surefire.junit4.JUnit4Provider.execute(JUnit4Provider.java:264)
	at org.apache.maven.surefire.junit4.JUnit4Provider.executeTestSet(JUnit4Provider.java:153)
	at org.apache.maven.surefire.junit4.JUnit4Provider.invoke(JUnit4Provider.java:124)
	at org.apache.maven.surefire.booter.ForkedBooter.invokeProviderInSameClassLoader(ForkedBooter.java:200)
	at org.apache.maven.surefire.booter.ForkedBooter.runSuitesInProcess(ForkedBooter.java:153)
	at org.apache.maven.surefire.booter.ForkedBooter.main(ForkedBooter.java:103)

Running org.apache.commons.codec.language.MatchRatingApproachEncoderTest
Tests run: 96, Failures: 0, Errors: 0, Skipped: 0, Time elapsed: 0.036 sec - in org.apache.commons.codec.language.MatchRatingApproachEncoderTest
Running org.apache.commons.codec.language.ColognePhoneticTest
Tests run: 13, Failures: 0, Errors: 0, Skipped: 0, Time elapsed: 0.002 sec - in org.apache.commons.codec.language.ColognePhoneticTest
Running org.apache.commons.codec.language.DoubleMetaphone2Test
Tests run: 6, Failures: 0, Errors: 0, Skipped: 0, Time elapsed: 0.031 sec - in org.apache.commons.codec.language.DoubleMetaphone2Test
Running org.apache.commons.codec.language.MetaphoneTest
Tests run: 34, Failures: 0, Errors: 0, Skipped: 0, Time elapsed: 0.124 sec - in org.apache.commons.codec.language.MetaphoneTest
Running org.apache.commons.codec.CharEncodingTest
Tests run: 7, Failures: 0, Errors: 0, Skipped: 0, Time elapsed: 0 sec - in org.apache.commons.codec.CharEncodingTest

Results :

Tests in error: 
  StringEncoderComparatorTest.testComparatorWithSoundex:43 » StringIndexOutOfBounds
  NysiisTest.testRule4Dot1:209->assertEncodings:46 » StringIndexOutOfBounds Stri...
  NysiisTest.testRule4Dot2:225->assertEncodings:46 » StringIndexOutOfBounds Stri...
  NysiisTest.testCap:68->encodeAll:57 » StringIndexOutOfBounds String index out ...
  NysiisTest.testDad:75->encodeAll:57 » StringIndexOutOfBounds String index out ...
  NysiisTest.testDan:80->encodeAll:57 » StringIndexOutOfBounds String index out ...
  NysiisTest.testFal:149->encodeAll:57 » StringIndexOutOfBounds String index out...
  NysiisTest.testRule1:176->assertEncodings:46 » StringIndexOutOfBounds String i...
  NysiisTest.testRule2:192->assertEncodings:46 » StringIndexOutOfBounds String i...
  NysiisTest.testRule5:238->assertEncodings:46 » StringIndexOutOfBounds String i...
  NysiisTest.testRule6:250->assertEncodings:46 » StringIndexOutOfBounds String i...
  NysiisTest.testRule7:262->assertEncodings:46 » StringIndexOutOfBounds String i...
  NysiisTest.testBran:63->encodeAll:57 » StringIndexOutOfBounds String index out...
  NysiisTest.testSnad:270->encodeAll:57 » StringIndexOutOfBounds String index ou...
  NysiisTest.testSnat:275->encodeAll:57 » StringIndexOutOfBounds String index ou...
  NysiisTest.testTrueVariant:298 » StringIndexOutOfBounds String index out of ra...
  NysiisTest.testDropBy:95->assertEncodings:46 » StringIndexOutOfBounds String i...
  NysiisTest.testOthers:159->assertEncodings:46 » StringIndexOutOfBounds String ...
  NysiisTest.testTranan:291->encodeAll:57 » StringIndexOutOfBounds String index ...
  NysiisTest.testSpecialBranches:280->encodeAll:57 » StringIndexOutOfBounds Stri...
  NysiisTest>StringEncoderAbstractTest.testEncodeEmpty:58 » StringIndexOutOfBounds
  NysiisTest>StringEncoderAbstractTest.testLocaleIndependence:99 » StringIndexOutOfBounds
  SoundexTest.testBadCharacters:88 » StringIndexOutOfBounds String index out of ...
  SoundexTest.testUsEnglishStatic:346 » StringIndexOutOfBounds String index out ...
  SoundexTest.testMsSqlServer1:278 » StringIndexOutOfBounds String index out of ...
  SoundexTest.testMsSqlServer2:291->StringEncoderAbstractTest.checkEncodingVariations:44->StringEncoderAbstractTest.checkEncoding:33 » StringIndexOutOfBounds
  SoundexTest.testMsSqlServer3:299 » StringIndexOutOfBounds String index out of ...
  SoundexTest.testB650:43->StringEncoderAbstractTest.checkEncodingVariations:44->StringEncoderAbstractTest.checkEncoding:33 » StringIndexOutOfBounds
  SoundexTest.testEncodeBatch2:131 » StringIndexOutOfBounds String index out of ...
  SoundexTest.testEncodeBatch3:154 » StringIndexOutOfBounds String index out of ...
  SoundexTest.testEncodeBatch4:170 » StringIndexOutOfBounds String index out of ...
  SoundexTest.testEncodeIgnoreHyphens:201->StringEncoderAbstractTest.checkEncodingVariations:44->StringEncoderAbstractTest.checkEncoding:33 » StringIndexOutOfBounds
  SoundexTest.testEncodeIgnoreTrimmable:217 » StringIndexOutOfBounds String inde...
  SoundexTest.testEncodeIgnoreApostrophes:183->StringEncoderAbstractTest.checkEncodingVariations:44->StringEncoderAbstractTest.checkEncoding:33 » StringIndexOutOfBounds
  SoundexTest.testDifference:97 » StringIndexOutOfBounds String index out of ran...
  SoundexTest.testNewInstance:315 » StringIndexOutOfBounds String index out of r...
  SoundexTest.testEncodeBasic:114 » StringIndexOutOfBounds String index out of r...
  SoundexTest.testUsMappingEWithAcute:356 » StringIndexOutOfBounds String index ...
  SoundexTest.testNewInstance2:320 » StringIndexOutOfBounds String index out of ...
  SoundexTest.testNewInstance3:325 » StringIndexOutOfBounds String index out of ...
  SoundexTest.testUsMappingOWithDiaeresis:377 » StringIndexOutOfBounds String in...
  SoundexTest.testHWRuleEx1:229 » StringIndexOutOfBounds String index out of ran...
  SoundexTest.testHWRuleEx2:239 » StringIndexOutOfBounds String index out of ran...
  SoundexTest.testHWRuleEx3:250 » StringIndexOutOfBounds String index out of ran...
  SoundexTest>StringEncoderAbstractTest.testEncodeEmpty:58 » StringIndexOutOfBounds
  SoundexTest>StringEncoderAbstractTest.testLocaleIndependence:99 » StringIndexOutOfBounds
  RefinedSoundexTest.testDifference:43 » StringIndexOutOfBounds String index out...
  RefinedSoundexTest.testNewInstance:86 » StringIndexOutOfBounds String index ou...
  RefinedSoundexTest.testEncode:62 » StringIndexOutOfBounds String index out of ...
  RefinedSoundexTest.testNewInstance2:91 » StringIndexOutOfBounds String index o...
  RefinedSoundexTest.testNewInstance3:96 » StringIndexOutOfBounds String index o...
  RefinedSoundexTest>StringEncoderAbstractTest.testEncodeEmpty:58 » StringIndexOutOfBounds
  RefinedSoundexTest>StringEncoderAbstractTest.testLocaleIndependence:99 » StringIndexOutOfBounds

Tests run: 662, Failures: 0, Errors: 53, Skipped: 1

[INFO] ------------------------------------------------------------------------
[INFO] BUILD FAILURE
[INFO] ------------------------------------------------------------------------
[INFO] Total time: 13.988s
[INFO] Finished at: Sun Aug 02 12:59:34 BST 2015
[INFO] Final Memory: 21M/343M
[INFO] ------------------------------------------------------------------------
[ERROR] Failed to execute goal org.apache.maven.plugins:maven-surefire-plugin:2.17:test (default-test) on project commons-codec: There are test failures.
[ERROR] 
[ERROR] Please refer to /home/perham/Study/LittleDarwin/Cases/commons-codec-1.10-src/target/surefire-reports for the individual test results.
[ERROR] -> [Help 1]
[ERROR] 
[ERROR] To see the full stack trace of the errors, re-run Maven with the -e switch.
[ERROR] Re-run Maven using the -X switch to enable full debug logging.
[ERROR] 
[ERROR] For more information about the errors and possible solutions, please read the following articles:
[ERROR] [Help 1] http://cwiki.apache.org/confluence/display/MAVEN/MojoFailureException
