[INFO] Scanning for projects...
[INFO]                                                                         
[INFO] ------------------------------------------------------------------------
[INFO] Building Apache Commons Codec 1.10
[INFO] ------------------------------------------------------------------------
[INFO] 
[INFO] --- maven-enforcer-plugin:1.3.1:enforce (enforce-maven-3) @ commons-codec ---
[INFO] 
[INFO] --- maven-antrun-plugin:1.7:run (javadoc.resources) @ commons-codec ---
[INFO] Executing tasks

main:
[INFO] Executed tasks
[INFO] 
[INFO] --- maven-remote-resources-plugin:1.5:process (default) @ commons-codec ---
[INFO] 
[INFO] --- buildnumber-maven-plugin:1.3:create (default) @ commons-codec ---
[INFO] Executing: /bin/sh -c cd /home/perham/Study/LittleDarwin/Cases/commons-codec-1.10-src && svn --non-interactive info
[INFO] Working directory: /home/perham/Study/LittleDarwin/Cases/commons-codec-1.10-src
[INFO] Storing buildNumber: ?????? at timestamp: 1438516874121
[INFO] Executing: /bin/sh -c cd /home/perham/Study/LittleDarwin/Cases/commons-codec-1.10-src && svn --non-interactive info
[INFO] Working directory: /home/perham/Study/LittleDarwin/Cases/commons-codec-1.10-src
[INFO] Storing buildScmBranch: UNKNOWN_BRANCH
[INFO] 
[INFO] --- maven-resources-plugin:2.7:resources (default-resources) @ commons-codec ---
[INFO] Using 'UTF-8' encoding to copy filtered resources.
[INFO] Copying 128 resources
[INFO] Copying 2 resources to META-INF
[INFO] 
[INFO] --- maven-compiler-plugin:3.2:compile (default-compile) @ commons-codec ---
[INFO] Changes detected - recompiling the module!
[INFO] Compiling 60 source files to /home/perham/Study/LittleDarwin/Cases/commons-codec-1.10-src/target/classes
[INFO] /home/perham/Study/LittleDarwin/Cases/commons-codec-1.10-src/src/main/java/org/apache/commons/codec/digest/Sha2Crypt.java: Some input files use or override a deprecated API.
[INFO] /home/perham/Study/LittleDarwin/Cases/commons-codec-1.10-src/src/main/java/org/apache/commons/codec/digest/Sha2Crypt.java: Recompile with -Xlint:deprecation for details.
[INFO] 
[INFO] --- maven-bundle-plugin:2.5.3:manifest (bundle-manifest) @ commons-codec ---
[INFO] 
[INFO] --- maven-resources-plugin:2.7:testResources (default-testResources) @ commons-codec ---
[INFO] Using 'UTF-8' encoding to copy filtered resources.
[INFO] skip non existing resourceDirectory /home/perham/Study/LittleDarwin/Cases/commons-codec-1.10-src/src/test/resources
[INFO] Copying 2 resources to META-INF
[INFO] 
[INFO] --- maven-compiler-plugin:3.2:testCompile (default-testCompile) @ commons-codec ---
[INFO] Nothing to compile - all classes are up to date
[INFO] 
[INFO] --- maven-surefire-plugin:2.17:test (default-test) @ commons-codec ---
[INFO] Surefire report directory: /home/perham/Study/LittleDarwin/Cases/commons-codec-1.10-src/target/surefire-reports

-------------------------------------------------------
 T E S T S
-------------------------------------------------------
Running org.apache.commons.codec.digest.B64Test
Tests run: 2, Failures: 0, Errors: 0, Skipped: 0, Time elapsed: 0.026 sec - in org.apache.commons.codec.digest.B64Test
Running org.apache.commons.codec.digest.DigestUtilsTest
Tests run: 17, Failures: 0, Errors: 0, Skipped: 0, Time elapsed: 0.657 sec - in org.apache.commons.codec.digest.DigestUtilsTest
Running org.apache.commons.codec.digest.Sha512CryptTest
Tests run: 8, Failures: 0, Errors: 0, Skipped: 0, Time elapsed: 0.472 sec - in org.apache.commons.codec.digest.Sha512CryptTest
Running org.apache.commons.codec.digest.Apr1CryptTest
Tests run: 8, Failures: 0, Errors: 0, Skipped: 0, Time elapsed: 0.05 sec - in org.apache.commons.codec.digest.Apr1CryptTest
Running org.apache.commons.codec.digest.HmacUtilsTest
Tests run: 24, Failures: 0, Errors: 0, Skipped: 0, Time elapsed: 0.037 sec - in org.apache.commons.codec.digest.HmacUtilsTest
Running org.apache.commons.codec.digest.Sha2CryptTest
Tests run: 1, Failures: 0, Errors: 0, Skipped: 0, Time elapsed: 0.001 sec - in org.apache.commons.codec.digest.Sha2CryptTest
Running org.apache.commons.codec.digest.CryptTest
Tests run: 4, Failures: 0, Errors: 0, Skipped: 0, Time elapsed: 0.084 sec - in org.apache.commons.codec.digest.CryptTest
Running org.apache.commons.codec.digest.Sha256CryptTest
Tests run: 7, Failures: 0, Errors: 0, Skipped: 0, Time elapsed: 0.109 sec - in org.apache.commons.codec.digest.Sha256CryptTest
Running org.apache.commons.codec.digest.Md5CryptTest
Tests run: 7, Failures: 0, Errors: 0, Skipped: 0, Time elapsed: 0.026 sec - in org.apache.commons.codec.digest.Md5CryptTest
Running org.apache.commons.codec.digest.UnixCryptTest
Tests run: 9, Failures: 0, Errors: 0, Skipped: 0, Time elapsed: 0.006 sec - in org.apache.commons.codec.digest.UnixCryptTest
Running org.apache.commons.codec.CharsetsTest
Tests run: 7, Failures: 0, Errors: 0, Skipped: 0, Time elapsed: 0.002 sec - in org.apache.commons.codec.CharsetsTest
Running org.apache.commons.codec.binary.Base32Test
Tests run: 8, Failures: 0, Errors: 0, Skipped: 0, Time elapsed: 0.003 sec - in org.apache.commons.codec.binary.Base32Test
Running org.apache.commons.codec.binary.Base64OutputStreamTest
Tests run: 7, Failures: 0, Errors: 0, Skipped: 0, Time elapsed: 0.208 sec - in org.apache.commons.codec.binary.Base64OutputStreamTest
Running org.apache.commons.codec.binary.Base64Codec13Test
Tests run: 8, Failures: 0, Errors: 0, Skipped: 0, Time elapsed: 0.01 sec - in org.apache.commons.codec.binary.Base64Codec13Test
Running org.apache.commons.codec.binary.Base64InputStreamTest
Tests run: 19, Failures: 0, Errors: 0, Skipped: 0, Time elapsed: 0.104 sec - in org.apache.commons.codec.binary.Base64InputStreamTest
Running org.apache.commons.codec.binary.Base32InputStreamTest
Tests run: 16, Failures: 0, Errors: 0, Skipped: 0, Time elapsed: 0.129 sec - in org.apache.commons.codec.binary.Base32InputStreamTest
Running org.apache.commons.codec.binary.Base32OutputStreamTest
Tests run: 6, Failures: 0, Errors: 0, Skipped: 0, Time elapsed: 0.083 sec - in org.apache.commons.codec.binary.Base32OutputStreamTest
Running org.apache.commons.codec.binary.BinaryCodecTest
Tests run: 13, Failures: 0, Errors: 0, Skipped: 0, Time elapsed: 0.013 sec - in org.apache.commons.codec.binary.BinaryCodecTest
Running org.apache.commons.codec.binary.BaseNCodecTest
Tests run: 7, Failures: 0, Errors: 0, Skipped: 0, Time elapsed: 0.002 sec - in org.apache.commons.codec.binary.BaseNCodecTest
Running org.apache.commons.codec.binary.StringUtilsTest
Tests run: 17, Failures: 0, Errors: 0, Skipped: 0, Time elapsed: 0.026 sec - in org.apache.commons.codec.binary.StringUtilsTest
Running org.apache.commons.codec.binary.Base64Test
Tests run: 53, Failures: 0, Errors: 0, Skipped: 1, Time elapsed: 0.043 sec - in org.apache.commons.codec.binary.Base64Test
Running org.apache.commons.codec.binary.HexTest
Tests run: 19, Failures: 0, Errors: 0, Skipped: 0, Time elapsed: 0.174 sec - in org.apache.commons.codec.binary.HexTest
Running org.apache.commons.codec.DecoderExceptionTest
Tests run: 4, Failures: 0, Errors: 0, Skipped: 0, Time elapsed: 0 sec - in org.apache.commons.codec.DecoderExceptionTest
Running org.apache.commons.codec.EncoderExceptionTest
Tests run: 4, Failures: 0, Errors: 0, Skipped: 0, Time elapsed: 0.001 sec - in org.apache.commons.codec.EncoderExceptionTest
Running org.apache.commons.codec.net.BCodecTest
Tests run: 9, Failures: 0, Errors: 0, Skipped: 0, Time elapsed: 0.005 sec - in org.apache.commons.codec.net.BCodecTest
Running org.apache.commons.codec.net.QCodecTest
Tests run: 12, Failures: 0, Errors: 0, Skipped: 0, Time elapsed: 0.007 sec - in org.apache.commons.codec.net.QCodecTest
Running org.apache.commons.codec.net.UtilsTest
Tests run: 1, Failures: 0, Errors: 0, Skipped: 0, Time elapsed: 0 sec - in org.apache.commons.codec.net.UtilsTest
Running org.apache.commons.codec.net.RFC1522CodecTest
Tests run: 2, Failures: 0, Errors: 0, Skipped: 0, Time elapsed: 0 sec - in org.apache.commons.codec.net.RFC1522CodecTest
Running org.apache.commons.codec.net.URLCodecTest
Tests run: 16, Failures: 0, Errors: 0, Skipped: 0, Time elapsed: 0.005 sec - in org.apache.commons.codec.net.URLCodecTest
Running org.apache.commons.codec.net.QuotedPrintableCodecTest
Tests run: 21, Failures: 0, Errors: 0, Skipped: 0, Time elapsed: 0.011 sec - in org.apache.commons.codec.net.QuotedPrintableCodecTest
Running org.apache.commons.codec.StringEncoderComparatorTest
Tests run: 3, Failures: 0, Errors: 1, Skipped: 0, Time elapsed: 0.009 sec <<< FAILURE! - in org.apache.commons.codec.StringEncoderComparatorTest
testComparatorWithSoundex(org.apache.commons.codec.StringEncoderComparatorTest)  Time elapsed: 0.008 sec  <<< ERROR!
java.lang.IllegalArgumentException: The character is not mapped: '
	at org.apache.commons.codec.language.Soundex.map(Soundex.java:232)
	at org.apache.commons.codec.language.Soundex.getMappingCode(Soundex.java:185)
	at org.apache.commons.codec.language.Soundex.soundex(Soundex.java:273)
	at org.apache.commons.codec.language.Soundex.encode(Soundex.java:153)
	at org.apache.commons.codec.StringEncoderComparator.compare(StringEncoderComparator.java:82)
	at org.apache.commons.codec.StringEncoderComparatorTest.testComparatorWithSoundex(StringEncoderComparatorTest.java:43)

Running org.apache.commons.codec.language.Caverphone1Test
Tests run: 9, Failures: 0, Errors: 0, Skipped: 0, Time elapsed: 0.024 sec - in org.apache.commons.codec.language.Caverphone1Test
Running org.apache.commons.codec.language.NysiisTest
Tests run: 23, Failures: 10, Errors: 0, Skipped: 0, Time elapsed: 0.018 sec <<< FAILURE! - in org.apache.commons.codec.language.NysiisTest
testCap(org.apache.commons.codec.language.NysiisTest)  Time elapsed: 0.002 sec  <<< FAILURE!
org.junit.ComparisonFailure: Problem with Capp expected:<C[AP]> but was:<C[ap]>
	at org.junit.Assert.assertEquals(Assert.java:115)
	at org.apache.commons.codec.language.NysiisTest.encodeAll(NysiisTest.java:57)
	at org.apache.commons.codec.language.NysiisTest.testCap(NysiisTest.java:68)

testDad(org.apache.commons.codec.language.NysiisTest)  Time elapsed: 0 sec  <<< FAILURE!
org.junit.ComparisonFailure: Problem with Dent expected:<D[AD]> but was:<D[ent]>
	at org.junit.Assert.assertEquals(Assert.java:115)
	at org.apache.commons.codec.language.NysiisTest.encodeAll(NysiisTest.java:57)
	at org.apache.commons.codec.language.NysiisTest.testDad(NysiisTest.java:75)

testDan(org.apache.commons.codec.language.NysiisTest)  Time elapsed: 0.001 sec  <<< FAILURE!
org.junit.ComparisonFailure: Problem with Dane expected:<D[AN]> but was:<D[ane]>
	at org.junit.Assert.assertEquals(Assert.java:115)
	at org.apache.commons.codec.language.NysiisTest.encodeAll(NysiisTest.java:57)
	at org.apache.commons.codec.language.NysiisTest.testDan(NysiisTest.java:80)

testFal(org.apache.commons.codec.language.NysiisTest)  Time elapsed: 0 sec  <<< FAILURE!
org.junit.ComparisonFailure: Problem with Phil expected:<[FAL]> but was:<[Phil]>
	at org.junit.Assert.assertEquals(Assert.java:115)
	at org.apache.commons.codec.language.NysiisTest.encodeAll(NysiisTest.java:57)
	at org.apache.commons.codec.language.NysiisTest.testFal(NysiisTest.java:149)

testBran(org.apache.commons.codec.language.NysiisTest)  Time elapsed: 0 sec  <<< FAILURE!
org.junit.ComparisonFailure: Problem with Brian expected:<B[RAN]> but was:<B[rian]>
	at org.junit.Assert.assertEquals(Assert.java:115)
	at org.apache.commons.codec.language.NysiisTest.encodeAll(NysiisTest.java:57)
	at org.apache.commons.codec.language.NysiisTest.testBran(NysiisTest.java:63)

testSnad(org.apache.commons.codec.language.NysiisTest)  Time elapsed: 0.001 sec  <<< FAILURE!
org.junit.ComparisonFailure: Problem with Schmidt expected:<S[NAD]> but was:<S[chmid]>
	at org.junit.Assert.assertEquals(Assert.java:115)
	at org.apache.commons.codec.language.NysiisTest.encodeAll(NysiisTest.java:57)
	at org.apache.commons.codec.language.NysiisTest.testSnad(NysiisTest.java:270)

testSnat(org.apache.commons.codec.language.NysiisTest)  Time elapsed: 0 sec  <<< FAILURE!
org.junit.ComparisonFailure: Problem with Smith expected:<S[NAT]> but was:<S[mith]>
	at org.junit.Assert.assertEquals(Assert.java:115)
	at org.apache.commons.codec.language.NysiisTest.encodeAll(NysiisTest.java:57)
	at org.apache.commons.codec.language.NysiisTest.testSnat(NysiisTest.java:275)

testOthers(org.apache.commons.codec.language.NysiisTest)  Time elapsed: 0 sec  <<< FAILURE!
org.junit.ComparisonFailure: Problem with O'Daniel expected:<O[DANAL]> but was:<O['Daniel]>
	at org.junit.Assert.assertEquals(Assert.java:115)
	at org.apache.commons.codec.language.NysiisTest.assertEncodings(NysiisTest.java:46)
	at org.apache.commons.codec.language.NysiisTest.testOthers(NysiisTest.java:159)

testTranan(org.apache.commons.codec.language.NysiisTest)  Time elapsed: 0 sec  <<< FAILURE!
org.junit.ComparisonFailure: Problem with Trueman expected:<T[RANAN]> but was:<T[ruema]>
	at org.junit.Assert.assertEquals(Assert.java:115)
	at org.apache.commons.codec.language.NysiisTest.encodeAll(NysiisTest.java:57)
	at org.apache.commons.codec.language.NysiisTest.testTranan(NysiisTest.java:291)

testSpecialBranches(org.apache.commons.codec.language.NysiisTest)  Time elapsed: 0.001 sec  <<< FAILURE!
org.junit.ComparisonFailure: Problem with Kobwick expected:<C[ABWAC]> but was:<C[obwic]>
	at org.junit.Assert.assertEquals(Assert.java:115)
	at org.apache.commons.codec.language.NysiisTest.encodeAll(NysiisTest.java:57)
	at org.apache.commons.codec.language.NysiisTest.testSpecialBranches(NysiisTest.java:280)

Running org.apache.commons.codec.language.Caverphone2Test
Tests run: 13, Failures: 0, Errors: 0, Skipped: 0, Time elapsed: 0.132 sec - in org.apache.commons.codec.language.Caverphone2Test
Running org.apache.commons.codec.language.DaitchMokotoffSoundexTest
Tests run: 13, Failures: 0, Errors: 0, Skipped: 0, Time elapsed: 0.053 sec - in org.apache.commons.codec.language.DaitchMokotoffSoundexTest
Running org.apache.commons.codec.language.bm.BeiderMorseEncoderTest
Tests run: 22, Failures: 0, Errors: 0, Skipped: 0, Time elapsed: 2.95 sec - in org.apache.commons.codec.language.bm.BeiderMorseEncoderTest
Running org.apache.commons.codec.language.bm.PhoneticEngineTest
Tests run: 8, Failures: 0, Errors: 0, Skipped: 0, Time elapsed: 0.022 sec - in org.apache.commons.codec.language.bm.PhoneticEngineTest
Running org.apache.commons.codec.language.bm.PhoneticEngineRegressionTest
Tests run: 4, Failures: 0, Errors: 0, Skipped: 0, Time elapsed: 0.017 sec - in org.apache.commons.codec.language.bm.PhoneticEngineRegressionTest
Running org.apache.commons.codec.language.bm.RuleTest
Tests run: 3, Failures: 0, Errors: 0, Skipped: 0, Time elapsed: 0.002 sec - in org.apache.commons.codec.language.bm.RuleTest
Running org.apache.commons.codec.language.bm.LanguageGuessingTest
Tests run: 18, Failures: 0, Errors: 0, Skipped: 0, Time elapsed: 0.015 sec - in org.apache.commons.codec.language.bm.LanguageGuessingTest
Running org.apache.commons.codec.language.DoubleMetaphoneTest
Tests run: 16, Failures: 0, Errors: 0, Skipped: 0, Time elapsed: 0.056 sec - in org.apache.commons.codec.language.DoubleMetaphoneTest
Running org.apache.commons.codec.language.SoundexTest
Tests run: 28, Failures: 0, Errors: 22, Skipped: 0, Time elapsed: 0.014 sec <<< FAILURE! - in org.apache.commons.codec.language.SoundexTest
testBadCharacters(org.apache.commons.codec.language.SoundexTest)  Time elapsed: 0 sec  <<< ERROR!
java.lang.IllegalArgumentException: The character is not mapped: >
	at org.apache.commons.codec.language.Soundex.map(Soundex.java:232)
	at org.apache.commons.codec.language.Soundex.getMappingCode(Soundex.java:185)
	at org.apache.commons.codec.language.Soundex.soundex(Soundex.java:273)
	at org.apache.commons.codec.language.Soundex.encode(Soundex.java:167)
	at org.apache.commons.codec.language.SoundexTest.testBadCharacters(SoundexTest.java:88)

testUsEnglishStatic(org.apache.commons.codec.language.SoundexTest)  Time elapsed: 0.001 sec  <<< ERROR!
java.lang.IllegalArgumentException: The character is not mapped: i
	at org.apache.commons.codec.language.Soundex.map(Soundex.java:232)
	at org.apache.commons.codec.language.Soundex.getMappingCode(Soundex.java:185)
	at org.apache.commons.codec.language.Soundex.soundex(Soundex.java:273)
	at org.apache.commons.codec.language.SoundexTest.testUsEnglishStatic(SoundexTest.java:346)

testMsSqlServer1(org.apache.commons.codec.language.SoundexTest)  Time elapsed: 0 sec  <<< ERROR!
java.lang.IllegalArgumentException: The character is not mapped: m
	at org.apache.commons.codec.language.Soundex.map(Soundex.java:232)
	at org.apache.commons.codec.language.Soundex.getMappingCode(Soundex.java:185)
	at org.apache.commons.codec.language.Soundex.soundex(Soundex.java:273)
	at org.apache.commons.codec.language.Soundex.encode(Soundex.java:167)
	at org.apache.commons.codec.language.SoundexTest.testMsSqlServer1(SoundexTest.java:278)

testMsSqlServer2(org.apache.commons.codec.language.SoundexTest)  Time elapsed: 0.001 sec  <<< ERROR!
java.lang.IllegalArgumentException: The character is not mapped: r
	at org.apache.commons.codec.language.Soundex.map(Soundex.java:232)
	at org.apache.commons.codec.language.Soundex.getMappingCode(Soundex.java:185)
	at org.apache.commons.codec.language.Soundex.soundex(Soundex.java:273)
	at org.apache.commons.codec.language.Soundex.encode(Soundex.java:167)
	at org.apache.commons.codec.StringEncoderAbstractTest.checkEncoding(StringEncoderAbstractTest.java:33)
	at org.apache.commons.codec.StringEncoderAbstractTest.checkEncodingVariations(StringEncoderAbstractTest.java:44)
	at org.apache.commons.codec.language.SoundexTest.testMsSqlServer2(SoundexTest.java:291)

testMsSqlServer3(org.apache.commons.codec.language.SoundexTest)  Time elapsed: 0 sec  <<< ERROR!
java.lang.IllegalArgumentException: The character is not mapped: n
	at org.apache.commons.codec.language.Soundex.map(Soundex.java:232)
	at org.apache.commons.codec.language.Soundex.getMappingCode(Soundex.java:185)
	at org.apache.commons.codec.language.Soundex.soundex(Soundex.java:273)
	at org.apache.commons.codec.language.Soundex.encode(Soundex.java:167)
	at org.apache.commons.codec.language.SoundexTest.testMsSqlServer3(SoundexTest.java:299)

testEncodeBatch2(org.apache.commons.codec.language.SoundexTest)  Time elapsed: 0 sec  <<< ERROR!
java.lang.IllegalArgumentException: The character is not mapped: l
	at org.apache.commons.codec.language.Soundex.map(Soundex.java:232)
	at org.apache.commons.codec.language.Soundex.getMappingCode(Soundex.java:185)
	at org.apache.commons.codec.language.Soundex.soundex(Soundex.java:273)
	at org.apache.commons.codec.language.Soundex.encode(Soundex.java:167)
	at org.apache.commons.codec.language.SoundexTest.testEncodeBatch2(SoundexTest.java:131)

testEncodeBatch3(org.apache.commons.codec.language.SoundexTest)  Time elapsed: 0.001 sec  <<< ERROR!
java.lang.IllegalArgumentException: The character is not mapped: a
	at org.apache.commons.codec.language.Soundex.map(Soundex.java:232)
	at org.apache.commons.codec.language.Soundex.getMappingCode(Soundex.java:185)
	at org.apache.commons.codec.language.Soundex.soundex(Soundex.java:273)
	at org.apache.commons.codec.language.Soundex.encode(Soundex.java:167)
	at org.apache.commons.codec.language.SoundexTest.testEncodeBatch3(SoundexTest.java:154)

testEncodeIgnoreHyphens(org.apache.commons.codec.language.SoundexTest)  Time elapsed: 0.001 sec  <<< ERROR!
java.lang.IllegalArgumentException: The character is not mapped: -
	at org.apache.commons.codec.language.Soundex.map(Soundex.java:232)
	at org.apache.commons.codec.language.Soundex.getMappingCode(Soundex.java:185)
	at org.apache.commons.codec.language.Soundex.soundex(Soundex.java:271)
	at org.apache.commons.codec.language.Soundex.encode(Soundex.java:167)
	at org.apache.commons.codec.StringEncoderAbstractTest.checkEncoding(StringEncoderAbstractTest.java:33)
	at org.apache.commons.codec.StringEncoderAbstractTest.checkEncodingVariations(StringEncoderAbstractTest.java:44)
	at org.apache.commons.codec.language.SoundexTest.testEncodeIgnoreHyphens(SoundexTest.java:201)

testEncodeIgnoreTrimmable(org.apache.commons.codec.language.SoundexTest)  Time elapsed: 0 sec  <<< ERROR!
java.lang.IllegalArgumentException: The character is not mapped:  
	at org.apache.commons.codec.language.Soundex.map(Soundex.java:232)
	at org.apache.commons.codec.language.Soundex.getMappingCode(Soundex.java:185)
	at org.apache.commons.codec.language.Soundex.soundex(Soundex.java:271)
	at org.apache.commons.codec.language.Soundex.encode(Soundex.java:167)
	at org.apache.commons.codec.language.SoundexTest.testEncodeIgnoreTrimmable(SoundexTest.java:217)

testEncodeIgnoreApostrophes(org.apache.commons.codec.language.SoundexTest)  Time elapsed: 0.001 sec  <<< ERROR!
java.lang.IllegalArgumentException: The character is not mapped: r
	at org.apache.commons.codec.language.Soundex.map(Soundex.java:232)
	at org.apache.commons.codec.language.Soundex.getMappingCode(Soundex.java:185)
	at org.apache.commons.codec.language.Soundex.soundex(Soundex.java:273)
	at org.apache.commons.codec.language.Soundex.encode(Soundex.java:167)
	at org.apache.commons.codec.StringEncoderAbstractTest.checkEncoding(StringEncoderAbstractTest.java:33)
	at org.apache.commons.codec.StringEncoderAbstractTest.checkEncodingVariations(StringEncoderAbstractTest.java:44)
	at org.apache.commons.codec.language.SoundexTest.testEncodeIgnoreApostrophes(SoundexTest.java:183)

testDifference(org.apache.commons.codec.language.SoundexTest)  Time elapsed: 0 sec  <<< ERROR!
java.lang.IllegalArgumentException: The character is not mapped:  
	at org.apache.commons.codec.language.Soundex.map(Soundex.java:232)
	at org.apache.commons.codec.language.Soundex.getMappingCode(Soundex.java:185)
	at org.apache.commons.codec.language.Soundex.soundex(Soundex.java:271)
	at org.apache.commons.codec.language.Soundex.encode(Soundex.java:167)
	at org.apache.commons.codec.language.SoundexUtils.difference(SoundexUtils.java:20)
	at org.apache.commons.codec.language.Soundex.difference(Soundex.java:132)
	at org.apache.commons.codec.language.SoundexTest.testDifference(SoundexTest.java:97)

testNewInstance(org.apache.commons.codec.language.SoundexTest)  Time elapsed: 0.001 sec  <<< ERROR!
java.lang.IllegalArgumentException: The character is not mapped: i
	at org.apache.commons.codec.language.Soundex.map(Soundex.java:232)
	at org.apache.commons.codec.language.Soundex.getMappingCode(Soundex.java:185)
	at org.apache.commons.codec.language.Soundex.soundex(Soundex.java:273)
	at org.apache.commons.codec.language.SoundexTest.testNewInstance(SoundexTest.java:315)

testEncodeBasic(org.apache.commons.codec.language.SoundexTest)  Time elapsed: 0.001 sec  <<< ERROR!
java.lang.IllegalArgumentException: The character is not mapped: t
	at org.apache.commons.codec.language.Soundex.map(Soundex.java:232)
	at org.apache.commons.codec.language.Soundex.getMappingCode(Soundex.java:185)
	at org.apache.commons.codec.language.Soundex.soundex(Soundex.java:271)
	at org.apache.commons.codec.language.Soundex.encode(Soundex.java:167)
	at org.apache.commons.codec.language.SoundexTest.testEncodeBasic(SoundexTest.java:114)

testUsMappingEWithAcute(org.apache.commons.codec.language.SoundexTest)  Time elapsed: 0 sec  <<< ERROR!
java.lang.IllegalArgumentException: The character is not mapped: e
	at org.apache.commons.codec.language.Soundex.map(Soundex.java:232)
	at org.apache.commons.codec.language.Soundex.getMappingCode(Soundex.java:185)
	at org.apache.commons.codec.language.Soundex.soundex(Soundex.java:271)
	at org.apache.commons.codec.language.Soundex.encode(Soundex.java:167)
	at org.apache.commons.codec.language.SoundexTest.testUsMappingEWithAcute(SoundexTest.java:356)

testNewInstance2(org.apache.commons.codec.language.SoundexTest)  Time elapsed: 0.001 sec  <<< ERROR!
java.lang.IllegalArgumentException: The character is not mapped: i
	at org.apache.commons.codec.language.Soundex.map(Soundex.java:232)
	at org.apache.commons.codec.language.Soundex.getMappingCode(Soundex.java:185)
	at org.apache.commons.codec.language.Soundex.soundex(Soundex.java:273)
	at org.apache.commons.codec.language.SoundexTest.testNewInstance2(SoundexTest.java:320)

testNewInstance3(org.apache.commons.codec.language.SoundexTest)  Time elapsed: 0 sec  <<< ERROR!
java.lang.IllegalArgumentException: The character is not mapped: i
	at org.apache.commons.codec.language.Soundex.map(Soundex.java:232)
	at org.apache.commons.codec.language.Soundex.getMappingCode(Soundex.java:185)
	at org.apache.commons.codec.language.Soundex.soundex(Soundex.java:273)
	at org.apache.commons.codec.language.SoundexTest.testNewInstance3(SoundexTest.java:325)

testUsMappingOWithDiaeresis(org.apache.commons.codec.language.SoundexTest)  Time elapsed: 0 sec  <<< ERROR!
java.lang.IllegalArgumentException: The character is not mapped: o
	at org.apache.commons.codec.language.Soundex.map(Soundex.java:232)
	at org.apache.commons.codec.language.Soundex.getMappingCode(Soundex.java:185)
	at org.apache.commons.codec.language.Soundex.soundex(Soundex.java:271)
	at org.apache.commons.codec.language.Soundex.encode(Soundex.java:167)
	at org.apache.commons.codec.language.SoundexTest.testUsMappingOWithDiaeresis(SoundexTest.java:377)

testHWRuleEx1(org.apache.commons.codec.language.SoundexTest)  Time elapsed: 0.001 sec  <<< ERROR!
java.lang.IllegalArgumentException: The character is not mapped: s
	at org.apache.commons.codec.language.Soundex.map(Soundex.java:232)
	at org.apache.commons.codec.language.Soundex.getMappingCode(Soundex.java:185)
	at org.apache.commons.codec.language.Soundex.soundex(Soundex.java:273)
	at org.apache.commons.codec.language.Soundex.encode(Soundex.java:167)
	at org.apache.commons.codec.language.SoundexTest.testHWRuleEx1(SoundexTest.java:229)

testHWRuleEx2(org.apache.commons.codec.language.SoundexTest)  Time elapsed: 0 sec  <<< ERROR!
java.lang.IllegalArgumentException: The character is not mapped: -
	at org.apache.commons.codec.language.Soundex.map(Soundex.java:232)
	at org.apache.commons.codec.language.Soundex.getMappingCode(Soundex.java:185)
	at org.apache.commons.codec.language.Soundex.soundex(Soundex.java:273)
	at org.apache.commons.codec.language.Soundex.encode(Soundex.java:167)
	at org.apache.commons.codec.language.SoundexTest.testHWRuleEx2(SoundexTest.java:240)

testHWRuleEx3(org.apache.commons.codec.language.SoundexTest)  Time elapsed: 0 sec  <<< ERROR!
java.lang.IllegalArgumentException: The character is not mapped: g
	at org.apache.commons.codec.language.Soundex.map(Soundex.java:232)
	at org.apache.commons.codec.language.Soundex.getMappingCode(Soundex.java:185)
	at org.apache.commons.codec.language.Soundex.soundex(Soundex.java:273)
	at org.apache.commons.codec.language.Soundex.encode(Soundex.java:167)
	at org.apache.commons.codec.language.SoundexTest.testHWRuleEx3(SoundexTest.java:250)

testEncodeEmpty(org.apache.commons.codec.language.SoundexTest)  Time elapsed: 0 sec  <<< ERROR!
java.lang.IllegalArgumentException: The character is not mapped:  
	at org.apache.commons.codec.language.Soundex.map(Soundex.java:232)
	at org.apache.commons.codec.language.Soundex.getMappingCode(Soundex.java:185)
	at org.apache.commons.codec.language.Soundex.soundex(Soundex.java:271)
	at org.apache.commons.codec.language.Soundex.encode(Soundex.java:153)
	at org.apache.commons.codec.StringEncoderAbstractTest.testEncodeEmpty(StringEncoderAbstractTest.java:58)
	at sun.reflect.NativeMethodAccessorImpl.invoke0(Native Method)
	at sun.reflect.NativeMethodAccessorImpl.invoke(NativeMethodAccessorImpl.java:57)
	at sun.reflect.DelegatingMethodAccessorImpl.invoke(DelegatingMethodAccessorImpl.java:43)
	at java.lang.reflect.Method.invoke(Method.java:606)
	at org.junit.runners.model.FrameworkMethod$1.runReflectiveCall(FrameworkMethod.java:47)
	at org.junit.internal.runners.model.ReflectiveCallable.run(ReflectiveCallable.java:12)
	at org.junit.runners.model.FrameworkMethod.invokeExplosively(FrameworkMethod.java:44)
	at org.junit.internal.runners.statements.InvokeMethod.evaluate(InvokeMethod.java:17)
	at org.junit.runners.ParentRunner.runLeaf(ParentRunner.java:271)
	at org.junit.runners.BlockJUnit4ClassRunner.runChild(BlockJUnit4ClassRunner.java:70)
	at org.junit.runners.BlockJUnit4ClassRunner.runChild(BlockJUnit4ClassRunner.java:50)
	at org.junit.runners.ParentRunner$3.run(ParentRunner.java:238)
	at org.junit.runners.ParentRunner$1.schedule(ParentRunner.java:63)
	at org.junit.runners.ParentRunner.runChildren(ParentRunner.java:236)
	at org.junit.runners.ParentRunner.access$000(ParentRunner.java:53)
	at org.junit.runners.ParentRunner$2.evaluate(ParentRunner.java:229)
	at org.junit.runners.ParentRunner.run(ParentRunner.java:309)
	at org.apache.maven.surefire.junit4.JUnit4Provider.execute(JUnit4Provider.java:264)
	at org.apache.maven.surefire.junit4.JUnit4Provider.executeTestSet(JUnit4Provider.java:153)
	at org.apache.maven.surefire.junit4.JUnit4Provider.invoke(JUnit4Provider.java:124)
	at org.apache.maven.surefire.booter.ForkedBooter.invokeProviderInSameClassLoader(ForkedBooter.java:200)
	at org.apache.maven.surefire.booter.ForkedBooter.runSuitesInProcess(ForkedBooter.java:153)
	at org.apache.maven.surefire.booter.ForkedBooter.main(ForkedBooter.java:103)

testLocaleIndependence(org.apache.commons.codec.language.SoundexTest)  Time elapsed: 0.001 sec  <<< ERROR!
java.lang.IllegalArgumentException: The character is not mapped: i
	at org.apache.commons.codec.language.Soundex.map(Soundex.java:232)
	at org.apache.commons.codec.language.Soundex.getMappingCode(Soundex.java:185)
	at org.apache.commons.codec.language.Soundex.soundex(Soundex.java:271)
	at org.apache.commons.codec.language.Soundex.encode(Soundex.java:167)
	at org.apache.commons.codec.StringEncoderAbstractTest.testLocaleIndependence(StringEncoderAbstractTest.java:99)
	at sun.reflect.NativeMethodAccessorImpl.invoke0(Native Method)
	at sun.reflect.NativeMethodAccessorImpl.invoke(NativeMethodAccessorImpl.java:57)
	at sun.reflect.DelegatingMethodAccessorImpl.invoke(DelegatingMethodAccessorImpl.java:43)
	at java.lang.reflect.Method.invoke(Method.java:606)
	at org.junit.runners.model.FrameworkMethod$1.runReflectiveCall(FrameworkMethod.java:47)
	at org.junit.internal.runners.model.ReflectiveCallable.run(ReflectiveCallable.java:12)
	at org.junit.runners.model.FrameworkMethod.invokeExplosively(FrameworkMethod.java:44)
	at org.junit.internal.runners.statements.InvokeMethod.evaluate(InvokeMethod.java:17)
	at org.junit.runners.ParentRunner.runLeaf(ParentRunner.java:271)
	at org.junit.runners.BlockJUnit4ClassRunner.runChild(BlockJUnit4ClassRunner.java:70)
	at org.junit.runners.BlockJUnit4ClassRunner.runChild(BlockJUnit4ClassRunner.java:50)
	at org.junit.runners.ParentRunner$3.run(ParentRunner.java:238)
	at org.junit.runners.ParentRunner$1.schedule(ParentRunner.java:63)
	at org.junit.runners.ParentRunner.runChildren(ParentRunner.java:236)
	at org.junit.runners.ParentRunner.access$000(ParentRunner.java:53)
	at org.junit.runners.ParentRunner$2.evaluate(ParentRunner.java:229)
	at org.junit.runners.ParentRunner.run(ParentRunner.java:309)
	at org.apache.maven.surefire.junit4.JUnit4Provider.execute(JUnit4Provider.java:264)
	at org.apache.maven.surefire.junit4.JUnit4Provider.executeTestSet(JUnit4Provider.java:153)
	at org.apache.maven.surefire.junit4.JUnit4Provider.invoke(JUnit4Provider.java:124)
	at org.apache.maven.surefire.booter.ForkedBooter.invokeProviderInSameClassLoader(ForkedBooter.java:200)
	at org.apache.maven.surefire.booter.ForkedBooter.runSuitesInProcess(ForkedBooter.java:153)
	at org.apache.maven.surefire.booter.ForkedBooter.main(ForkedBooter.java:103)

Running org.apache.commons.codec.language.RefinedSoundexTest
Tests run: 10, Failures: 5, Errors: 0, Skipped: 0, Time elapsed: 0 sec <<< FAILURE! - in org.apache.commons.codec.language.RefinedSoundexTest
testDifference(org.apache.commons.codec.language.RefinedSoundexTest)  Time elapsed: 0 sec  <<< FAILURE!
java.lang.AssertionError: expected:<0> but was:<1>
	at org.junit.Assert.fail(Assert.java:88)
	at org.junit.Assert.failNotEquals(Assert.java:743)
	at org.junit.Assert.assertEquals(Assert.java:118)
	at org.junit.Assert.assertEquals(Assert.java:555)
	at org.junit.Assert.assertEquals(Assert.java:542)
	at org.apache.commons.codec.language.RefinedSoundexTest.testDifference(RefinedSoundexTest.java:43)

testNewInstance(org.apache.commons.codec.language.RefinedSoundexTest)  Time elapsed: 0 sec  <<< FAILURE!
org.junit.ComparisonFailure: expected:<[D]6043> but was:<[d]6043>
	at org.junit.Assert.assertEquals(Assert.java:115)
	at org.junit.Assert.assertEquals(Assert.java:144)
	at org.apache.commons.codec.language.RefinedSoundexTest.testNewInstance(RefinedSoundexTest.java:86)

testEncode(org.apache.commons.codec.language.RefinedSoundexTest)  Time elapsed: 0 sec  <<< FAILURE!
org.junit.ComparisonFailure: expected:<[T]6036084> but was:<[t]6036084>
	at org.junit.Assert.assertEquals(Assert.java:115)
	at org.junit.Assert.assertEquals(Assert.java:144)
	at org.apache.commons.codec.language.RefinedSoundexTest.testEncode(RefinedSoundexTest.java:62)

testNewInstance2(org.apache.commons.codec.language.RefinedSoundexTest)  Time elapsed: 0 sec  <<< FAILURE!
org.junit.ComparisonFailure: expected:<[D]6043> but was:<[d]6043>
	at org.junit.Assert.assertEquals(Assert.java:115)
	at org.junit.Assert.assertEquals(Assert.java:144)
	at org.apache.commons.codec.language.RefinedSoundexTest.testNewInstance2(RefinedSoundexTest.java:91)

testNewInstance3(org.apache.commons.codec.language.RefinedSoundexTest)  Time elapsed: 0 sec  <<< FAILURE!
org.junit.ComparisonFailure: expected:<[D]6043> but was:<[d]6043>
	at org.junit.Assert.assertEquals(Assert.java:115)
	at org.junit.Assert.assertEquals(Assert.java:144)
	at org.apache.commons.codec.language.RefinedSoundexTest.testNewInstance3(RefinedSoundexTest.java:96)

Running org.apache.commons.codec.language.MatchRatingApproachEncoderTest
Tests run: 96, Failures: 0, Errors: 0, Skipped: 0, Time elapsed: 0.03 sec - in org.apache.commons.codec.language.MatchRatingApproachEncoderTest
Running org.apache.commons.codec.language.ColognePhoneticTest
Tests run: 13, Failures: 0, Errors: 0, Skipped: 0, Time elapsed: 0.002 sec - in org.apache.commons.codec.language.ColognePhoneticTest
Running org.apache.commons.codec.language.DoubleMetaphone2Test
Tests run: 6, Failures: 0, Errors: 0, Skipped: 0, Time elapsed: 0.039 sec - in org.apache.commons.codec.language.DoubleMetaphone2Test
Running org.apache.commons.codec.language.MetaphoneTest
Tests run: 34, Failures: 0, Errors: 0, Skipped: 0, Time elapsed: 0.128 sec - in org.apache.commons.codec.language.MetaphoneTest
Running org.apache.commons.codec.CharEncodingTest
Tests run: 7, Failures: 0, Errors: 0, Skipped: 0, Time elapsed: 0.001 sec - in org.apache.commons.codec.CharEncodingTest

Results :

Failed tests: 
  NysiisTest.testCap:68->encodeAll:57 Problem with Capp expected:<C[AP]> but was:<C[ap]>
  NysiisTest.testDad:75->encodeAll:57 Problem with Dent expected:<D[AD]> but was:<D[ent]>
  NysiisTest.testDan:80->encodeAll:57 Problem with Dane expected:<D[AN]> but was:<D[ane]>
  NysiisTest.testFal:149->encodeAll:57 Problem with Phil expected:<[FAL]> but was:<[Phil]>
  NysiisTest.testBran:63->encodeAll:57 Problem with Brian expected:<B[RAN]> but was:<B[rian]>
  NysiisTest.testSnad:270->encodeAll:57 Problem with Schmidt expected:<S[NAD]> but was:<S[chmid]>
  NysiisTest.testSnat:275->encodeAll:57 Problem with Smith expected:<S[NAT]> but was:<S[mith]>
  NysiisTest.testOthers:159->assertEncodings:46 Problem with O'Daniel expected:<O[DANAL]> but was:<O['Daniel]>
  NysiisTest.testTranan:291->encodeAll:57 Problem with Trueman expected:<T[RANAN]> but was:<T[ruema]>
  NysiisTest.testSpecialBranches:280->encodeAll:57 Problem with Kobwick expected:<C[ABWAC]> but was:<C[obwic]>
  RefinedSoundexTest.testDifference:43 expected:<0> but was:<1>
  RefinedSoundexTest.testNewInstance:86 expected:<[D]6043> but was:<[d]6043>
  RefinedSoundexTest.testEncode:62 expected:<[T]6036084> but was:<[t]6036084>
  RefinedSoundexTest.testNewInstance2:91 expected:<[D]6043> but was:<[d]6043>
  RefinedSoundexTest.testNewInstance3:96 expected:<[D]6043> but was:<[d]6043>

Tests in error: 
  StringEncoderComparatorTest.testComparatorWithSoundex:43 » IllegalArgument The...
  SoundexTest.testBadCharacters:88 » IllegalArgument The character is not mapped...
  SoundexTest.testUsEnglishStatic:346 » IllegalArgument The character is not map...
  SoundexTest.testMsSqlServer1:278 » IllegalArgument The character is not mapped...
  SoundexTest.testMsSqlServer2:291->StringEncoderAbstractTest.checkEncodingVariations:44->StringEncoderAbstractTest.checkEncoding:33 » IllegalArgument
  SoundexTest.testMsSqlServer3:299 » IllegalArgument The character is not mapped...
  SoundexTest.testEncodeBatch2:131 » IllegalArgument The character is not mapped...
  SoundexTest.testEncodeBatch3:154 » IllegalArgument The character is not mapped...
  SoundexTest.testEncodeIgnoreHyphens:201->StringEncoderAbstractTest.checkEncodingVariations:44->StringEncoderAbstractTest.checkEncoding:33 » IllegalArgument
  SoundexTest.testEncodeIgnoreTrimmable:217 » IllegalArgument The character is n...
  SoundexTest.testEncodeIgnoreApostrophes:183->StringEncoderAbstractTest.checkEncodingVariations:44->StringEncoderAbstractTest.checkEncoding:33 » IllegalArgument
  SoundexTest.testDifference:97 » IllegalArgument The character is not mapped:  
  SoundexTest.testNewInstance:315 » IllegalArgument The character is not mapped:...
  SoundexTest.testEncodeBasic:114 » IllegalArgument The character is not mapped:...
  SoundexTest.testUsMappingEWithAcute:356 » IllegalArgument The character is not...
  SoundexTest.testNewInstance2:320 » IllegalArgument The character is not mapped...
  SoundexTest.testNewInstance3:325 » IllegalArgument The character is not mapped...
  SoundexTest.testUsMappingOWithDiaeresis:377 » IllegalArgument The character is...
  SoundexTest.testHWRuleEx1:229 » IllegalArgument The character is not mapped: s
  SoundexTest.testHWRuleEx2:240 » IllegalArgument The character is not mapped: -
  SoundexTest.testHWRuleEx3:250 » IllegalArgument The character is not mapped: g
  SoundexTest>StringEncoderAbstractTest.testEncodeEmpty:58 » IllegalArgument The...
  SoundexTest>StringEncoderAbstractTest.testLocaleIndependence:99 » IllegalArgument

Tests run: 662, Failures: 15, Errors: 23, Skipped: 1

[INFO] ------------------------------------------------------------------------
[INFO] BUILD FAILURE
[INFO] ------------------------------------------------------------------------
[INFO] Total time: 13.839s
[INFO] Finished at: Sun Aug 02 13:01:25 BST 2015
[INFO] Final Memory: 21M/344M
[INFO] ------------------------------------------------------------------------
[ERROR] Failed to execute goal org.apache.maven.plugins:maven-surefire-plugin:2.17:test (default-test) on project commons-codec: There are test failures.
[ERROR] 
[ERROR] Please refer to /home/perham/Study/LittleDarwin/Cases/commons-codec-1.10-src/target/surefire-reports for the individual test results.
[ERROR] -> [Help 1]
[ERROR] 
[ERROR] To see the full stack trace of the errors, re-run Maven with the -e switch.
[ERROR] Re-run Maven using the -X switch to enable full debug logging.
[ERROR] 
[ERROR] For more information about the errors and possible solutions, please read the following articles:
[ERROR] [Help 1] http://cwiki.apache.org/confluence/display/MAVEN/MojoFailureException
