[INFO] Scanning for projects...
[INFO]                                                                         
[INFO] ------------------------------------------------------------------------
[INFO] Building Apache Commons Codec 1.10
[INFO] ------------------------------------------------------------------------
[INFO] 
[INFO] --- maven-enforcer-plugin:1.3.1:enforce (enforce-maven-3) @ commons-codec ---
[INFO] 
[INFO] --- maven-antrun-plugin:1.7:run (javadoc.resources) @ commons-codec ---
[INFO] Executing tasks

main:
[INFO] Executed tasks
[INFO] 
[INFO] --- maven-remote-resources-plugin:1.5:process (default) @ commons-codec ---
[INFO] 
[INFO] --- buildnumber-maven-plugin:1.3:create (default) @ commons-codec ---
[INFO] Executing: /bin/sh -c cd /home/perham/Study/LittleDarwin/Cases/commons-codec-1.10-src && svn --non-interactive info
[INFO] Working directory: /home/perham/Study/LittleDarwin/Cases/commons-codec-1.10-src
[INFO] Storing buildNumber: ?????? at timestamp: 1438516858331
[INFO] Executing: /bin/sh -c cd /home/perham/Study/LittleDarwin/Cases/commons-codec-1.10-src && svn --non-interactive info
[INFO] Working directory: /home/perham/Study/LittleDarwin/Cases/commons-codec-1.10-src
[INFO] Storing buildScmBranch: UNKNOWN_BRANCH
[INFO] 
[INFO] --- maven-resources-plugin:2.7:resources (default-resources) @ commons-codec ---
[INFO] Using 'UTF-8' encoding to copy filtered resources.
[INFO] Copying 128 resources
[INFO] Copying 2 resources to META-INF
[INFO] 
[INFO] --- maven-compiler-plugin:3.2:compile (default-compile) @ commons-codec ---
[INFO] Changes detected - recompiling the module!
[INFO] Compiling 60 source files to /home/perham/Study/LittleDarwin/Cases/commons-codec-1.10-src/target/classes
[INFO] /home/perham/Study/LittleDarwin/Cases/commons-codec-1.10-src/src/main/java/org/apache/commons/codec/digest/Sha2Crypt.java: Some input files use or override a deprecated API.
[INFO] /home/perham/Study/LittleDarwin/Cases/commons-codec-1.10-src/src/main/java/org/apache/commons/codec/digest/Sha2Crypt.java: Recompile with -Xlint:deprecation for details.
[INFO] 
[INFO] --- maven-bundle-plugin:2.5.3:manifest (bundle-manifest) @ commons-codec ---
[INFO] 
[INFO] --- maven-resources-plugin:2.7:testResources (default-testResources) @ commons-codec ---
[INFO] Using 'UTF-8' encoding to copy filtered resources.
[INFO] skip non existing resourceDirectory /home/perham/Study/LittleDarwin/Cases/commons-codec-1.10-src/src/test/resources
[INFO] Copying 2 resources to META-INF
[INFO] 
[INFO] --- maven-compiler-plugin:3.2:testCompile (default-testCompile) @ commons-codec ---
[INFO] Nothing to compile - all classes are up to date
[INFO] 
[INFO] --- maven-surefire-plugin:2.17:test (default-test) @ commons-codec ---
[INFO] Surefire report directory: /home/perham/Study/LittleDarwin/Cases/commons-codec-1.10-src/target/surefire-reports

-------------------------------------------------------
 T E S T S
-------------------------------------------------------
Running org.apache.commons.codec.digest.B64Test
Tests run: 2, Failures: 0, Errors: 0, Skipped: 0, Time elapsed: 0.027 sec - in org.apache.commons.codec.digest.B64Test
Running org.apache.commons.codec.digest.DigestUtilsTest
Tests run: 17, Failures: 0, Errors: 0, Skipped: 0, Time elapsed: 0.644 sec - in org.apache.commons.codec.digest.DigestUtilsTest
Running org.apache.commons.codec.digest.Sha512CryptTest
Tests run: 8, Failures: 0, Errors: 0, Skipped: 0, Time elapsed: 0.492 sec - in org.apache.commons.codec.digest.Sha512CryptTest
Running org.apache.commons.codec.digest.Apr1CryptTest
Tests run: 8, Failures: 0, Errors: 0, Skipped: 0, Time elapsed: 0.058 sec - in org.apache.commons.codec.digest.Apr1CryptTest
Running org.apache.commons.codec.digest.HmacUtilsTest
Tests run: 24, Failures: 0, Errors: 0, Skipped: 0, Time elapsed: 0.051 sec - in org.apache.commons.codec.digest.HmacUtilsTest
Running org.apache.commons.codec.digest.Sha2CryptTest
Tests run: 1, Failures: 0, Errors: 0, Skipped: 0, Time elapsed: 0 sec - in org.apache.commons.codec.digest.Sha2CryptTest
Running org.apache.commons.codec.digest.CryptTest
Tests run: 4, Failures: 0, Errors: 0, Skipped: 0, Time elapsed: 0.09 sec - in org.apache.commons.codec.digest.CryptTest
Running org.apache.commons.codec.digest.Sha256CryptTest
Tests run: 7, Failures: 0, Errors: 0, Skipped: 0, Time elapsed: 0.095 sec - in org.apache.commons.codec.digest.Sha256CryptTest
Running org.apache.commons.codec.digest.Md5CryptTest
Tests run: 7, Failures: 0, Errors: 0, Skipped: 0, Time elapsed: 0.018 sec - in org.apache.commons.codec.digest.Md5CryptTest
Running org.apache.commons.codec.digest.UnixCryptTest
Tests run: 9, Failures: 0, Errors: 0, Skipped: 0, Time elapsed: 0.004 sec - in org.apache.commons.codec.digest.UnixCryptTest
Running org.apache.commons.codec.CharsetsTest
Tests run: 7, Failures: 0, Errors: 0, Skipped: 0, Time elapsed: 0.001 sec - in org.apache.commons.codec.CharsetsTest
Running org.apache.commons.codec.binary.Base32Test
Tests run: 8, Failures: 0, Errors: 0, Skipped: 0, Time elapsed: 0.005 sec - in org.apache.commons.codec.binary.Base32Test
Running org.apache.commons.codec.binary.Base64OutputStreamTest
Tests run: 7, Failures: 0, Errors: 0, Skipped: 0, Time elapsed: 0.211 sec - in org.apache.commons.codec.binary.Base64OutputStreamTest
Running org.apache.commons.codec.binary.Base64Codec13Test
Tests run: 8, Failures: 0, Errors: 0, Skipped: 0, Time elapsed: 0.01 sec - in org.apache.commons.codec.binary.Base64Codec13Test
Running org.apache.commons.codec.binary.Base64InputStreamTest
Tests run: 19, Failures: 0, Errors: 0, Skipped: 0, Time elapsed: 0.127 sec - in org.apache.commons.codec.binary.Base64InputStreamTest
Running org.apache.commons.codec.binary.Base32InputStreamTest
Tests run: 16, Failures: 0, Errors: 0, Skipped: 0, Time elapsed: 0.152 sec - in org.apache.commons.codec.binary.Base32InputStreamTest
Running org.apache.commons.codec.binary.Base32OutputStreamTest
Tests run: 6, Failures: 0, Errors: 0, Skipped: 0, Time elapsed: 0.091 sec - in org.apache.commons.codec.binary.Base32OutputStreamTest
Running org.apache.commons.codec.binary.BinaryCodecTest
Tests run: 13, Failures: 0, Errors: 0, Skipped: 0, Time elapsed: 0.013 sec - in org.apache.commons.codec.binary.BinaryCodecTest
Running org.apache.commons.codec.binary.BaseNCodecTest
Tests run: 7, Failures: 0, Errors: 0, Skipped: 0, Time elapsed: 0.003 sec - in org.apache.commons.codec.binary.BaseNCodecTest
Running org.apache.commons.codec.binary.StringUtilsTest
Tests run: 17, Failures: 0, Errors: 0, Skipped: 0, Time elapsed: 0.028 sec - in org.apache.commons.codec.binary.StringUtilsTest
Running org.apache.commons.codec.binary.Base64Test
Tests run: 53, Failures: 0, Errors: 0, Skipped: 1, Time elapsed: 0.043 sec - in org.apache.commons.codec.binary.Base64Test
Running org.apache.commons.codec.binary.HexTest
Tests run: 19, Failures: 0, Errors: 0, Skipped: 0, Time elapsed: 0.179 sec - in org.apache.commons.codec.binary.HexTest
Running org.apache.commons.codec.DecoderExceptionTest
Tests run: 4, Failures: 0, Errors: 0, Skipped: 0, Time elapsed: 0 sec - in org.apache.commons.codec.DecoderExceptionTest
Running org.apache.commons.codec.EncoderExceptionTest
Tests run: 4, Failures: 0, Errors: 0, Skipped: 0, Time elapsed: 0 sec - in org.apache.commons.codec.EncoderExceptionTest
Running org.apache.commons.codec.net.BCodecTest
Tests run: 9, Failures: 0, Errors: 0, Skipped: 0, Time elapsed: 0.006 sec - in org.apache.commons.codec.net.BCodecTest
Running org.apache.commons.codec.net.QCodecTest
Tests run: 12, Failures: 0, Errors: 0, Skipped: 0, Time elapsed: 0.009 sec - in org.apache.commons.codec.net.QCodecTest
Running org.apache.commons.codec.net.UtilsTest
Tests run: 1, Failures: 0, Errors: 0, Skipped: 0, Time elapsed: 0 sec - in org.apache.commons.codec.net.UtilsTest
Running org.apache.commons.codec.net.RFC1522CodecTest
Tests run: 2, Failures: 0, Errors: 0, Skipped: 0, Time elapsed: 0 sec - in org.apache.commons.codec.net.RFC1522CodecTest
Running org.apache.commons.codec.net.URLCodecTest
Tests run: 16, Failures: 0, Errors: 0, Skipped: 0, Time elapsed: 0.004 sec - in org.apache.commons.codec.net.URLCodecTest
Running org.apache.commons.codec.net.QuotedPrintableCodecTest
Tests run: 21, Failures: 0, Errors: 0, Skipped: 0, Time elapsed: 0.009 sec - in org.apache.commons.codec.net.QuotedPrintableCodecTest
Running org.apache.commons.codec.StringEncoderComparatorTest
Tests run: 3, Failures: 0, Errors: 0, Skipped: 0, Time elapsed: 0.003 sec - in org.apache.commons.codec.StringEncoderComparatorTest
Running org.apache.commons.codec.language.Caverphone1Test
Tests run: 9, Failures: 0, Errors: 0, Skipped: 0, Time elapsed: 0.029 sec - in org.apache.commons.codec.language.Caverphone1Test
Running org.apache.commons.codec.language.NysiisTest
Tests run: 23, Failures: 19, Errors: 0, Skipped: 0, Time elapsed: 0.017 sec <<< FAILURE! - in org.apache.commons.codec.language.NysiisTest
testRule4Dot1(org.apache.commons.codec.language.NysiisTest)  Time elapsed: 0.005 sec  <<< FAILURE!
org.junit.ComparisonFailure: Problem with XEV expected:<[XAF]> but was:<[]>
	at org.junit.Assert.assertEquals(Assert.java:115)
	at org.apache.commons.codec.language.NysiisTest.assertEncodings(NysiisTest.java:46)
	at org.apache.commons.codec.language.NysiisTest.testRule4Dot1(NysiisTest.java:209)

testRule4Dot2(org.apache.commons.codec.language.NysiisTest)  Time elapsed: 0 sec  <<< FAILURE!
org.junit.ComparisonFailure: Problem with XQ expected:<[XG]> but was:<[]>
	at org.junit.Assert.assertEquals(Assert.java:115)
	at org.apache.commons.codec.language.NysiisTest.assertEncodings(NysiisTest.java:46)
	at org.apache.commons.codec.language.NysiisTest.testRule4Dot2(NysiisTest.java:225)

testCap(org.apache.commons.codec.language.NysiisTest)  Time elapsed: 0 sec  <<< FAILURE!
org.junit.ComparisonFailure: Problem with Capp expected:<[CAP]> but was:<[]>
	at org.junit.Assert.assertEquals(Assert.java:115)
	at org.apache.commons.codec.language.NysiisTest.encodeAll(NysiisTest.java:57)
	at org.apache.commons.codec.language.NysiisTest.testCap(NysiisTest.java:68)

testDad(org.apache.commons.codec.language.NysiisTest)  Time elapsed: 0 sec  <<< FAILURE!
org.junit.ComparisonFailure: Problem with Dent expected:<[DAD]> but was:<[]>
	at org.junit.Assert.assertEquals(Assert.java:115)
	at org.apache.commons.codec.language.NysiisTest.encodeAll(NysiisTest.java:57)
	at org.apache.commons.codec.language.NysiisTest.testDad(NysiisTest.java:75)

testDan(org.apache.commons.codec.language.NysiisTest)  Time elapsed: 0 sec  <<< FAILURE!
org.junit.ComparisonFailure: Problem with Dane expected:<[DAN]> but was:<[]>
	at org.junit.Assert.assertEquals(Assert.java:115)
	at org.apache.commons.codec.language.NysiisTest.encodeAll(NysiisTest.java:57)
	at org.apache.commons.codec.language.NysiisTest.testDan(NysiisTest.java:80)

testFal(org.apache.commons.codec.language.NysiisTest)  Time elapsed: 0 sec  <<< FAILURE!
org.junit.ComparisonFailure: Problem with Phil expected:<[FAL]> but was:<[]>
	at org.junit.Assert.assertEquals(Assert.java:115)
	at org.apache.commons.codec.language.NysiisTest.encodeAll(NysiisTest.java:57)
	at org.apache.commons.codec.language.NysiisTest.testFal(NysiisTest.java:149)

testRule1(org.apache.commons.codec.language.NysiisTest)  Time elapsed: 0 sec  <<< FAILURE!
org.junit.ComparisonFailure: Problem with MACX expected:<[MCX]> but was:<[]>
	at org.junit.Assert.assertEquals(Assert.java:115)
	at org.apache.commons.codec.language.NysiisTest.assertEncodings(NysiisTest.java:46)
	at org.apache.commons.codec.language.NysiisTest.testRule1(NysiisTest.java:176)

testRule2(org.apache.commons.codec.language.NysiisTest)  Time elapsed: 0.001 sec  <<< FAILURE!
org.junit.ComparisonFailure: Problem with XEE expected:<[XY]> but was:<[]>
	at org.junit.Assert.assertEquals(Assert.java:115)
	at org.apache.commons.codec.language.NysiisTest.assertEncodings(NysiisTest.java:46)
	at org.apache.commons.codec.language.NysiisTest.testRule2(NysiisTest.java:192)

testRule5(org.apache.commons.codec.language.NysiisTest)  Time elapsed: 0 sec  <<< FAILURE!
org.junit.ComparisonFailure: Problem with XS expected:<[X]> but was:<[]>
	at org.junit.Assert.assertEquals(Assert.java:115)
	at org.apache.commons.codec.language.NysiisTest.assertEncodings(NysiisTest.java:46)
	at org.apache.commons.codec.language.NysiisTest.testRule5(NysiisTest.java:238)

testRule6(org.apache.commons.codec.language.NysiisTest)  Time elapsed: 0 sec  <<< FAILURE!
org.junit.ComparisonFailure: Problem with XAY expected:<[XY]> but was:<[]>
	at org.junit.Assert.assertEquals(Assert.java:115)
	at org.apache.commons.codec.language.NysiisTest.assertEncodings(NysiisTest.java:46)
	at org.apache.commons.codec.language.NysiisTest.testRule6(NysiisTest.java:250)

testRule7(org.apache.commons.codec.language.NysiisTest)  Time elapsed: 0 sec  <<< FAILURE!
org.junit.ComparisonFailure: Problem with XA expected:<[X]> but was:<[]>
	at org.junit.Assert.assertEquals(Assert.java:115)
	at org.apache.commons.codec.language.NysiisTest.assertEncodings(NysiisTest.java:46)
	at org.apache.commons.codec.language.NysiisTest.testRule7(NysiisTest.java:262)

testBran(org.apache.commons.codec.language.NysiisTest)  Time elapsed: 0 sec  <<< FAILURE!
org.junit.ComparisonFailure: Problem with Brian expected:<[BRAN]> but was:<[]>
	at org.junit.Assert.assertEquals(Assert.java:115)
	at org.apache.commons.codec.language.NysiisTest.encodeAll(NysiisTest.java:57)
	at org.apache.commons.codec.language.NysiisTest.testBran(NysiisTest.java:63)

testSnad(org.apache.commons.codec.language.NysiisTest)  Time elapsed: 0 sec  <<< FAILURE!
org.junit.ComparisonFailure: Problem with Schmidt expected:<[SNAD]> but was:<[]>
	at org.junit.Assert.assertEquals(Assert.java:115)
	at org.apache.commons.codec.language.NysiisTest.encodeAll(NysiisTest.java:57)
	at org.apache.commons.codec.language.NysiisTest.testSnad(NysiisTest.java:270)

testSnat(org.apache.commons.codec.language.NysiisTest)  Time elapsed: 0 sec  <<< FAILURE!
org.junit.ComparisonFailure: Problem with Smith expected:<[SNAT]> but was:<[]>
	at org.junit.Assert.assertEquals(Assert.java:115)
	at org.apache.commons.codec.language.NysiisTest.encodeAll(NysiisTest.java:57)
	at org.apache.commons.codec.language.NysiisTest.testSnat(NysiisTest.java:275)

testTrueVariant(org.apache.commons.codec.language.NysiisTest)  Time elapsed: 0 sec  <<< FAILURE!
org.junit.ComparisonFailure: expected:<[WASTAR]> but was:<[]>
	at org.junit.Assert.assertEquals(Assert.java:115)
	at org.junit.Assert.assertEquals(Assert.java:144)
	at org.apache.commons.codec.language.NysiisTest.testTrueVariant(NysiisTest.java:300)

testDropBy(org.apache.commons.codec.language.NysiisTest)  Time elapsed: 0 sec  <<< FAILURE!
org.junit.ComparisonFailure: Problem with MACINTOSH expected:<[MCANT]> but was:<[]>
	at org.junit.Assert.assertEquals(Assert.java:115)
	at org.apache.commons.codec.language.NysiisTest.assertEncodings(NysiisTest.java:46)
	at org.apache.commons.codec.language.NysiisTest.testDropBy(NysiisTest.java:95)

testOthers(org.apache.commons.codec.language.NysiisTest)  Time elapsed: 0 sec  <<< FAILURE!
org.junit.ComparisonFailure: Problem with O'Daniel expected:<[ODANAL]> but was:<[]>
	at org.junit.Assert.assertEquals(Assert.java:115)
	at org.apache.commons.codec.language.NysiisTest.assertEncodings(NysiisTest.java:46)
	at org.apache.commons.codec.language.NysiisTest.testOthers(NysiisTest.java:159)

testTranan(org.apache.commons.codec.language.NysiisTest)  Time elapsed: 0 sec  <<< FAILURE!
org.junit.ComparisonFailure: Problem with Trueman expected:<[TRANAN]> but was:<[]>
	at org.junit.Assert.assertEquals(Assert.java:115)
	at org.apache.commons.codec.language.NysiisTest.encodeAll(NysiisTest.java:57)
	at org.apache.commons.codec.language.NysiisTest.testTranan(NysiisTest.java:291)

testSpecialBranches(org.apache.commons.codec.language.NysiisTest)  Time elapsed: 0 sec  <<< FAILURE!
org.junit.ComparisonFailure: Problem with Kobwick expected:<[CABWAC]> but was:<[]>
	at org.junit.Assert.assertEquals(Assert.java:115)
	at org.apache.commons.codec.language.NysiisTest.encodeAll(NysiisTest.java:57)
	at org.apache.commons.codec.language.NysiisTest.testSpecialBranches(NysiisTest.java:280)

Running org.apache.commons.codec.language.Caverphone2Test
Tests run: 13, Failures: 0, Errors: 0, Skipped: 0, Time elapsed: 0.131 sec - in org.apache.commons.codec.language.Caverphone2Test
Running org.apache.commons.codec.language.DaitchMokotoffSoundexTest
Tests run: 13, Failures: 0, Errors: 0, Skipped: 0, Time elapsed: 0.045 sec - in org.apache.commons.codec.language.DaitchMokotoffSoundexTest
Running org.apache.commons.codec.language.bm.BeiderMorseEncoderTest
Tests run: 22, Failures: 0, Errors: 0, Skipped: 0, Time elapsed: 2.969 sec - in org.apache.commons.codec.language.bm.BeiderMorseEncoderTest
Running org.apache.commons.codec.language.bm.PhoneticEngineTest
Tests run: 8, Failures: 0, Errors: 0, Skipped: 0, Time elapsed: 0.016 sec - in org.apache.commons.codec.language.bm.PhoneticEngineTest
Running org.apache.commons.codec.language.bm.PhoneticEngineRegressionTest
Tests run: 4, Failures: 0, Errors: 0, Skipped: 0, Time elapsed: 0.016 sec - in org.apache.commons.codec.language.bm.PhoneticEngineRegressionTest
Running org.apache.commons.codec.language.bm.RuleTest
Tests run: 3, Failures: 0, Errors: 0, Skipped: 0, Time elapsed: 0.002 sec - in org.apache.commons.codec.language.bm.RuleTest
Running org.apache.commons.codec.language.bm.LanguageGuessingTest
Tests run: 18, Failures: 0, Errors: 0, Skipped: 0, Time elapsed: 0.012 sec - in org.apache.commons.codec.language.bm.LanguageGuessingTest
Running org.apache.commons.codec.language.DoubleMetaphoneTest
Tests run: 16, Failures: 0, Errors: 0, Skipped: 0, Time elapsed: 0.045 sec - in org.apache.commons.codec.language.DoubleMetaphoneTest
Running org.apache.commons.codec.language.SoundexTest
Tests run: 28, Failures: 22, Errors: 0, Skipped: 0, Time elapsed: 0.012 sec <<< FAILURE! - in org.apache.commons.codec.language.SoundexTest
testBadCharacters(org.apache.commons.codec.language.SoundexTest)  Time elapsed: 0.001 sec  <<< FAILURE!
org.junit.ComparisonFailure: expected:<[H452]> but was:<[]>
	at org.junit.Assert.assertEquals(Assert.java:115)
	at org.junit.Assert.assertEquals(Assert.java:144)
	at org.apache.commons.codec.language.SoundexTest.testBadCharacters(SoundexTest.java:88)

testUsEnglishStatic(org.apache.commons.codec.language.SoundexTest)  Time elapsed: 0 sec  <<< FAILURE!
org.junit.ComparisonFailure: expected:<[W452]> but was:<[]>
	at org.junit.Assert.assertEquals(Assert.java:115)
	at org.junit.Assert.assertEquals(Assert.java:144)
	at org.apache.commons.codec.language.SoundexTest.testUsEnglishStatic(SoundexTest.java:346)

testMsSqlServer1(org.apache.commons.codec.language.SoundexTest)  Time elapsed: 0.001 sec  <<< FAILURE!
org.junit.ComparisonFailure: expected:<[S530]> but was:<[]>
	at org.junit.Assert.assertEquals(Assert.java:115)
	at org.junit.Assert.assertEquals(Assert.java:144)
	at org.apache.commons.codec.language.SoundexTest.testMsSqlServer1(SoundexTest.java:278)

testMsSqlServer2(org.apache.commons.codec.language.SoundexTest)  Time elapsed: 0 sec  <<< FAILURE!
org.junit.ComparisonFailure: Source: Erickson expected:<[E625]> but was:<[]>
	at org.junit.Assert.assertEquals(Assert.java:115)
	at org.apache.commons.codec.StringEncoderAbstractTest.checkEncoding(StringEncoderAbstractTest.java:33)
	at org.apache.commons.codec.StringEncoderAbstractTest.checkEncodingVariations(StringEncoderAbstractTest.java:44)
	at org.apache.commons.codec.language.SoundexTest.testMsSqlServer2(SoundexTest.java:291)

testMsSqlServer3(org.apache.commons.codec.language.SoundexTest)  Time elapsed: 0 sec  <<< FAILURE!
org.junit.ComparisonFailure: expected:<[A500]> but was:<[]>
	at org.junit.Assert.assertEquals(Assert.java:115)
	at org.junit.Assert.assertEquals(Assert.java:144)
	at org.apache.commons.codec.language.SoundexTest.testMsSqlServer3(SoundexTest.java:299)

testB650(org.apache.commons.codec.language.SoundexTest)  Time elapsed: 0 sec  <<< FAILURE!
org.junit.ComparisonFailure: Source: BARHAM expected:<[B650]> but was:<[]>
	at org.junit.Assert.assertEquals(Assert.java:115)
	at org.apache.commons.codec.StringEncoderAbstractTest.checkEncoding(StringEncoderAbstractTest.java:33)
	at org.apache.commons.codec.StringEncoderAbstractTest.checkEncodingVariations(StringEncoderAbstractTest.java:44)
	at org.apache.commons.codec.language.SoundexTest.testB650(SoundexTest.java:43)

testEncodeBatch2(org.apache.commons.codec.language.SoundexTest)  Time elapsed: 0 sec  <<< FAILURE!
org.junit.ComparisonFailure: expected:<[A462]> but was:<[]>
	at org.junit.Assert.assertEquals(Assert.java:115)
	at org.junit.Assert.assertEquals(Assert.java:144)
	at org.apache.commons.codec.language.SoundexTest.testEncodeBatch2(SoundexTest.java:131)

testEncodeBatch3(org.apache.commons.codec.language.SoundexTest)  Time elapsed: 0.001 sec  <<< FAILURE!
org.junit.ComparisonFailure: expected:<[W252]> but was:<[]>
	at org.junit.Assert.assertEquals(Assert.java:115)
	at org.junit.Assert.assertEquals(Assert.java:144)
	at org.apache.commons.codec.language.SoundexTest.testEncodeBatch3(SoundexTest.java:154)

testEncodeBatch4(org.apache.commons.codec.language.SoundexTest)  Time elapsed: 0 sec  <<< FAILURE!
org.junit.ComparisonFailure: expected:<[H452]> but was:<[]>
	at org.junit.Assert.assertEquals(Assert.java:115)
	at org.junit.Assert.assertEquals(Assert.java:144)
	at org.apache.commons.codec.language.SoundexTest.testEncodeBatch4(SoundexTest.java:170)

testEncodeIgnoreHyphens(org.apache.commons.codec.language.SoundexTest)  Time elapsed: 0.001 sec  <<< FAILURE!
org.junit.ComparisonFailure: Source: KINGSMITH expected:<[K525]> but was:<[]>
	at org.junit.Assert.assertEquals(Assert.java:115)
	at org.apache.commons.codec.StringEncoderAbstractTest.checkEncoding(StringEncoderAbstractTest.java:33)
	at org.apache.commons.codec.StringEncoderAbstractTest.checkEncodingVariations(StringEncoderAbstractTest.java:44)
	at org.apache.commons.codec.language.SoundexTest.testEncodeIgnoreHyphens(SoundexTest.java:201)

testEncodeIgnoreTrimmable(org.apache.commons.codec.language.SoundexTest)  Time elapsed: 0 sec  <<< FAILURE!
org.junit.ComparisonFailure: expected:<[W252]> but was:<[]>
	at org.junit.Assert.assertEquals(Assert.java:115)
	at org.junit.Assert.assertEquals(Assert.java:144)
	at org.apache.commons.codec.language.SoundexTest.testEncodeIgnoreTrimmable(SoundexTest.java:217)

testEncodeIgnoreApostrophes(org.apache.commons.codec.language.SoundexTest)  Time elapsed: 0.001 sec  <<< FAILURE!
org.junit.ComparisonFailure: Source: OBrien expected:<[O165]> but was:<[]>
	at org.junit.Assert.assertEquals(Assert.java:115)
	at org.apache.commons.codec.StringEncoderAbstractTest.checkEncoding(StringEncoderAbstractTest.java:33)
	at org.apache.commons.codec.StringEncoderAbstractTest.checkEncodingVariations(StringEncoderAbstractTest.java:44)
	at org.apache.commons.codec.language.SoundexTest.testEncodeIgnoreApostrophes(SoundexTest.java:183)

testDifference(org.apache.commons.codec.language.SoundexTest)  Time elapsed: 0 sec  <<< FAILURE!
java.lang.AssertionError: expected:<4> but was:<0>
	at org.junit.Assert.fail(Assert.java:88)
	at org.junit.Assert.failNotEquals(Assert.java:743)
	at org.junit.Assert.assertEquals(Assert.java:118)
	at org.junit.Assert.assertEquals(Assert.java:555)
	at org.junit.Assert.assertEquals(Assert.java:542)
	at org.apache.commons.codec.language.SoundexTest.testDifference(SoundexTest.java:99)

testNewInstance(org.apache.commons.codec.language.SoundexTest)  Time elapsed: 0 sec  <<< FAILURE!
org.junit.ComparisonFailure: expected:<[W452]> but was:<[]>
	at org.junit.Assert.assertEquals(Assert.java:115)
	at org.junit.Assert.assertEquals(Assert.java:144)
	at org.apache.commons.codec.language.SoundexTest.testNewInstance(SoundexTest.java:315)

testEncodeBasic(org.apache.commons.codec.language.SoundexTest)  Time elapsed: 0 sec  <<< FAILURE!
org.junit.ComparisonFailure: expected:<[T235]> but was:<[]>
	at org.junit.Assert.assertEquals(Assert.java:115)
	at org.junit.Assert.assertEquals(Assert.java:144)
	at org.apache.commons.codec.language.SoundexTest.testEncodeBasic(SoundexTest.java:114)

testUsMappingEWithAcute(org.apache.commons.codec.language.SoundexTest)  Time elapsed: 0 sec  <<< FAILURE!
org.junit.ComparisonFailure: expected:<[E000]> but was:<[]>
	at org.junit.Assert.assertEquals(Assert.java:115)
	at org.junit.Assert.assertEquals(Assert.java:144)
	at org.apache.commons.codec.language.SoundexTest.testUsMappingEWithAcute(SoundexTest.java:356)

testNewInstance2(org.apache.commons.codec.language.SoundexTest)  Time elapsed: 0 sec  <<< FAILURE!
org.junit.ComparisonFailure: expected:<[W452]> but was:<[]>
	at org.junit.Assert.assertEquals(Assert.java:115)
	at org.junit.Assert.assertEquals(Assert.java:144)
	at org.apache.commons.codec.language.SoundexTest.testNewInstance2(SoundexTest.java:320)

testNewInstance3(org.apache.commons.codec.language.SoundexTest)  Time elapsed: 0 sec  <<< FAILURE!
org.junit.ComparisonFailure: expected:<[W452]> but was:<[]>
	at org.junit.Assert.assertEquals(Assert.java:115)
	at org.junit.Assert.assertEquals(Assert.java:144)
	at org.apache.commons.codec.language.SoundexTest.testNewInstance3(SoundexTest.java:325)

testUsMappingOWithDiaeresis(org.apache.commons.codec.language.SoundexTest)  Time elapsed: 0 sec  <<< FAILURE!
org.junit.ComparisonFailure: expected:<[O000]> but was:<[]>
	at org.junit.Assert.assertEquals(Assert.java:115)
	at org.junit.Assert.assertEquals(Assert.java:144)
	at org.apache.commons.codec.language.SoundexTest.testUsMappingOWithDiaeresis(SoundexTest.java:377)

testHWRuleEx1(org.apache.commons.codec.language.SoundexTest)  Time elapsed: 0 sec  <<< FAILURE!
org.junit.ComparisonFailure: expected:<[A261]> but was:<[]>
	at org.junit.Assert.assertEquals(Assert.java:115)
	at org.junit.Assert.assertEquals(Assert.java:144)
	at org.apache.commons.codec.language.SoundexTest.testHWRuleEx1(SoundexTest.java:229)

testHWRuleEx2(org.apache.commons.codec.language.SoundexTest)  Time elapsed: 0.001 sec  <<< FAILURE!
org.junit.ComparisonFailure: expected:<[B312]> but was:<[]>
	at org.junit.Assert.assertEquals(Assert.java:115)
	at org.junit.Assert.assertEquals(Assert.java:144)
	at org.apache.commons.codec.language.SoundexTest.testHWRuleEx2(SoundexTest.java:239)

testHWRuleEx3(org.apache.commons.codec.language.SoundexTest)  Time elapsed: 0 sec  <<< FAILURE!
org.junit.ComparisonFailure: expected:<[S460]> but was:<[]>
	at org.junit.Assert.assertEquals(Assert.java:115)
	at org.junit.Assert.assertEquals(Assert.java:144)
	at org.apache.commons.codec.language.SoundexTest.testHWRuleEx3(SoundexTest.java:250)

Running org.apache.commons.codec.language.RefinedSoundexTest
Tests run: 10, Failures: 5, Errors: 0, Skipped: 0, Time elapsed: 0.002 sec <<< FAILURE! - in org.apache.commons.codec.language.RefinedSoundexTest
testDifference(org.apache.commons.codec.language.RefinedSoundexTest)  Time elapsed: 0 sec  <<< FAILURE!
java.lang.AssertionError: expected:<6> but was:<0>
	at org.junit.Assert.fail(Assert.java:88)
	at org.junit.Assert.failNotEquals(Assert.java:743)
	at org.junit.Assert.assertEquals(Assert.java:118)
	at org.junit.Assert.assertEquals(Assert.java:555)
	at org.junit.Assert.assertEquals(Assert.java:542)
	at org.apache.commons.codec.language.RefinedSoundexTest.testDifference(RefinedSoundexTest.java:45)

testNewInstance(org.apache.commons.codec.language.RefinedSoundexTest)  Time elapsed: 0 sec  <<< FAILURE!
org.junit.ComparisonFailure: expected:<[D6043]> but was:<[]>
	at org.junit.Assert.assertEquals(Assert.java:115)
	at org.junit.Assert.assertEquals(Assert.java:144)
	at org.apache.commons.codec.language.RefinedSoundexTest.testNewInstance(RefinedSoundexTest.java:86)

testEncode(org.apache.commons.codec.language.RefinedSoundexTest)  Time elapsed: 0 sec  <<< FAILURE!
org.junit.ComparisonFailure: expected:<[T6036084]> but was:<[]>
	at org.junit.Assert.assertEquals(Assert.java:115)
	at org.junit.Assert.assertEquals(Assert.java:144)
	at org.apache.commons.codec.language.RefinedSoundexTest.testEncode(RefinedSoundexTest.java:62)

testNewInstance2(org.apache.commons.codec.language.RefinedSoundexTest)  Time elapsed: 0 sec  <<< FAILURE!
org.junit.ComparisonFailure: expected:<[D6043]> but was:<[]>
	at org.junit.Assert.assertEquals(Assert.java:115)
	at org.junit.Assert.assertEquals(Assert.java:144)
	at org.apache.commons.codec.language.RefinedSoundexTest.testNewInstance2(RefinedSoundexTest.java:91)

testNewInstance3(org.apache.commons.codec.language.RefinedSoundexTest)  Time elapsed: 0 sec  <<< FAILURE!
org.junit.ComparisonFailure: expected:<[D6043]> but was:<[]>
	at org.junit.Assert.assertEquals(Assert.java:115)
	at org.junit.Assert.assertEquals(Assert.java:144)
	at org.apache.commons.codec.language.RefinedSoundexTest.testNewInstance3(RefinedSoundexTest.java:96)

Running org.apache.commons.codec.language.MatchRatingApproachEncoderTest
Tests run: 96, Failures: 0, Errors: 0, Skipped: 0, Time elapsed: 0.034 sec - in org.apache.commons.codec.language.MatchRatingApproachEncoderTest
Running org.apache.commons.codec.language.ColognePhoneticTest
Tests run: 13, Failures: 0, Errors: 0, Skipped: 0, Time elapsed: 0.002 sec - in org.apache.commons.codec.language.ColognePhoneticTest
Running org.apache.commons.codec.language.DoubleMetaphone2Test
Tests run: 6, Failures: 0, Errors: 0, Skipped: 0, Time elapsed: 0.029 sec - in org.apache.commons.codec.language.DoubleMetaphone2Test
Running org.apache.commons.codec.language.MetaphoneTest
Tests run: 34, Failures: 0, Errors: 0, Skipped: 0, Time elapsed: 0.132 sec - in org.apache.commons.codec.language.MetaphoneTest
Running org.apache.commons.codec.CharEncodingTest
Tests run: 7, Failures: 0, Errors: 0, Skipped: 0, Time elapsed: 0 sec - in org.apache.commons.codec.CharEncodingTest

Results :

Failed tests: 
  NysiisTest.testRule4Dot1:209->assertEncodings:46 Problem with XEV expected:<[XAF]> but was:<[]>
  NysiisTest.testRule4Dot2:225->assertEncodings:46 Problem with XQ expected:<[XG]> but was:<[]>
  NysiisTest.testCap:68->encodeAll:57 Problem with Capp expected:<[CAP]> but was:<[]>
  NysiisTest.testDad:75->encodeAll:57 Problem with Dent expected:<[DAD]> but was:<[]>
  NysiisTest.testDan:80->encodeAll:57 Problem with Dane expected:<[DAN]> but was:<[]>
  NysiisTest.testFal:149->encodeAll:57 Problem with Phil expected:<[FAL]> but was:<[]>
  NysiisTest.testRule1:176->assertEncodings:46 Problem with MACX expected:<[MCX]> but was:<[]>
  NysiisTest.testRule2:192->assertEncodings:46 Problem with XEE expected:<[XY]> but was:<[]>
  NysiisTest.testRule5:238->assertEncodings:46 Problem with XS expected:<[X]> but was:<[]>
  NysiisTest.testRule6:250->assertEncodings:46 Problem with XAY expected:<[XY]> but was:<[]>
  NysiisTest.testRule7:262->assertEncodings:46 Problem with XA expected:<[X]> but was:<[]>
  NysiisTest.testBran:63->encodeAll:57 Problem with Brian expected:<[BRAN]> but was:<[]>
  NysiisTest.testSnad:270->encodeAll:57 Problem with Schmidt expected:<[SNAD]> but was:<[]>
  NysiisTest.testSnat:275->encodeAll:57 Problem with Smith expected:<[SNAT]> but was:<[]>
  NysiisTest.testTrueVariant:300 expected:<[WASTAR]> but was:<[]>
  NysiisTest.testDropBy:95->assertEncodings:46 Problem with MACINTOSH expected:<[MCANT]> but was:<[]>
  NysiisTest.testOthers:159->assertEncodings:46 Problem with O'Daniel expected:<[ODANAL]> but was:<[]>
  NysiisTest.testTranan:291->encodeAll:57 Problem with Trueman expected:<[TRANAN]> but was:<[]>
  NysiisTest.testSpecialBranches:280->encodeAll:57 Problem with Kobwick expected:<[CABWAC]> but was:<[]>
  SoundexTest.testBadCharacters:88 expected:<[H452]> but was:<[]>
  SoundexTest.testUsEnglishStatic:346 expected:<[W452]> but was:<[]>
  SoundexTest.testMsSqlServer1:278 expected:<[S530]> but was:<[]>
  SoundexTest.testMsSqlServer2:291->StringEncoderAbstractTest.checkEncodingVariations:44->StringEncoderAbstractTest.checkEncoding:33 Source: Erickson expected:<[E625]> but was:<[]>
  SoundexTest.testMsSqlServer3:299 expected:<[A500]> but was:<[]>
  SoundexTest.testB650:43->StringEncoderAbstractTest.checkEncodingVariations:44->StringEncoderAbstractTest.checkEncoding:33 Source: BARHAM expected:<[B650]> but was:<[]>
  SoundexTest.testEncodeBatch2:131 expected:<[A462]> but was:<[]>
  SoundexTest.testEncodeBatch3:154 expected:<[W252]> but was:<[]>
  SoundexTest.testEncodeBatch4:170 expected:<[H452]> but was:<[]>
  SoundexTest.testEncodeIgnoreHyphens:201->StringEncoderAbstractTest.checkEncodingVariations:44->StringEncoderAbstractTest.checkEncoding:33 Source: KINGSMITH expected:<[K525]> but was:<[]>
  SoundexTest.testEncodeIgnoreTrimmable:217 expected:<[W252]> but was:<[]>
  SoundexTest.testEncodeIgnoreApostrophes:183->StringEncoderAbstractTest.checkEncodingVariations:44->StringEncoderAbstractTest.checkEncoding:33 Source: OBrien expected:<[O165]> but was:<[]>
  SoundexTest.testDifference:99 expected:<4> but was:<0>
  SoundexTest.testNewInstance:315 expected:<[W452]> but was:<[]>
  SoundexTest.testEncodeBasic:114 expected:<[T235]> but was:<[]>
  SoundexTest.testUsMappingEWithAcute:356 expected:<[E000]> but was:<[]>
  SoundexTest.testNewInstance2:320 expected:<[W452]> but was:<[]>
  SoundexTest.testNewInstance3:325 expected:<[W452]> but was:<[]>
  SoundexTest.testUsMappingOWithDiaeresis:377 expected:<[O000]> but was:<[]>
  SoundexTest.testHWRuleEx1:229 expected:<[A261]> but was:<[]>
  SoundexTest.testHWRuleEx2:239 expected:<[B312]> but was:<[]>
  SoundexTest.testHWRuleEx3:250 expected:<[S460]> but was:<[]>
  RefinedSoundexTest.testDifference:45 expected:<6> but was:<0>
  RefinedSoundexTest.testNewInstance:86 expected:<[D6043]> but was:<[]>
  RefinedSoundexTest.testEncode:62 expected:<[T6036084]> but was:<[]>
  RefinedSoundexTest.testNewInstance2:91 expected:<[D6043]> but was:<[]>
  RefinedSoundexTest.testNewInstance3:96 expected:<[D6043]> but was:<[]>

Tests run: 662, Failures: 46, Errors: 0, Skipped: 1

[INFO] ------------------------------------------------------------------------
[INFO] BUILD FAILURE
[INFO] ------------------------------------------------------------------------
[INFO] Total time: 13.677s
[INFO] Finished at: Sun Aug 02 13:01:09 BST 2015
[INFO] Final Memory: 22M/287M
[INFO] ------------------------------------------------------------------------
[ERROR] Failed to execute goal org.apache.maven.plugins:maven-surefire-plugin:2.17:test (default-test) on project commons-codec: There are test failures.
[ERROR] 
[ERROR] Please refer to /home/perham/Study/LittleDarwin/Cases/commons-codec-1.10-src/target/surefire-reports for the individual test results.
[ERROR] -> [Help 1]
[ERROR] 
[ERROR] To see the full stack trace of the errors, re-run Maven with the -e switch.
[ERROR] Re-run Maven using the -X switch to enable full debug logging.
[ERROR] 
[ERROR] For more information about the errors and possible solutions, please read the following articles:
[ERROR] [Help 1] http://cwiki.apache.org/confluence/display/MAVEN/MojoFailureException
