[INFO] Scanning for projects...
[INFO]                                                                         
[INFO] ------------------------------------------------------------------------
[INFO] Building Apache Commons Codec 1.10
[INFO] ------------------------------------------------------------------------
[INFO] 
[INFO] --- maven-enforcer-plugin:1.3.1:enforce (enforce-maven-3) @ commons-codec ---
[INFO] 
[INFO] --- maven-antrun-plugin:1.7:run (javadoc.resources) @ commons-codec ---
[INFO] Executing tasks

main:
[INFO] Executed tasks
[INFO] 
[INFO] --- maven-remote-resources-plugin:1.5:process (default) @ commons-codec ---
[INFO] 
[INFO] --- buildnumber-maven-plugin:1.3:create (default) @ commons-codec ---
[INFO] Executing: /bin/sh -c cd /home/perham/Study/LittleDarwin/Cases/commons-codec-1.10-src && svn --non-interactive info
[INFO] Working directory: /home/perham/Study/LittleDarwin/Cases/commons-codec-1.10-src
[INFO] Storing buildNumber: ?????? at timestamp: 1438516277251
[INFO] Executing: /bin/sh -c cd /home/perham/Study/LittleDarwin/Cases/commons-codec-1.10-src && svn --non-interactive info
[INFO] Working directory: /home/perham/Study/LittleDarwin/Cases/commons-codec-1.10-src
[INFO] Storing buildScmBranch: UNKNOWN_BRANCH
[INFO] 
[INFO] --- maven-resources-plugin:2.7:resources (default-resources) @ commons-codec ---
[INFO] Using 'UTF-8' encoding to copy filtered resources.
[INFO] Copying 128 resources
[INFO] Copying 2 resources to META-INF
[INFO] 
[INFO] --- maven-compiler-plugin:3.2:compile (default-compile) @ commons-codec ---
[INFO] Changes detected - recompiling the module!
[INFO] Compiling 60 source files to /home/perham/Study/LittleDarwin/Cases/commons-codec-1.10-src/target/classes
[INFO] /home/perham/Study/LittleDarwin/Cases/commons-codec-1.10-src/src/main/java/org/apache/commons/codec/digest/Sha2Crypt.java: Some input files use or override a deprecated API.
[INFO] /home/perham/Study/LittleDarwin/Cases/commons-codec-1.10-src/src/main/java/org/apache/commons/codec/digest/Sha2Crypt.java: Recompile with -Xlint:deprecation for details.
[INFO] 
[INFO] --- maven-bundle-plugin:2.5.3:manifest (bundle-manifest) @ commons-codec ---
[INFO] 
[INFO] --- maven-resources-plugin:2.7:testResources (default-testResources) @ commons-codec ---
[INFO] Using 'UTF-8' encoding to copy filtered resources.
[INFO] skip non existing resourceDirectory /home/perham/Study/LittleDarwin/Cases/commons-codec-1.10-src/src/test/resources
[INFO] Copying 2 resources to META-INF
[INFO] 
[INFO] --- maven-compiler-plugin:3.2:testCompile (default-testCompile) @ commons-codec ---
[INFO] Nothing to compile - all classes are up to date
[INFO] 
[INFO] --- maven-surefire-plugin:2.17:test (default-test) @ commons-codec ---
[INFO] Surefire report directory: /home/perham/Study/LittleDarwin/Cases/commons-codec-1.10-src/target/surefire-reports

-------------------------------------------------------
 T E S T S
-------------------------------------------------------
Running org.apache.commons.codec.digest.B64Test
Tests run: 2, Failures: 0, Errors: 0, Skipped: 0, Time elapsed: 0.026 sec - in org.apache.commons.codec.digest.B64Test
Running org.apache.commons.codec.digest.DigestUtilsTest
Tests run: 17, Failures: 0, Errors: 0, Skipped: 0, Time elapsed: 0.667 sec - in org.apache.commons.codec.digest.DigestUtilsTest
Running org.apache.commons.codec.digest.Sha512CryptTest
Tests run: 8, Failures: 0, Errors: 0, Skipped: 0, Time elapsed: 0.519 sec - in org.apache.commons.codec.digest.Sha512CryptTest
Running org.apache.commons.codec.digest.Apr1CryptTest
Tests run: 8, Failures: 0, Errors: 0, Skipped: 0, Time elapsed: 0.087 sec - in org.apache.commons.codec.digest.Apr1CryptTest
Running org.apache.commons.codec.digest.HmacUtilsTest
Tests run: 24, Failures: 0, Errors: 0, Skipped: 0, Time elapsed: 0.049 sec - in org.apache.commons.codec.digest.HmacUtilsTest
Running org.apache.commons.codec.digest.Sha2CryptTest
Tests run: 1, Failures: 0, Errors: 0, Skipped: 0, Time elapsed: 0.001 sec - in org.apache.commons.codec.digest.Sha2CryptTest
Running org.apache.commons.codec.digest.CryptTest
Tests run: 4, Failures: 0, Errors: 0, Skipped: 0, Time elapsed: 0.117 sec - in org.apache.commons.codec.digest.CryptTest
Running org.apache.commons.codec.digest.Sha256CryptTest
Tests run: 7, Failures: 0, Errors: 0, Skipped: 0, Time elapsed: 0.099 sec - in org.apache.commons.codec.digest.Sha256CryptTest
Running org.apache.commons.codec.digest.Md5CryptTest
Tests run: 7, Failures: 0, Errors: 0, Skipped: 0, Time elapsed: 0.018 sec - in org.apache.commons.codec.digest.Md5CryptTest
Running org.apache.commons.codec.digest.UnixCryptTest
Tests run: 9, Failures: 0, Errors: 0, Skipped: 0, Time elapsed: 0.008 sec - in org.apache.commons.codec.digest.UnixCryptTest
Running org.apache.commons.codec.CharsetsTest
Tests run: 7, Failures: 0, Errors: 0, Skipped: 0, Time elapsed: 0.006 sec - in org.apache.commons.codec.CharsetsTest
Running org.apache.commons.codec.binary.Base32Test
Tests run: 8, Failures: 0, Errors: 0, Skipped: 0, Time elapsed: 0.001 sec - in org.apache.commons.codec.binary.Base32Test
Running org.apache.commons.codec.binary.Base64OutputStreamTest
Tests run: 7, Failures: 0, Errors: 0, Skipped: 0, Time elapsed: 0.204 sec - in org.apache.commons.codec.binary.Base64OutputStreamTest
Running org.apache.commons.codec.binary.Base64Codec13Test
Tests run: 8, Failures: 0, Errors: 0, Skipped: 0, Time elapsed: 0.012 sec - in org.apache.commons.codec.binary.Base64Codec13Test
Running org.apache.commons.codec.binary.Base64InputStreamTest
Tests run: 19, Failures: 0, Errors: 0, Skipped: 0, Time elapsed: 0.109 sec - in org.apache.commons.codec.binary.Base64InputStreamTest
Running org.apache.commons.codec.binary.Base32InputStreamTest
Tests run: 16, Failures: 0, Errors: 0, Skipped: 0, Time elapsed: 0.13 sec - in org.apache.commons.codec.binary.Base32InputStreamTest
Running org.apache.commons.codec.binary.Base32OutputStreamTest
Tests run: 6, Failures: 0, Errors: 0, Skipped: 0, Time elapsed: 0.093 sec - in org.apache.commons.codec.binary.Base32OutputStreamTest
Running org.apache.commons.codec.binary.BinaryCodecTest
Tests run: 13, Failures: 0, Errors: 0, Skipped: 0, Time elapsed: 0.012 sec - in org.apache.commons.codec.binary.BinaryCodecTest
Running org.apache.commons.codec.binary.BaseNCodecTest
Tests run: 7, Failures: 0, Errors: 0, Skipped: 0, Time elapsed: 0.003 sec - in org.apache.commons.codec.binary.BaseNCodecTest
Running org.apache.commons.codec.binary.StringUtilsTest
Tests run: 17, Failures: 0, Errors: 0, Skipped: 0, Time elapsed: 0.029 sec - in org.apache.commons.codec.binary.StringUtilsTest
Running org.apache.commons.codec.binary.Base64Test
Tests run: 53, Failures: 0, Errors: 0, Skipped: 1, Time elapsed: 0.048 sec - in org.apache.commons.codec.binary.Base64Test
Running org.apache.commons.codec.binary.HexTest
Tests run: 19, Failures: 0, Errors: 0, Skipped: 0, Time elapsed: 0.177 sec - in org.apache.commons.codec.binary.HexTest
Running org.apache.commons.codec.DecoderExceptionTest
Tests run: 4, Failures: 0, Errors: 0, Skipped: 0, Time elapsed: 0.001 sec - in org.apache.commons.codec.DecoderExceptionTest
Running org.apache.commons.codec.EncoderExceptionTest
Tests run: 4, Failures: 0, Errors: 0, Skipped: 0, Time elapsed: 0 sec - in org.apache.commons.codec.EncoderExceptionTest
Running org.apache.commons.codec.net.BCodecTest
Tests run: 9, Failures: 0, Errors: 0, Skipped: 0, Time elapsed: 0.005 sec - in org.apache.commons.codec.net.BCodecTest
Running org.apache.commons.codec.net.QCodecTest
Tests run: 12, Failures: 0, Errors: 0, Skipped: 0, Time elapsed: 0.009 sec - in org.apache.commons.codec.net.QCodecTest
Running org.apache.commons.codec.net.UtilsTest
Tests run: 1, Failures: 0, Errors: 0, Skipped: 0, Time elapsed: 0 sec - in org.apache.commons.codec.net.UtilsTest
Running org.apache.commons.codec.net.RFC1522CodecTest
Tests run: 2, Failures: 0, Errors: 0, Skipped: 0, Time elapsed: 0 sec - in org.apache.commons.codec.net.RFC1522CodecTest
Running org.apache.commons.codec.net.URLCodecTest
Tests run: 16, Failures: 0, Errors: 0, Skipped: 0, Time elapsed: 0.003 sec - in org.apache.commons.codec.net.URLCodecTest
Running org.apache.commons.codec.net.QuotedPrintableCodecTest
Tests run: 21, Failures: 0, Errors: 0, Skipped: 0, Time elapsed: 0.012 sec - in org.apache.commons.codec.net.QuotedPrintableCodecTest
Running org.apache.commons.codec.StringEncoderComparatorTest
Tests run: 3, Failures: 0, Errors: 1, Skipped: 0, Time elapsed: 0.013 sec <<< FAILURE! - in org.apache.commons.codec.StringEncoderComparatorTest
testComparatorWithSoundex(org.apache.commons.codec.StringEncoderComparatorTest)  Time elapsed: 0.011 sec  <<< ERROR!
java.lang.StringIndexOutOfBoundsException: String index out of range: 6
	at java.lang.String.charAt(String.java:658)
	at org.apache.commons.codec.language.Soundex.getMappingCode(Soundex.java:25)
	at org.apache.commons.codec.language.Soundex.soundex(Soundex.java:44)
	at org.apache.commons.codec.language.Soundex.encode(Soundex.java:22)
	at org.apache.commons.codec.StringEncoderComparator.compare(StringEncoderComparator.java:82)
	at org.apache.commons.codec.StringEncoderComparatorTest.testComparatorWithSoundex(StringEncoderComparatorTest.java:43)

Running org.apache.commons.codec.language.Caverphone1Test
Tests run: 9, Failures: 0, Errors: 0, Skipped: 0, Time elapsed: 0.024 sec - in org.apache.commons.codec.language.Caverphone1Test
Running org.apache.commons.codec.language.NysiisTest
Tests run: 23, Failures: 0, Errors: 0, Skipped: 0, Time elapsed: 0.02 sec - in org.apache.commons.codec.language.NysiisTest
Running org.apache.commons.codec.language.Caverphone2Test
Tests run: 13, Failures: 0, Errors: 0, Skipped: 0, Time elapsed: 0.14 sec - in org.apache.commons.codec.language.Caverphone2Test
Running org.apache.commons.codec.language.DaitchMokotoffSoundexTest
Tests run: 13, Failures: 0, Errors: 0, Skipped: 0, Time elapsed: 0.055 sec - in org.apache.commons.codec.language.DaitchMokotoffSoundexTest
Running org.apache.commons.codec.language.bm.BeiderMorseEncoderTest
Tests run: 22, Failures: 0, Errors: 0, Skipped: 0, Time elapsed: 3.082 sec - in org.apache.commons.codec.language.bm.BeiderMorseEncoderTest
Running org.apache.commons.codec.language.bm.PhoneticEngineTest
Tests run: 8, Failures: 0, Errors: 0, Skipped: 0, Time elapsed: 0.02 sec - in org.apache.commons.codec.language.bm.PhoneticEngineTest
Running org.apache.commons.codec.language.bm.PhoneticEngineRegressionTest
Tests run: 4, Failures: 0, Errors: 0, Skipped: 0, Time elapsed: 0.017 sec - in org.apache.commons.codec.language.bm.PhoneticEngineRegressionTest
Running org.apache.commons.codec.language.bm.RuleTest
Tests run: 3, Failures: 0, Errors: 0, Skipped: 0, Time elapsed: 0.002 sec - in org.apache.commons.codec.language.bm.RuleTest
Running org.apache.commons.codec.language.bm.LanguageGuessingTest
Tests run: 18, Failures: 0, Errors: 0, Skipped: 0, Time elapsed: 0.012 sec - in org.apache.commons.codec.language.bm.LanguageGuessingTest
Running org.apache.commons.codec.language.DoubleMetaphoneTest
Tests run: 16, Failures: 0, Errors: 0, Skipped: 0, Time elapsed: 0.048 sec - in org.apache.commons.codec.language.DoubleMetaphoneTest
Running org.apache.commons.codec.language.SoundexTest
Tests run: 28, Failures: 4, Errors: 14, Skipped: 0, Time elapsed: 0.013 sec <<< FAILURE! - in org.apache.commons.codec.language.SoundexTest
testBadCharacters(org.apache.commons.codec.language.SoundexTest)  Time elapsed: 0 sec  <<< ERROR!
java.lang.StringIndexOutOfBoundsException: String index out of range: 6
	at java.lang.String.charAt(String.java:658)
	at org.apache.commons.codec.language.Soundex.getMappingCode(Soundex.java:25)
	at org.apache.commons.codec.language.Soundex.soundex(Soundex.java:44)
	at org.apache.commons.codec.language.Soundex.encode(Soundex.java:23)
	at org.apache.commons.codec.language.SoundexTest.testBadCharacters(SoundexTest.java:88)

testUsEnglishStatic(org.apache.commons.codec.language.SoundexTest)  Time elapsed: 0 sec  <<< ERROR!
java.lang.StringIndexOutOfBoundsException: String index out of range: 8
	at java.lang.String.charAt(String.java:658)
	at org.apache.commons.codec.language.Soundex.getMappingCode(Soundex.java:25)
	at org.apache.commons.codec.language.Soundex.soundex(Soundex.java:44)
	at org.apache.commons.codec.language.SoundexTest.testUsEnglishStatic(SoundexTest.java:346)

testMsSqlServer2(org.apache.commons.codec.language.SoundexTest)  Time elapsed: 0 sec  <<< ERROR!
java.lang.StringIndexOutOfBoundsException: String index out of range: 8
	at java.lang.String.charAt(String.java:658)
	at org.apache.commons.codec.language.Soundex.getMappingCode(Soundex.java:25)
	at org.apache.commons.codec.language.Soundex.soundex(Soundex.java:44)
	at org.apache.commons.codec.language.Soundex.encode(Soundex.java:23)
	at org.apache.commons.codec.StringEncoderAbstractTest.checkEncoding(StringEncoderAbstractTest.java:33)
	at org.apache.commons.codec.StringEncoderAbstractTest.checkEncodingVariations(StringEncoderAbstractTest.java:44)
	at org.apache.commons.codec.language.SoundexTest.testMsSqlServer2(SoundexTest.java:291)

testMsSqlServer3(org.apache.commons.codec.language.SoundexTest)  Time elapsed: 0.001 sec  <<< ERROR!
java.lang.StringIndexOutOfBoundsException: String index out of range: 3
	at java.lang.String.charAt(String.java:658)
	at org.apache.commons.codec.language.Soundex.getMappingCode(Soundex.java:25)
	at org.apache.commons.codec.language.Soundex.soundex(Soundex.java:44)
	at org.apache.commons.codec.language.Soundex.encode(Soundex.java:23)
	at org.apache.commons.codec.language.SoundexTest.testMsSqlServer3(SoundexTest.java:299)

testB650(org.apache.commons.codec.language.SoundexTest)  Time elapsed: 0 sec  <<< ERROR!
java.lang.StringIndexOutOfBoundsException: String index out of range: 6
	at java.lang.String.charAt(String.java:658)
	at org.apache.commons.codec.language.Soundex.getMappingCode(Soundex.java:25)
	at org.apache.commons.codec.language.Soundex.soundex(Soundex.java:44)
	at org.apache.commons.codec.language.Soundex.encode(Soundex.java:23)
	at org.apache.commons.codec.StringEncoderAbstractTest.checkEncoding(StringEncoderAbstractTest.java:33)
	at org.apache.commons.codec.StringEncoderAbstractTest.checkEncodingVariations(StringEncoderAbstractTest.java:44)
	at org.apache.commons.codec.language.SoundexTest.testB650(SoundexTest.java:43)

testEncodeBatch2(org.apache.commons.codec.language.SoundexTest)  Time elapsed: 0.001 sec  <<< ERROR!
java.lang.StringIndexOutOfBoundsException: String index out of range: 4
	at java.lang.String.charAt(String.java:658)
	at org.apache.commons.codec.language.Soundex.getMappingCode(Soundex.java:25)
	at org.apache.commons.codec.language.Soundex.soundex(Soundex.java:44)
	at org.apache.commons.codec.language.Soundex.encode(Soundex.java:23)
	at org.apache.commons.codec.language.SoundexTest.testEncodeBatch2(SoundexTest.java:138)

testEncodeBatch3(org.apache.commons.codec.language.SoundexTest)  Time elapsed: 0.002 sec  <<< FAILURE!
org.junit.ComparisonFailure: expected:<W[252]> but was:<W[523]>
	at org.junit.Assert.assertEquals(Assert.java:115)
	at org.junit.Assert.assertEquals(Assert.java:144)
	at org.apache.commons.codec.language.SoundexTest.testEncodeBatch3(SoundexTest.java:154)

testEncodeBatch4(org.apache.commons.codec.language.SoundexTest)  Time elapsed: 0 sec  <<< ERROR!
java.lang.StringIndexOutOfBoundsException: String index out of range: 6
	at java.lang.String.charAt(String.java:658)
	at org.apache.commons.codec.language.Soundex.getMappingCode(Soundex.java:25)
	at org.apache.commons.codec.language.Soundex.soundex(Soundex.java:44)
	at org.apache.commons.codec.language.Soundex.encode(Soundex.java:23)
	at org.apache.commons.codec.language.SoundexTest.testEncodeBatch4(SoundexTest.java:170)

testEncodeIgnoreTrimmable(org.apache.commons.codec.language.SoundexTest)  Time elapsed: 0 sec  <<< FAILURE!
org.junit.ComparisonFailure: expected:<W[252]> but was:<W[523]>
	at org.junit.Assert.assertEquals(Assert.java:115)
	at org.junit.Assert.assertEquals(Assert.java:144)
	at org.apache.commons.codec.language.SoundexTest.testEncodeIgnoreTrimmable(SoundexTest.java:217)

testEncodeIgnoreApostrophes(org.apache.commons.codec.language.SoundexTest)  Time elapsed: 0.001 sec  <<< ERROR!
java.lang.StringIndexOutOfBoundsException: String index out of range: 6
	at java.lang.String.charAt(String.java:658)
	at org.apache.commons.codec.language.Soundex.getMappingCode(Soundex.java:25)
	at org.apache.commons.codec.language.Soundex.soundex(Soundex.java:44)
	at org.apache.commons.codec.language.Soundex.encode(Soundex.java:23)
	at org.apache.commons.codec.StringEncoderAbstractTest.checkEncoding(StringEncoderAbstractTest.java:33)
	at org.apache.commons.codec.StringEncoderAbstractTest.checkEncodingVariations(StringEncoderAbstractTest.java:44)
	at org.apache.commons.codec.language.SoundexTest.testEncodeIgnoreApostrophes(SoundexTest.java:183)

testDifference(org.apache.commons.codec.language.SoundexTest)  Time elapsed: 0 sec  <<< ERROR!
java.lang.StringIndexOutOfBoundsException: String index out of range: 3
	at java.lang.String.charAt(String.java:658)
	at org.apache.commons.codec.language.Soundex.getMappingCode(Soundex.java:25)
	at org.apache.commons.codec.language.Soundex.soundex(Soundex.java:44)
	at org.apache.commons.codec.language.Soundex.encode(Soundex.java:23)
	at org.apache.commons.codec.language.SoundexUtils.difference(SoundexUtils.java:86)
	at org.apache.commons.codec.language.Soundex.difference(Soundex.java:20)
	at org.apache.commons.codec.language.SoundexTest.testDifference(SoundexTest.java:100)

testNewInstance(org.apache.commons.codec.language.SoundexTest)  Time elapsed: 0 sec  <<< ERROR!
java.lang.StringIndexOutOfBoundsException: String index out of range: 8
	at java.lang.String.charAt(String.java:658)
	at org.apache.commons.codec.language.Soundex.getMappingCode(Soundex.java:25)
	at org.apache.commons.codec.language.Soundex.soundex(Soundex.java:44)
	at org.apache.commons.codec.language.SoundexTest.testNewInstance(SoundexTest.java:315)

testEncodeBasic(org.apache.commons.codec.language.SoundexTest)  Time elapsed: 0 sec  <<< ERROR!
java.lang.StringIndexOutOfBoundsException: String index out of range: 5
	at java.lang.String.charAt(String.java:658)
	at org.apache.commons.codec.language.Soundex.getMappingCode(Soundex.java:25)
	at org.apache.commons.codec.language.Soundex.soundex(Soundex.java:44)
	at org.apache.commons.codec.language.Soundex.encode(Soundex.java:23)
	at org.apache.commons.codec.language.SoundexTest.testEncodeBasic(SoundexTest.java:116)

testNewInstance2(org.apache.commons.codec.language.SoundexTest)  Time elapsed: 0.002 sec  <<< ERROR!
java.lang.StringIndexOutOfBoundsException: String index out of range: 8
	at java.lang.String.charAt(String.java:658)
	at org.apache.commons.codec.language.Soundex.getMappingCode(Soundex.java:25)
	at org.apache.commons.codec.language.Soundex.soundex(Soundex.java:44)
	at org.apache.commons.codec.language.SoundexTest.testNewInstance2(SoundexTest.java:320)

testNewInstance3(org.apache.commons.codec.language.SoundexTest)  Time elapsed: 0 sec  <<< ERROR!
java.lang.StringIndexOutOfBoundsException: String index out of range: 8
	at java.lang.String.charAt(String.java:658)
	at org.apache.commons.codec.language.Soundex.getMappingCode(Soundex.java:25)
	at org.apache.commons.codec.language.Soundex.soundex(Soundex.java:44)
	at org.apache.commons.codec.language.SoundexTest.testNewInstance3(SoundexTest.java:325)

testHWRuleEx1(org.apache.commons.codec.language.SoundexTest)  Time elapsed: 0 sec  <<< FAILURE!
org.junit.ComparisonFailure: expected:<A2[61]> but was:<A2[26]>
	at org.junit.Assert.assertEquals(Assert.java:115)
	at org.junit.Assert.assertEquals(Assert.java:144)
	at org.apache.commons.codec.language.SoundexTest.testHWRuleEx1(SoundexTest.java:229)

testHWRuleEx2(org.apache.commons.codec.language.SoundexTest)  Time elapsed: 0 sec  <<< FAILURE!
org.junit.ComparisonFailure: expected:<B3[12]> but was:<B3[31]>
	at org.junit.Assert.assertEquals(Assert.java:115)
	at org.junit.Assert.assertEquals(Assert.java:144)
	at org.apache.commons.codec.language.SoundexTest.testHWRuleEx2(SoundexTest.java:239)

testHWRuleEx3(org.apache.commons.codec.language.SoundexTest)  Time elapsed: 0.001 sec  <<< ERROR!
java.lang.StringIndexOutOfBoundsException: String index out of range: 5
	at java.lang.String.charAt(String.java:658)
	at org.apache.commons.codec.language.Soundex.getMappingCode(Soundex.java:25)
	at org.apache.commons.codec.language.Soundex.soundex(Soundex.java:44)
	at org.apache.commons.codec.language.Soundex.encode(Soundex.java:23)
	at org.apache.commons.codec.language.SoundexTest.testHWRuleEx3(SoundexTest.java:250)

Running org.apache.commons.codec.language.RefinedSoundexTest
Tests run: 10, Failures: 0, Errors: 0, Skipped: 0, Time elapsed: 0.001 sec - in org.apache.commons.codec.language.RefinedSoundexTest
Running org.apache.commons.codec.language.MatchRatingApproachEncoderTest
Tests run: 96, Failures: 0, Errors: 0, Skipped: 0, Time elapsed: 0.026 sec - in org.apache.commons.codec.language.MatchRatingApproachEncoderTest
Running org.apache.commons.codec.language.ColognePhoneticTest
Tests run: 13, Failures: 0, Errors: 0, Skipped: 0, Time elapsed: 0.002 sec - in org.apache.commons.codec.language.ColognePhoneticTest
Running org.apache.commons.codec.language.DoubleMetaphone2Test
Tests run: 6, Failures: 0, Errors: 0, Skipped: 0, Time elapsed: 0.029 sec - in org.apache.commons.codec.language.DoubleMetaphone2Test
Running org.apache.commons.codec.language.MetaphoneTest
Tests run: 34, Failures: 0, Errors: 0, Skipped: 0, Time elapsed: 0.095 sec - in org.apache.commons.codec.language.MetaphoneTest
Running org.apache.commons.codec.CharEncodingTest
Tests run: 7, Failures: 0, Errors: 0, Skipped: 0, Time elapsed: 0 sec - in org.apache.commons.codec.CharEncodingTest

Results :

Failed tests: 
  SoundexTest.testEncodeBatch3:154 expected:<W[252]> but was:<W[523]>
  SoundexTest.testEncodeIgnoreTrimmable:217 expected:<W[252]> but was:<W[523]>
  SoundexTest.testHWRuleEx1:229 expected:<A2[61]> but was:<A2[26]>
  SoundexTest.testHWRuleEx2:239 expected:<B3[12]> but was:<B3[31]>

Tests in error: 
  StringEncoderComparatorTest.testComparatorWithSoundex:43 » StringIndexOutOfBounds
  SoundexTest.testBadCharacters:88 » StringIndexOutOfBounds String index out of ...
  SoundexTest.testUsEnglishStatic:346 » StringIndexOutOfBounds String index out ...
  SoundexTest.testMsSqlServer2:291->StringEncoderAbstractTest.checkEncodingVariations:44->StringEncoderAbstractTest.checkEncoding:33 » StringIndexOutOfBounds
  SoundexTest.testMsSqlServer3:299 » StringIndexOutOfBounds String index out of ...
  SoundexTest.testB650:43->StringEncoderAbstractTest.checkEncodingVariations:44->StringEncoderAbstractTest.checkEncoding:33 » StringIndexOutOfBounds
  SoundexTest.testEncodeBatch2:138 » StringIndexOutOfBounds String index out of ...
  SoundexTest.testEncodeBatch4:170 » StringIndexOutOfBounds String index out of ...
  SoundexTest.testEncodeIgnoreApostrophes:183->StringEncoderAbstractTest.checkEncodingVariations:44->StringEncoderAbstractTest.checkEncoding:33 » StringIndexOutOfBounds
  SoundexTest.testDifference:100 » StringIndexOutOfBounds String index out of ra...
  SoundexTest.testNewInstance:315 » StringIndexOutOfBounds String index out of r...
  SoundexTest.testEncodeBasic:116 » StringIndexOutOfBounds String index out of r...
  SoundexTest.testNewInstance2:320 » StringIndexOutOfBounds String index out of ...
  SoundexTest.testNewInstance3:325 » StringIndexOutOfBounds String index out of ...
  SoundexTest.testHWRuleEx3:250 » StringIndexOutOfBounds String index out of ran...

Tests run: 662, Failures: 4, Errors: 15, Skipped: 1

[INFO] ------------------------------------------------------------------------
[INFO] BUILD FAILURE
[INFO] ------------------------------------------------------------------------
[INFO] Total time: 14.011s
[INFO] Finished at: Sun Aug 02 12:51:28 BST 2015
[INFO] Final Memory: 28M/349M
[INFO] ------------------------------------------------------------------------
[ERROR] Failed to execute goal org.apache.maven.plugins:maven-surefire-plugin:2.17:test (default-test) on project commons-codec: There are test failures.
[ERROR] 
[ERROR] Please refer to /home/perham/Study/LittleDarwin/Cases/commons-codec-1.10-src/target/surefire-reports for the individual test results.
[ERROR] -> [Help 1]
[ERROR] 
[ERROR] To see the full stack trace of the errors, re-run Maven with the -e switch.
[ERROR] Re-run Maven using the -X switch to enable full debug logging.
[ERROR] 
[ERROR] For more information about the errors and possible solutions, please read the following articles:
[ERROR] [Help 1] http://cwiki.apache.org/confluence/display/MAVEN/MojoFailureException
