[INFO] Scanning for projects...
[INFO]                                                                         
[INFO] ------------------------------------------------------------------------
[INFO] Building Apache Commons Codec 1.10
[INFO] ------------------------------------------------------------------------
[INFO] 
[INFO] --- maven-enforcer-plugin:1.3.1:enforce (enforce-maven-3) @ commons-codec ---
[INFO] 
[INFO] --- maven-antrun-plugin:1.7:run (javadoc.resources) @ commons-codec ---
[INFO] Executing tasks

main:
[INFO] Executed tasks
[INFO] 
[INFO] --- maven-remote-resources-plugin:1.5:process (default) @ commons-codec ---
[INFO] 
[INFO] --- buildnumber-maven-plugin:1.3:create (default) @ commons-codec ---
[INFO] Executing: /bin/sh -c cd /home/perham/Study/LittleDarwin/Cases/commons-codec-1.10-src && svn --non-interactive info
[INFO] Working directory: /home/perham/Study/LittleDarwin/Cases/commons-codec-1.10-src
[INFO] Storing buildNumber: ?????? at timestamp: 1438515423175
[INFO] Executing: /bin/sh -c cd /home/perham/Study/LittleDarwin/Cases/commons-codec-1.10-src && svn --non-interactive info
[INFO] Working directory: /home/perham/Study/LittleDarwin/Cases/commons-codec-1.10-src
[INFO] Storing buildScmBranch: UNKNOWN_BRANCH
[INFO] 
[INFO] --- maven-resources-plugin:2.7:resources (default-resources) @ commons-codec ---
[INFO] Using 'UTF-8' encoding to copy filtered resources.
[INFO] Copying 128 resources
[INFO] Copying 2 resources to META-INF
[INFO] 
[INFO] --- maven-compiler-plugin:3.2:compile (default-compile) @ commons-codec ---
[INFO] Changes detected - recompiling the module!
[INFO] Compiling 60 source files to /home/perham/Study/LittleDarwin/Cases/commons-codec-1.10-src/target/classes
[INFO] /home/perham/Study/LittleDarwin/Cases/commons-codec-1.10-src/src/main/java/org/apache/commons/codec/digest/Sha2Crypt.java: Some input files use or override a deprecated API.
[INFO] /home/perham/Study/LittleDarwin/Cases/commons-codec-1.10-src/src/main/java/org/apache/commons/codec/digest/Sha2Crypt.java: Recompile with -Xlint:deprecation for details.
[INFO] 
[INFO] --- maven-bundle-plugin:2.5.3:manifest (bundle-manifest) @ commons-codec ---
[INFO] 
[INFO] --- maven-resources-plugin:2.7:testResources (default-testResources) @ commons-codec ---
[INFO] Using 'UTF-8' encoding to copy filtered resources.
[INFO] skip non existing resourceDirectory /home/perham/Study/LittleDarwin/Cases/commons-codec-1.10-src/src/test/resources
[INFO] Copying 2 resources to META-INF
[INFO] 
[INFO] --- maven-compiler-plugin:3.2:testCompile (default-testCompile) @ commons-codec ---
[INFO] Nothing to compile - all classes are up to date
[INFO] 
[INFO] --- maven-surefire-plugin:2.17:test (default-test) @ commons-codec ---
[INFO] Surefire report directory: /home/perham/Study/LittleDarwin/Cases/commons-codec-1.10-src/target/surefire-reports

-------------------------------------------------------
 T E S T S
-------------------------------------------------------
Running org.apache.commons.codec.digest.B64Test
Tests run: 2, Failures: 0, Errors: 0, Skipped: 0, Time elapsed: 0.041 sec - in org.apache.commons.codec.digest.B64Test
Running org.apache.commons.codec.digest.DigestUtilsTest
Tests run: 17, Failures: 0, Errors: 0, Skipped: 0, Time elapsed: 0.652 sec - in org.apache.commons.codec.digest.DigestUtilsTest
Running org.apache.commons.codec.digest.Sha512CryptTest
Tests run: 8, Failures: 0, Errors: 0, Skipped: 0, Time elapsed: 0.515 sec - in org.apache.commons.codec.digest.Sha512CryptTest
Running org.apache.commons.codec.digest.Apr1CryptTest
Tests run: 8, Failures: 0, Errors: 0, Skipped: 0, Time elapsed: 0.073 sec - in org.apache.commons.codec.digest.Apr1CryptTest
Running org.apache.commons.codec.digest.HmacUtilsTest
Tests run: 24, Failures: 0, Errors: 0, Skipped: 0, Time elapsed: 0.055 sec - in org.apache.commons.codec.digest.HmacUtilsTest
Running org.apache.commons.codec.digest.Sha2CryptTest
Tests run: 1, Failures: 0, Errors: 0, Skipped: 0, Time elapsed: 0.001 sec - in org.apache.commons.codec.digest.Sha2CryptTest
Running org.apache.commons.codec.digest.CryptTest
Tests run: 4, Failures: 0, Errors: 0, Skipped: 0, Time elapsed: 0.079 sec - in org.apache.commons.codec.digest.CryptTest
Running org.apache.commons.codec.digest.Sha256CryptTest
Tests run: 7, Failures: 0, Errors: 0, Skipped: 0, Time elapsed: 0.099 sec - in org.apache.commons.codec.digest.Sha256CryptTest
Running org.apache.commons.codec.digest.Md5CryptTest
Tests run: 7, Failures: 0, Errors: 0, Skipped: 0, Time elapsed: 0.025 sec - in org.apache.commons.codec.digest.Md5CryptTest
Running org.apache.commons.codec.digest.UnixCryptTest
Tests run: 9, Failures: 0, Errors: 0, Skipped: 0, Time elapsed: 0.006 sec - in org.apache.commons.codec.digest.UnixCryptTest
Running org.apache.commons.codec.CharsetsTest
Tests run: 7, Failures: 0, Errors: 0, Skipped: 0, Time elapsed: 0.001 sec - in org.apache.commons.codec.CharsetsTest
Running org.apache.commons.codec.binary.Base32Test
Tests run: 8, Failures: 0, Errors: 0, Skipped: 0, Time elapsed: 0.008 sec - in org.apache.commons.codec.binary.Base32Test
Running org.apache.commons.codec.binary.Base64OutputStreamTest
Tests run: 7, Failures: 0, Errors: 0, Skipped: 0, Time elapsed: 0.214 sec - in org.apache.commons.codec.binary.Base64OutputStreamTest
Running org.apache.commons.codec.binary.Base64Codec13Test
Tests run: 8, Failures: 0, Errors: 0, Skipped: 0, Time elapsed: 0.01 sec - in org.apache.commons.codec.binary.Base64Codec13Test
Running org.apache.commons.codec.binary.Base64InputStreamTest
Tests run: 19, Failures: 0, Errors: 0, Skipped: 0, Time elapsed: 0.13 sec - in org.apache.commons.codec.binary.Base64InputStreamTest
Running org.apache.commons.codec.binary.Base32InputStreamTest
Tests run: 16, Failures: 0, Errors: 0, Skipped: 0, Time elapsed: 0.119 sec - in org.apache.commons.codec.binary.Base32InputStreamTest
Running org.apache.commons.codec.binary.Base32OutputStreamTest
Tests run: 6, Failures: 0, Errors: 0, Skipped: 0, Time elapsed: 0.076 sec - in org.apache.commons.codec.binary.Base32OutputStreamTest
Running org.apache.commons.codec.binary.BinaryCodecTest
Tests run: 13, Failures: 0, Errors: 0, Skipped: 0, Time elapsed: 0.009 sec - in org.apache.commons.codec.binary.BinaryCodecTest
Running org.apache.commons.codec.binary.BaseNCodecTest
Tests run: 7, Failures: 0, Errors: 0, Skipped: 0, Time elapsed: 0.002 sec - in org.apache.commons.codec.binary.BaseNCodecTest
Running org.apache.commons.codec.binary.StringUtilsTest
Tests run: 17, Failures: 0, Errors: 0, Skipped: 0, Time elapsed: 0.028 sec - in org.apache.commons.codec.binary.StringUtilsTest
Running org.apache.commons.codec.binary.Base64Test
Tests run: 53, Failures: 0, Errors: 0, Skipped: 1, Time elapsed: 0.05 sec - in org.apache.commons.codec.binary.Base64Test
Running org.apache.commons.codec.binary.HexTest
Tests run: 19, Failures: 0, Errors: 0, Skipped: 0, Time elapsed: 0.184 sec - in org.apache.commons.codec.binary.HexTest
Running org.apache.commons.codec.DecoderExceptionTest
Tests run: 4, Failures: 0, Errors: 0, Skipped: 0, Time elapsed: 0.001 sec - in org.apache.commons.codec.DecoderExceptionTest
Running org.apache.commons.codec.EncoderExceptionTest
Tests run: 4, Failures: 0, Errors: 0, Skipped: 0, Time elapsed: 0.001 sec - in org.apache.commons.codec.EncoderExceptionTest
Running org.apache.commons.codec.net.BCodecTest
Tests run: 9, Failures: 0, Errors: 0, Skipped: 0, Time elapsed: 0.007 sec - in org.apache.commons.codec.net.BCodecTest
Running org.apache.commons.codec.net.QCodecTest
Tests run: 12, Failures: 0, Errors: 0, Skipped: 0, Time elapsed: 0.009 sec - in org.apache.commons.codec.net.QCodecTest
Running org.apache.commons.codec.net.UtilsTest
Tests run: 1, Failures: 0, Errors: 0, Skipped: 0, Time elapsed: 0 sec - in org.apache.commons.codec.net.UtilsTest
Running org.apache.commons.codec.net.RFC1522CodecTest
Tests run: 2, Failures: 0, Errors: 0, Skipped: 0, Time elapsed: 0.001 sec - in org.apache.commons.codec.net.RFC1522CodecTest
Running org.apache.commons.codec.net.URLCodecTest
Tests run: 16, Failures: 0, Errors: 0, Skipped: 0, Time elapsed: 0.007 sec - in org.apache.commons.codec.net.URLCodecTest
Running org.apache.commons.codec.net.QuotedPrintableCodecTest
Tests run: 21, Failures: 0, Errors: 0, Skipped: 0, Time elapsed: 0.01 sec - in org.apache.commons.codec.net.QuotedPrintableCodecTest
Running org.apache.commons.codec.StringEncoderComparatorTest
Tests run: 3, Failures: 0, Errors: 0, Skipped: 0, Time elapsed: 0.005 sec - in org.apache.commons.codec.StringEncoderComparatorTest
Running org.apache.commons.codec.language.Caverphone1Test
Tests run: 9, Failures: 0, Errors: 0, Skipped: 0, Time elapsed: 0.03 sec - in org.apache.commons.codec.language.Caverphone1Test
Running org.apache.commons.codec.language.NysiisTest
Tests run: 23, Failures: 18, Errors: 0, Skipped: 0, Time elapsed: 0.025 sec <<< FAILURE! - in org.apache.commons.codec.language.NysiisTest
testRule4Dot1(org.apache.commons.codec.language.NysiisTest)  Time elapsed: 0.005 sec  <<< FAILURE!
org.junit.ComparisonFailure: Problem with XEV expected:<X[AF]> but was:<X[]>
	at org.junit.Assert.assertEquals(Assert.java:115)
	at org.apache.commons.codec.language.NysiisTest.assertEncodings(NysiisTest.java:46)
	at org.apache.commons.codec.language.NysiisTest.testRule4Dot1(NysiisTest.java:209)

testRule4Dot2(org.apache.commons.codec.language.NysiisTest)  Time elapsed: 0 sec  <<< FAILURE!
org.junit.ComparisonFailure: Problem with XQ expected:<X[G]> but was:<X[]>
	at org.junit.Assert.assertEquals(Assert.java:115)
	at org.apache.commons.codec.language.NysiisTest.assertEncodings(NysiisTest.java:46)
	at org.apache.commons.codec.language.NysiisTest.testRule4Dot2(NysiisTest.java:225)

testCap(org.apache.commons.codec.language.NysiisTest)  Time elapsed: 0.001 sec  <<< FAILURE!
org.junit.ComparisonFailure: Problem with Capp expected:<C[AP]> but was:<C[]>
	at org.junit.Assert.assertEquals(Assert.java:115)
	at org.apache.commons.codec.language.NysiisTest.encodeAll(NysiisTest.java:57)
	at org.apache.commons.codec.language.NysiisTest.testCap(NysiisTest.java:68)

testDad(org.apache.commons.codec.language.NysiisTest)  Time elapsed: 0 sec  <<< FAILURE!
org.junit.ComparisonFailure: Problem with Dent expected:<D[AD]> but was:<D[]>
	at org.junit.Assert.assertEquals(Assert.java:115)
	at org.apache.commons.codec.language.NysiisTest.encodeAll(NysiisTest.java:57)
	at org.apache.commons.codec.language.NysiisTest.testDad(NysiisTest.java:75)

testDan(org.apache.commons.codec.language.NysiisTest)  Time elapsed: 0.002 sec  <<< FAILURE!
org.junit.ComparisonFailure: Problem with Dean expected:<D[AN]> but was:<D[]>
	at org.junit.Assert.assertEquals(Assert.java:115)
	at org.apache.commons.codec.language.NysiisTest.encodeAll(NysiisTest.java:57)
	at org.apache.commons.codec.language.NysiisTest.testDan(NysiisTest.java:80)

testFal(org.apache.commons.codec.language.NysiisTest)  Time elapsed: 0.001 sec  <<< FAILURE!
org.junit.ComparisonFailure: Problem with Phil expected:<F[AL]> but was:<F[]>
	at org.junit.Assert.assertEquals(Assert.java:115)
	at org.apache.commons.codec.language.NysiisTest.encodeAll(NysiisTest.java:57)
	at org.apache.commons.codec.language.NysiisTest.testFal(NysiisTest.java:149)

testRule1(org.apache.commons.codec.language.NysiisTest)  Time elapsed: 0 sec  <<< FAILURE!
org.junit.ComparisonFailure: Problem with MACX expected:<MC[X]> but was:<MC[]>
	at org.junit.Assert.assertEquals(Assert.java:115)
	at org.apache.commons.codec.language.NysiisTest.assertEncodings(NysiisTest.java:46)
	at org.apache.commons.codec.language.NysiisTest.testRule1(NysiisTest.java:176)

testRule2(org.apache.commons.codec.language.NysiisTest)  Time elapsed: 0 sec  <<< FAILURE!
org.junit.ComparisonFailure: Problem with XEE expected:<X[Y]> but was:<X[]>
	at org.junit.Assert.assertEquals(Assert.java:115)
	at org.apache.commons.codec.language.NysiisTest.assertEncodings(NysiisTest.java:46)
	at org.apache.commons.codec.language.NysiisTest.testRule2(NysiisTest.java:192)

testRule5(org.apache.commons.codec.language.NysiisTest)  Time elapsed: 0 sec  <<< FAILURE!
org.junit.ComparisonFailure: Problem with XS expected:<X[]> but was:<X[S]>
	at org.junit.Assert.assertEquals(Assert.java:115)
	at org.apache.commons.codec.language.NysiisTest.assertEncodings(NysiisTest.java:46)
	at org.apache.commons.codec.language.NysiisTest.testRule5(NysiisTest.java:238)

testRule6(org.apache.commons.codec.language.NysiisTest)  Time elapsed: 0 sec  <<< FAILURE!
org.junit.ComparisonFailure: Problem with XAY expected:<X[Y]> but was:<X[]>
	at org.junit.Assert.assertEquals(Assert.java:115)
	at org.apache.commons.codec.language.NysiisTest.assertEncodings(NysiisTest.java:46)
	at org.apache.commons.codec.language.NysiisTest.testRule6(NysiisTest.java:250)

testRule7(org.apache.commons.codec.language.NysiisTest)  Time elapsed: 0 sec  <<< FAILURE!
org.junit.ComparisonFailure: Problem with XAS expected:<X[]> but was:<X[AS]>
	at org.junit.Assert.assertEquals(Assert.java:115)
	at org.apache.commons.codec.language.NysiisTest.assertEncodings(NysiisTest.java:46)
	at org.apache.commons.codec.language.NysiisTest.testRule7(NysiisTest.java:262)

testBran(org.apache.commons.codec.language.NysiisTest)  Time elapsed: 0 sec  <<< FAILURE!
org.junit.ComparisonFailure: Problem with Brian expected:<BR[AN]> but was:<BR[]>
	at org.junit.Assert.assertEquals(Assert.java:115)
	at org.apache.commons.codec.language.NysiisTest.encodeAll(NysiisTest.java:57)
	at org.apache.commons.codec.language.NysiisTest.testBran(NysiisTest.java:63)

testSnad(org.apache.commons.codec.language.NysiisTest)  Time elapsed: 0 sec  <<< FAILURE!
org.junit.ComparisonFailure: Problem with Schmidt expected:<SN[AD]> but was:<SN[]>
	at org.junit.Assert.assertEquals(Assert.java:115)
	at org.apache.commons.codec.language.NysiisTest.encodeAll(NysiisTest.java:57)
	at org.apache.commons.codec.language.NysiisTest.testSnad(NysiisTest.java:270)

testSnat(org.apache.commons.codec.language.NysiisTest)  Time elapsed: 0 sec  <<< FAILURE!
org.junit.ComparisonFailure: Problem with Smith expected:<SN[AT]> but was:<SN[]>
	at org.junit.Assert.assertEquals(Assert.java:115)
	at org.apache.commons.codec.language.NysiisTest.encodeAll(NysiisTest.java:57)
	at org.apache.commons.codec.language.NysiisTest.testSnat(NysiisTest.java:275)

testDropBy(org.apache.commons.codec.language.NysiisTest)  Time elapsed: 0 sec  <<< FAILURE!
org.junit.ComparisonFailure: Problem with MACINTOSH expected:<MCANT[]> but was:<MCANT[AS]>
	at org.junit.Assert.assertEquals(Assert.java:115)
	at org.apache.commons.codec.language.NysiisTest.assertEncodings(NysiisTest.java:46)
	at org.apache.commons.codec.language.NysiisTest.testDropBy(NysiisTest.java:95)

testOthers(org.apache.commons.codec.language.NysiisTest)  Time elapsed: 0 sec  <<< FAILURE!
org.junit.ComparisonFailure: Problem with O'Daniel expected:<ODAN[AL]> but was:<ODAN[]>
	at org.junit.Assert.assertEquals(Assert.java:115)
	at org.apache.commons.codec.language.NysiisTest.assertEncodings(NysiisTest.java:46)
	at org.apache.commons.codec.language.NysiisTest.testOthers(NysiisTest.java:159)

testTranan(org.apache.commons.codec.language.NysiisTest)  Time elapsed: 0.001 sec  <<< FAILURE!
org.junit.ComparisonFailure: Problem with Trueman expected:<TRAN[AN]> but was:<TRAN[]>
	at org.junit.Assert.assertEquals(Assert.java:115)
	at org.apache.commons.codec.language.NysiisTest.encodeAll(NysiisTest.java:57)
	at org.apache.commons.codec.language.NysiisTest.testTranan(NysiisTest.java:291)

testSpecialBranches(org.apache.commons.codec.language.NysiisTest)  Time elapsed: 0 sec  <<< FAILURE!
org.junit.ComparisonFailure: Problem with Kobwick expected:<CABW[AC]> but was:<CABW[]>
	at org.junit.Assert.assertEquals(Assert.java:115)
	at org.apache.commons.codec.language.NysiisTest.encodeAll(NysiisTest.java:57)
	at org.apache.commons.codec.language.NysiisTest.testSpecialBranches(NysiisTest.java:280)

Running org.apache.commons.codec.language.Caverphone2Test
Tests run: 13, Failures: 0, Errors: 0, Skipped: 0, Time elapsed: 0.128 sec - in org.apache.commons.codec.language.Caverphone2Test
Running org.apache.commons.codec.language.DaitchMokotoffSoundexTest
Tests run: 13, Failures: 0, Errors: 0, Skipped: 0, Time elapsed: 0.047 sec - in org.apache.commons.codec.language.DaitchMokotoffSoundexTest
Running org.apache.commons.codec.language.bm.BeiderMorseEncoderTest
Tests run: 22, Failures: 0, Errors: 0, Skipped: 0, Time elapsed: 2.962 sec - in org.apache.commons.codec.language.bm.BeiderMorseEncoderTest
Running org.apache.commons.codec.language.bm.PhoneticEngineTest
Tests run: 8, Failures: 0, Errors: 0, Skipped: 0, Time elapsed: 0.018 sec - in org.apache.commons.codec.language.bm.PhoneticEngineTest
Running org.apache.commons.codec.language.bm.PhoneticEngineRegressionTest
Tests run: 4, Failures: 0, Errors: 0, Skipped: 0, Time elapsed: 0.016 sec - in org.apache.commons.codec.language.bm.PhoneticEngineRegressionTest
Running org.apache.commons.codec.language.bm.RuleTest
Tests run: 3, Failures: 0, Errors: 0, Skipped: 0, Time elapsed: 0.003 sec - in org.apache.commons.codec.language.bm.RuleTest
Running org.apache.commons.codec.language.bm.LanguageGuessingTest
Tests run: 18, Failures: 0, Errors: 0, Skipped: 0, Time elapsed: 0.009 sec - in org.apache.commons.codec.language.bm.LanguageGuessingTest
Running org.apache.commons.codec.language.DoubleMetaphoneTest
Tests run: 16, Failures: 0, Errors: 0, Skipped: 0, Time elapsed: 0.057 sec - in org.apache.commons.codec.language.DoubleMetaphoneTest
Running org.apache.commons.codec.language.SoundexTest
Tests run: 28, Failures: 0, Errors: 0, Skipped: 0, Time elapsed: 0.01 sec - in org.apache.commons.codec.language.SoundexTest
Running org.apache.commons.codec.language.RefinedSoundexTest
Tests run: 10, Failures: 0, Errors: 0, Skipped: 0, Time elapsed: 0.003 sec - in org.apache.commons.codec.language.RefinedSoundexTest
Running org.apache.commons.codec.language.MatchRatingApproachEncoderTest
Tests run: 96, Failures: 0, Errors: 0, Skipped: 0, Time elapsed: 0.038 sec - in org.apache.commons.codec.language.MatchRatingApproachEncoderTest
Running org.apache.commons.codec.language.ColognePhoneticTest
Tests run: 13, Failures: 0, Errors: 0, Skipped: 0, Time elapsed: 0.005 sec - in org.apache.commons.codec.language.ColognePhoneticTest
Running org.apache.commons.codec.language.DoubleMetaphone2Test
Tests run: 6, Failures: 0, Errors: 0, Skipped: 0, Time elapsed: 0.041 sec - in org.apache.commons.codec.language.DoubleMetaphone2Test
Running org.apache.commons.codec.language.MetaphoneTest
Tests run: 34, Failures: 0, Errors: 0, Skipped: 0, Time elapsed: 0.102 sec - in org.apache.commons.codec.language.MetaphoneTest
Running org.apache.commons.codec.CharEncodingTest
Tests run: 7, Failures: 0, Errors: 0, Skipped: 0, Time elapsed: 0.001 sec - in org.apache.commons.codec.CharEncodingTest

Results :

Failed tests: 
  NysiisTest.testRule4Dot1:209->assertEncodings:46 Problem with XEV expected:<X[AF]> but was:<X[]>
  NysiisTest.testRule4Dot2:225->assertEncodings:46 Problem with XQ expected:<X[G]> but was:<X[]>
  NysiisTest.testCap:68->encodeAll:57 Problem with Capp expected:<C[AP]> but was:<C[]>
  NysiisTest.testDad:75->encodeAll:57 Problem with Dent expected:<D[AD]> but was:<D[]>
  NysiisTest.testDan:80->encodeAll:57 Problem with Dean expected:<D[AN]> but was:<D[]>
  NysiisTest.testFal:149->encodeAll:57 Problem with Phil expected:<F[AL]> but was:<F[]>
  NysiisTest.testRule1:176->assertEncodings:46 Problem with MACX expected:<MC[X]> but was:<MC[]>
  NysiisTest.testRule2:192->assertEncodings:46 Problem with XEE expected:<X[Y]> but was:<X[]>
  NysiisTest.testRule5:238->assertEncodings:46 Problem with XS expected:<X[]> but was:<X[S]>
  NysiisTest.testRule6:250->assertEncodings:46 Problem with XAY expected:<X[Y]> but was:<X[]>
  NysiisTest.testRule7:262->assertEncodings:46 Problem with XAS expected:<X[]> but was:<X[AS]>
  NysiisTest.testBran:63->encodeAll:57 Problem with Brian expected:<BR[AN]> but was:<BR[]>
  NysiisTest.testSnad:270->encodeAll:57 Problem with Schmidt expected:<SN[AD]> but was:<SN[]>
  NysiisTest.testSnat:275->encodeAll:57 Problem with Smith expected:<SN[AT]> but was:<SN[]>
  NysiisTest.testDropBy:95->assertEncodings:46 Problem with MACINTOSH expected:<MCANT[]> but was:<MCANT[AS]>
  NysiisTest.testOthers:159->assertEncodings:46 Problem with O'Daniel expected:<ODAN[AL]> but was:<ODAN[]>
  NysiisTest.testTranan:291->encodeAll:57 Problem with Trueman expected:<TRAN[AN]> but was:<TRAN[]>
  NysiisTest.testSpecialBranches:280->encodeAll:57 Problem with Kobwick expected:<CABW[AC]> but was:<CABW[]>

Tests run: 662, Failures: 18, Errors: 0, Skipped: 1

[INFO] ------------------------------------------------------------------------
[INFO] BUILD FAILURE
[INFO] ------------------------------------------------------------------------
[INFO] Total time: 14.228s
[INFO] Finished at: Sun Aug 02 12:37:14 BST 2015
[INFO] Final Memory: 23M/343M
[INFO] ------------------------------------------------------------------------
[ERROR] Failed to execute goal org.apache.maven.plugins:maven-surefire-plugin:2.17:test (default-test) on project commons-codec: There are test failures.
[ERROR] 
[ERROR] Please refer to /home/perham/Study/LittleDarwin/Cases/commons-codec-1.10-src/target/surefire-reports for the individual test results.
[ERROR] -> [Help 1]
[ERROR] 
[ERROR] To see the full stack trace of the errors, re-run Maven with the -e switch.
[ERROR] Re-run Maven using the -X switch to enable full debug logging.
[ERROR] 
[ERROR] For more information about the errors and possible solutions, please read the following articles:
[ERROR] [Help 1] http://cwiki.apache.org/confluence/display/MAVEN/MojoFailureException
