[INFO] Scanning for projects...
[INFO]                                                                         
[INFO] ------------------------------------------------------------------------
[INFO] Building Apache Commons Codec 1.10
[INFO] ------------------------------------------------------------------------
[INFO] 
[INFO] --- maven-enforcer-plugin:1.3.1:enforce (enforce-maven-3) @ commons-codec ---
[INFO] 
[INFO] --- maven-antrun-plugin:1.7:run (javadoc.resources) @ commons-codec ---
[INFO] Executing tasks

main:
[INFO] Executed tasks
[INFO] 
[INFO] --- maven-remote-resources-plugin:1.5:process (default) @ commons-codec ---
[INFO] 
[INFO] --- buildnumber-maven-plugin:1.3:create (default) @ commons-codec ---
[INFO] Executing: /bin/sh -c cd /home/perham/Study/LittleDarwin/Cases/commons-codec-1.10-src && svn --non-interactive info
[INFO] Working directory: /home/perham/Study/LittleDarwin/Cases/commons-codec-1.10-src
[INFO] Storing buildNumber: ?????? at timestamp: 1438514139892
[INFO] Executing: /bin/sh -c cd /home/perham/Study/LittleDarwin/Cases/commons-codec-1.10-src && svn --non-interactive info
[INFO] Working directory: /home/perham/Study/LittleDarwin/Cases/commons-codec-1.10-src
[INFO] Storing buildScmBranch: UNKNOWN_BRANCH
[INFO] 
[INFO] --- maven-resources-plugin:2.7:resources (default-resources) @ commons-codec ---
[INFO] Using 'UTF-8' encoding to copy filtered resources.
[INFO] Copying 128 resources
[INFO] Copying 2 resources to META-INF
[INFO] 
[INFO] --- maven-compiler-plugin:3.2:compile (default-compile) @ commons-codec ---
[INFO] Changes detected - recompiling the module!
[INFO] Compiling 60 source files to /home/perham/Study/LittleDarwin/Cases/commons-codec-1.10-src/target/classes
[INFO] /home/perham/Study/LittleDarwin/Cases/commons-codec-1.10-src/src/main/java/org/apache/commons/codec/digest/Sha2Crypt.java: Some input files use or override a deprecated API.
[INFO] /home/perham/Study/LittleDarwin/Cases/commons-codec-1.10-src/src/main/java/org/apache/commons/codec/digest/Sha2Crypt.java: Recompile with -Xlint:deprecation for details.
[INFO] 
[INFO] --- maven-bundle-plugin:2.5.3:manifest (bundle-manifest) @ commons-codec ---
[INFO] 
[INFO] --- maven-resources-plugin:2.7:testResources (default-testResources) @ commons-codec ---
[INFO] Using 'UTF-8' encoding to copy filtered resources.
[INFO] skip non existing resourceDirectory /home/perham/Study/LittleDarwin/Cases/commons-codec-1.10-src/src/test/resources
[INFO] Copying 2 resources to META-INF
[INFO] 
[INFO] --- maven-compiler-plugin:3.2:testCompile (default-testCompile) @ commons-codec ---
[INFO] Nothing to compile - all classes are up to date
[INFO] 
[INFO] --- maven-surefire-plugin:2.17:test (default-test) @ commons-codec ---
[INFO] Surefire report directory: /home/perham/Study/LittleDarwin/Cases/commons-codec-1.10-src/target/surefire-reports

-------------------------------------------------------
 T E S T S
-------------------------------------------------------
Running org.apache.commons.codec.digest.B64Test
Tests run: 2, Failures: 0, Errors: 0, Skipped: 0, Time elapsed: 0.026 sec - in org.apache.commons.codec.digest.B64Test
Running org.apache.commons.codec.digest.DigestUtilsTest
Tests run: 17, Failures: 0, Errors: 0, Skipped: 0, Time elapsed: 0.682 sec - in org.apache.commons.codec.digest.DigestUtilsTest
Running org.apache.commons.codec.digest.Sha512CryptTest
Tests run: 8, Failures: 0, Errors: 0, Skipped: 0, Time elapsed: 0.479 sec - in org.apache.commons.codec.digest.Sha512CryptTest
Running org.apache.commons.codec.digest.Apr1CryptTest
Tests run: 8, Failures: 0, Errors: 0, Skipped: 0, Time elapsed: 0.073 sec - in org.apache.commons.codec.digest.Apr1CryptTest
Running org.apache.commons.codec.digest.HmacUtilsTest
Tests run: 24, Failures: 0, Errors: 0, Skipped: 0, Time elapsed: 0.051 sec - in org.apache.commons.codec.digest.HmacUtilsTest
Running org.apache.commons.codec.digest.Sha2CryptTest
Tests run: 1, Failures: 0, Errors: 0, Skipped: 0, Time elapsed: 0.001 sec - in org.apache.commons.codec.digest.Sha2CryptTest
Running org.apache.commons.codec.digest.CryptTest
Tests run: 4, Failures: 0, Errors: 0, Skipped: 0, Time elapsed: 0.081 sec - in org.apache.commons.codec.digest.CryptTest
Running org.apache.commons.codec.digest.Sha256CryptTest
Tests run: 7, Failures: 0, Errors: 0, Skipped: 0, Time elapsed: 0.119 sec - in org.apache.commons.codec.digest.Sha256CryptTest
Running org.apache.commons.codec.digest.Md5CryptTest
Tests run: 7, Failures: 0, Errors: 0, Skipped: 0, Time elapsed: 0.023 sec - in org.apache.commons.codec.digest.Md5CryptTest
Running org.apache.commons.codec.digest.UnixCryptTest
Tests run: 9, Failures: 0, Errors: 0, Skipped: 0, Time elapsed: 0.006 sec - in org.apache.commons.codec.digest.UnixCryptTest
Running org.apache.commons.codec.CharsetsTest
Tests run: 7, Failures: 0, Errors: 0, Skipped: 0, Time elapsed: 0.004 sec - in org.apache.commons.codec.CharsetsTest
Running org.apache.commons.codec.binary.Base32Test
Tests run: 8, Failures: 0, Errors: 0, Skipped: 0, Time elapsed: 0.006 sec - in org.apache.commons.codec.binary.Base32Test
Running org.apache.commons.codec.binary.Base64OutputStreamTest
Tests run: 7, Failures: 0, Errors: 0, Skipped: 0, Time elapsed: 0.198 sec - in org.apache.commons.codec.binary.Base64OutputStreamTest
Running org.apache.commons.codec.binary.Base64Codec13Test
Tests run: 8, Failures: 0, Errors: 0, Skipped: 0, Time elapsed: 0.01 sec - in org.apache.commons.codec.binary.Base64Codec13Test
Running org.apache.commons.codec.binary.Base64InputStreamTest
Tests run: 19, Failures: 0, Errors: 0, Skipped: 0, Time elapsed: 0.106 sec - in org.apache.commons.codec.binary.Base64InputStreamTest
Running org.apache.commons.codec.binary.Base32InputStreamTest
Tests run: 16, Failures: 0, Errors: 0, Skipped: 0, Time elapsed: 0.132 sec - in org.apache.commons.codec.binary.Base32InputStreamTest
Running org.apache.commons.codec.binary.Base32OutputStreamTest
Tests run: 6, Failures: 0, Errors: 0, Skipped: 0, Time elapsed: 0.095 sec - in org.apache.commons.codec.binary.Base32OutputStreamTest
Running org.apache.commons.codec.binary.BinaryCodecTest
Tests run: 13, Failures: 0, Errors: 0, Skipped: 0, Time elapsed: 0.013 sec - in org.apache.commons.codec.binary.BinaryCodecTest
Running org.apache.commons.codec.binary.BaseNCodecTest
Tests run: 7, Failures: 0, Errors: 0, Skipped: 0, Time elapsed: 0.003 sec - in org.apache.commons.codec.binary.BaseNCodecTest
Running org.apache.commons.codec.binary.StringUtilsTest
Tests run: 17, Failures: 0, Errors: 0, Skipped: 0, Time elapsed: 0.029 sec - in org.apache.commons.codec.binary.StringUtilsTest
Running org.apache.commons.codec.binary.Base64Test
Tests run: 53, Failures: 0, Errors: 0, Skipped: 1, Time elapsed: 0.046 sec - in org.apache.commons.codec.binary.Base64Test
Running org.apache.commons.codec.binary.HexTest
Tests run: 19, Failures: 0, Errors: 0, Skipped: 0, Time elapsed: 0.183 sec - in org.apache.commons.codec.binary.HexTest
Running org.apache.commons.codec.DecoderExceptionTest
Tests run: 4, Failures: 0, Errors: 0, Skipped: 0, Time elapsed: 0.001 sec - in org.apache.commons.codec.DecoderExceptionTest
Running org.apache.commons.codec.EncoderExceptionTest
Tests run: 4, Failures: 0, Errors: 0, Skipped: 0, Time elapsed: 0.001 sec - in org.apache.commons.codec.EncoderExceptionTest
Running org.apache.commons.codec.net.BCodecTest
Tests run: 9, Failures: 0, Errors: 0, Skipped: 0, Time elapsed: 0.004 sec - in org.apache.commons.codec.net.BCodecTest
Running org.apache.commons.codec.net.QCodecTest
Tests run: 12, Failures: 0, Errors: 0, Skipped: 0, Time elapsed: 0.006 sec - in org.apache.commons.codec.net.QCodecTest
Running org.apache.commons.codec.net.UtilsTest
Tests run: 1, Failures: 0, Errors: 0, Skipped: 0, Time elapsed: 0 sec - in org.apache.commons.codec.net.UtilsTest
Running org.apache.commons.codec.net.RFC1522CodecTest
Tests run: 2, Failures: 0, Errors: 0, Skipped: 0, Time elapsed: 0 sec - in org.apache.commons.codec.net.RFC1522CodecTest
Running org.apache.commons.codec.net.URLCodecTest
Tests run: 16, Failures: 0, Errors: 0, Skipped: 0, Time elapsed: 0.006 sec - in org.apache.commons.codec.net.URLCodecTest
Running org.apache.commons.codec.net.QuotedPrintableCodecTest
Tests run: 21, Failures: 0, Errors: 0, Skipped: 0, Time elapsed: 0.01 sec - in org.apache.commons.codec.net.QuotedPrintableCodecTest
Running org.apache.commons.codec.StringEncoderComparatorTest
Tests run: 3, Failures: 0, Errors: 0, Skipped: 0, Time elapsed: 0.004 sec - in org.apache.commons.codec.StringEncoderComparatorTest
Running org.apache.commons.codec.language.Caverphone1Test
Tests run: 9, Failures: 0, Errors: 0, Skipped: 0, Time elapsed: 0.029 sec - in org.apache.commons.codec.language.Caverphone1Test
Running org.apache.commons.codec.language.NysiisTest
Tests run: 23, Failures: 0, Errors: 0, Skipped: 0, Time elapsed: 0.018 sec - in org.apache.commons.codec.language.NysiisTest
Running org.apache.commons.codec.language.Caverphone2Test
Tests run: 13, Failures: 0, Errors: 0, Skipped: 0, Time elapsed: 0.133 sec - in org.apache.commons.codec.language.Caverphone2Test
Running org.apache.commons.codec.language.DaitchMokotoffSoundexTest
Tests run: 13, Failures: 0, Errors: 0, Skipped: 0, Time elapsed: 0.052 sec - in org.apache.commons.codec.language.DaitchMokotoffSoundexTest
Running org.apache.commons.codec.language.bm.BeiderMorseEncoderTest
Tests run: 22, Failures: 0, Errors: 0, Skipped: 0, Time elapsed: 3.077 sec - in org.apache.commons.codec.language.bm.BeiderMorseEncoderTest
Running org.apache.commons.codec.language.bm.PhoneticEngineTest
Tests run: 8, Failures: 0, Errors: 0, Skipped: 0, Time elapsed: 0.017 sec - in org.apache.commons.codec.language.bm.PhoneticEngineTest
Running org.apache.commons.codec.language.bm.PhoneticEngineRegressionTest
Tests run: 4, Failures: 0, Errors: 0, Skipped: 0, Time elapsed: 0.013 sec - in org.apache.commons.codec.language.bm.PhoneticEngineRegressionTest
Running org.apache.commons.codec.language.bm.RuleTest
Tests run: 3, Failures: 0, Errors: 0, Skipped: 0, Time elapsed: 0.002 sec - in org.apache.commons.codec.language.bm.RuleTest
Running org.apache.commons.codec.language.bm.LanguageGuessingTest
Tests run: 18, Failures: 0, Errors: 0, Skipped: 0, Time elapsed: 0.015 sec - in org.apache.commons.codec.language.bm.LanguageGuessingTest
Running org.apache.commons.codec.language.DoubleMetaphoneTest
Tests run: 16, Failures: 0, Errors: 0, Skipped: 0, Time elapsed: 0.055 sec - in org.apache.commons.codec.language.DoubleMetaphoneTest
Running org.apache.commons.codec.language.SoundexTest
Tests run: 28, Failures: 0, Errors: 0, Skipped: 0, Time elapsed: 0.014 sec - in org.apache.commons.codec.language.SoundexTest
Running org.apache.commons.codec.language.RefinedSoundexTest
Tests run: 10, Failures: 0, Errors: 0, Skipped: 0, Time elapsed: 0.004 sec - in org.apache.commons.codec.language.RefinedSoundexTest
Running org.apache.commons.codec.language.MatchRatingApproachEncoderTest
Tests run: 96, Failures: 0, Errors: 0, Skipped: 0, Time elapsed: 0.034 sec - in org.apache.commons.codec.language.MatchRatingApproachEncoderTest
Running org.apache.commons.codec.language.ColognePhoneticTest
Tests run: 13, Failures: 0, Errors: 0, Skipped: 0, Time elapsed: 0.002 sec - in org.apache.commons.codec.language.ColognePhoneticTest
Running org.apache.commons.codec.language.DoubleMetaphone2Test
Tests run: 6, Failures: 0, Errors: 0, Skipped: 0, Time elapsed: 0.031 sec - in org.apache.commons.codec.language.DoubleMetaphone2Test
Running org.apache.commons.codec.language.MetaphoneTest
Tests run: 34, Failures: 0, Errors: 30, Skipped: 0, Time elapsed: 0.026 sec <<< FAILURE! - in org.apache.commons.codec.language.MetaphoneTest
testTranslateOfSCHAndCH(org.apache.commons.codec.language.MetaphoneTest)  Time elapsed: 0.011 sec  <<< ERROR!
java.lang.StringIndexOutOfBoundsException: String index out of range: -1
	at java.lang.AbstractStringBuilder.charAt(AbstractStringBuilder.java:203)
	at java.lang.StringBuilder.charAt(StringBuilder.java:72)
	at org.apache.commons.codec.language.Metaphone.isPreviousChar(Metaphone.java:109)
	at org.apache.commons.codec.language.Metaphone.metaphone(Metaphone.java:42)
	at org.apache.commons.codec.language.MetaphoneTest.testTranslateOfSCHAndCH(MetaphoneTest.java:406)

testTranslateToJOfDGEOrDGIOrDGY(org.apache.commons.codec.language.MetaphoneTest)  Time elapsed: 0 sec  <<< ERROR!
java.lang.StringIndexOutOfBoundsException: String index out of range: -1
	at java.lang.AbstractStringBuilder.charAt(AbstractStringBuilder.java:203)
	at java.lang.StringBuilder.charAt(StringBuilder.java:72)
	at org.apache.commons.codec.language.Metaphone.isPreviousChar(Metaphone.java:109)
	at org.apache.commons.codec.language.Metaphone.metaphone(Metaphone.java:42)
	at org.apache.commons.codec.language.MetaphoneTest.testTranslateToJOfDGEOrDGIOrDGY(MetaphoneTest.java:415)

testTCH(org.apache.commons.codec.language.MetaphoneTest)  Time elapsed: 0 sec  <<< ERROR!
java.lang.StringIndexOutOfBoundsException: String index out of range: -1
	at java.lang.AbstractStringBuilder.charAt(AbstractStringBuilder.java:203)
	at java.lang.StringBuilder.charAt(StringBuilder.java:72)
	at org.apache.commons.codec.language.Metaphone.isPreviousChar(Metaphone.java:109)
	at org.apache.commons.codec.language.Metaphone.metaphone(Metaphone.java:42)
	at org.apache.commons.codec.language.MetaphoneTest.testTCH(MetaphoneTest.java:455)

testWhy(org.apache.commons.codec.language.MetaphoneTest)  Time elapsed: 0 sec  <<< ERROR!
java.lang.StringIndexOutOfBoundsException: String index out of range: -1
	at java.lang.AbstractStringBuilder.charAt(AbstractStringBuilder.java:203)
	at java.lang.StringBuilder.charAt(StringBuilder.java:72)
	at org.apache.commons.codec.language.Metaphone.isPreviousChar(Metaphone.java:109)
	at org.apache.commons.codec.language.Metaphone.metaphone(Metaphone.java:42)
	at org.apache.commons.codec.language.MetaphoneTest.testWhy(MetaphoneTest.java:396)

testIsMetaphoneEqual1(org.apache.commons.codec.language.MetaphoneTest)  Time elapsed: 0 sec  <<< ERROR!
java.lang.StringIndexOutOfBoundsException: String index out of range: -1
	at java.lang.AbstractStringBuilder.charAt(AbstractStringBuilder.java:203)
	at java.lang.StringBuilder.charAt(StringBuilder.java:72)
	at org.apache.commons.codec.language.Metaphone.isPreviousChar(Metaphone.java:109)
	at org.apache.commons.codec.language.Metaphone.metaphone(Metaphone.java:48)
	at org.apache.commons.codec.language.Metaphone.isMetaphoneEqual(Metaphone.java:122)
	at org.apache.commons.codec.language.MetaphoneTest.assertMetaphoneEqual(MetaphoneTest.java:52)
	at org.apache.commons.codec.language.MetaphoneTest.testIsMetaphoneEqual1(MetaphoneTest.java:64)

testIsMetaphoneEqual2(org.apache.commons.codec.language.MetaphoneTest)  Time elapsed: 0 sec  <<< ERROR!
java.lang.StringIndexOutOfBoundsException: String index out of range: -1
	at java.lang.AbstractStringBuilder.charAt(AbstractStringBuilder.java:203)
	at java.lang.StringBuilder.charAt(StringBuilder.java:72)
	at org.apache.commons.codec.language.Metaphone.isPreviousChar(Metaphone.java:109)
	at org.apache.commons.codec.language.Metaphone.metaphone(Metaphone.java:42)
	at org.apache.commons.codec.language.Metaphone.isMetaphoneEqual(Metaphone.java:122)
	at org.apache.commons.codec.language.MetaphoneTest.assertMetaphoneEqual(MetaphoneTest.java:52)
	at org.apache.commons.codec.language.MetaphoneTest.testIsMetaphoneEqual2(MetaphoneTest.java:76)

testPHTOF(org.apache.commons.codec.language.MetaphoneTest)  Time elapsed: 0 sec  <<< ERROR!
java.lang.StringIndexOutOfBoundsException: String index out of range: -1
	at java.lang.AbstractStringBuilder.charAt(AbstractStringBuilder.java:203)
	at java.lang.StringBuilder.charAt(StringBuilder.java:72)
	at org.apache.commons.codec.language.Metaphone.isPreviousChar(Metaphone.java:109)
	at org.apache.commons.codec.language.Metaphone.metaphone(Metaphone.java:42)
	at org.apache.commons.codec.language.MetaphoneTest.testPHTOF(MetaphoneTest.java:437)

testDiscardOfSilentGN(org.apache.commons.codec.language.MetaphoneTest)  Time elapsed: 0.001 sec  <<< ERROR!
java.lang.StringIndexOutOfBoundsException: String index out of range: -1
	at java.lang.AbstractStringBuilder.charAt(AbstractStringBuilder.java:203)
	at java.lang.StringBuilder.charAt(StringBuilder.java:72)
	at org.apache.commons.codec.language.Metaphone.isPreviousChar(Metaphone.java:109)
	at org.apache.commons.codec.language.Metaphone.metaphone(Metaphone.java:42)
	at org.apache.commons.codec.language.MetaphoneTest.testDiscardOfSilentGN(MetaphoneTest.java:429)

testIsMetaphoneEqualParis(org.apache.commons.codec.language.MetaphoneTest)  Time elapsed: 0 sec  <<< ERROR!
java.lang.StringIndexOutOfBoundsException: String index out of range: -1
	at java.lang.AbstractStringBuilder.charAt(AbstractStringBuilder.java:203)
	at java.lang.StringBuilder.charAt(StringBuilder.java:72)
	at org.apache.commons.codec.language.Metaphone.isPreviousChar(Metaphone.java:109)
	at org.apache.commons.codec.language.Metaphone.metaphone(Metaphone.java:42)
	at org.apache.commons.codec.language.Metaphone.isMetaphoneEqual(Metaphone.java:122)
	at org.apache.commons.codec.language.MetaphoneTest.assertIsMetaphoneEqual(MetaphoneTest.java:35)
	at org.apache.commons.codec.language.MetaphoneTest.testIsMetaphoneEqualParis(MetaphoneTest.java:298)

testIsMetaphoneEqualPeter(org.apache.commons.codec.language.MetaphoneTest)  Time elapsed: 0 sec  <<< ERROR!
java.lang.StringIndexOutOfBoundsException: String index out of range: -1
	at java.lang.AbstractStringBuilder.charAt(AbstractStringBuilder.java:203)
	at java.lang.StringBuilder.charAt(StringBuilder.java:72)
	at org.apache.commons.codec.language.Metaphone.isPreviousChar(Metaphone.java:109)
	at org.apache.commons.codec.language.Metaphone.metaphone(Metaphone.java:42)
	at org.apache.commons.codec.language.Metaphone.isMetaphoneEqual(Metaphone.java:122)
	at org.apache.commons.codec.language.MetaphoneTest.assertIsMetaphoneEqual(MetaphoneTest.java:35)
	at org.apache.commons.codec.language.MetaphoneTest.testIsMetaphoneEqualPeter(MetaphoneTest.java:306)

testIsMetaphoneEqualSusan(org.apache.commons.codec.language.MetaphoneTest)  Time elapsed: 0 sec  <<< ERROR!
java.lang.StringIndexOutOfBoundsException: String index out of range: -1
	at java.lang.AbstractStringBuilder.charAt(AbstractStringBuilder.java:203)
	at java.lang.StringBuilder.charAt(StringBuilder.java:72)
	at org.apache.commons.codec.language.Metaphone.isPreviousChar(Metaphone.java:109)
	at org.apache.commons.codec.language.Metaphone.metaphone(Metaphone.java:42)
	at org.apache.commons.codec.language.Metaphone.isMetaphoneEqual(Metaphone.java:122)
	at org.apache.commons.codec.language.MetaphoneTest.assertIsMetaphoneEqual(MetaphoneTest.java:35)
	at org.apache.commons.codec.language.MetaphoneTest.testIsMetaphoneEqualSusan(MetaphoneTest.java:324)

testIsMetaphoneEqualWhite(org.apache.commons.codec.language.MetaphoneTest)  Time elapsed: 0 sec  <<< ERROR!
java.lang.StringIndexOutOfBoundsException: String index out of range: -1
	at java.lang.AbstractStringBuilder.charAt(AbstractStringBuilder.java:203)
	at java.lang.StringBuilder.charAt(StringBuilder.java:72)
	at org.apache.commons.codec.language.Metaphone.isPreviousChar(Metaphone.java:109)
	at org.apache.commons.codec.language.Metaphone.metaphone(Metaphone.java:42)
	at org.apache.commons.codec.language.Metaphone.isMetaphoneEqual(Metaphone.java:122)
	at org.apache.commons.codec.language.MetaphoneTest.assertIsMetaphoneEqual(MetaphoneTest.java:35)
	at org.apache.commons.codec.language.MetaphoneTest.testIsMetaphoneEqualWhite(MetaphoneTest.java:97)

testIsMetaphoneEqualXalan(org.apache.commons.codec.language.MetaphoneTest)  Time elapsed: 0.001 sec  <<< ERROR!
java.lang.StringIndexOutOfBoundsException: String index out of range: -1
	at java.lang.AbstractStringBuilder.charAt(AbstractStringBuilder.java:203)
	at java.lang.StringBuilder.charAt(StringBuilder.java:72)
	at org.apache.commons.codec.language.Metaphone.isPreviousChar(Metaphone.java:109)
	at org.apache.commons.codec.language.Metaphone.metaphone(Metaphone.java:42)
	at org.apache.commons.codec.language.Metaphone.isMetaphoneEqual(Metaphone.java:122)
	at org.apache.commons.codec.language.MetaphoneTest.assertIsMetaphoneEqual(MetaphoneTest.java:35)
	at org.apache.commons.codec.language.MetaphoneTest.testIsMetaphoneEqualXalan(MetaphoneTest.java:356)

testIsMetaphoneEqualAlbert(org.apache.commons.codec.language.MetaphoneTest)  Time elapsed: 0 sec  <<< ERROR!
java.lang.StringIndexOutOfBoundsException: String index out of range: -1
	at java.lang.AbstractStringBuilder.charAt(AbstractStringBuilder.java:203)
	at java.lang.StringBuilder.charAt(StringBuilder.java:72)
	at org.apache.commons.codec.language.Metaphone.isPreviousChar(Metaphone.java:109)
	at org.apache.commons.codec.language.Metaphone.metaphone(Metaphone.java:42)
	at org.apache.commons.codec.language.Metaphone.isMetaphoneEqual(Metaphone.java:122)
	at org.apache.commons.codec.language.MetaphoneTest.assertIsMetaphoneEqual(MetaphoneTest.java:35)
	at org.apache.commons.codec.language.MetaphoneTest.testIsMetaphoneEqualAlbert(MetaphoneTest.java:109)

testIsMetaphoneEqualKnight(org.apache.commons.codec.language.MetaphoneTest)  Time elapsed: 0 sec  <<< ERROR!
java.lang.StringIndexOutOfBoundsException: String index out of range: -1
	at java.lang.AbstractStringBuilder.charAt(AbstractStringBuilder.java:203)
	at java.lang.StringBuilder.charAt(StringBuilder.java:72)
	at org.apache.commons.codec.language.Metaphone.isPreviousChar(Metaphone.java:109)
	at org.apache.commons.codec.language.Metaphone.metaphone(Metaphone.java:42)
	at org.apache.commons.codec.language.Metaphone.isMetaphoneEqual(Metaphone.java:122)
	at org.apache.commons.codec.language.MetaphoneTest.assertIsMetaphoneEqual(MetaphoneTest.java:35)
	at org.apache.commons.codec.language.MetaphoneTest.testIsMetaphoneEqualKnight(MetaphoneTest.java:242)

testMetaphone(org.apache.commons.codec.language.MetaphoneTest)  Time elapsed: 0.005 sec  <<< ERROR!
java.lang.StringIndexOutOfBoundsException: String index out of range: -1
	at java.lang.AbstractStringBuilder.charAt(AbstractStringBuilder.java:203)
	at java.lang.StringBuilder.charAt(StringBuilder.java:72)
	at org.apache.commons.codec.language.Metaphone.isPreviousChar(Metaphone.java:109)
	at org.apache.commons.codec.language.Metaphone.metaphone(Metaphone.java:42)
	at org.apache.commons.codec.language.MetaphoneTest.testMetaphone(MetaphoneTest.java:363)

testIsMetaphoneEqualWright(org.apache.commons.codec.language.MetaphoneTest)  Time elapsed: 0 sec  <<< ERROR!
java.lang.StringIndexOutOfBoundsException: String index out of range: -1
	at java.lang.AbstractStringBuilder.charAt(AbstractStringBuilder.java:203)
	at java.lang.StringBuilder.charAt(StringBuilder.java:72)
	at org.apache.commons.codec.language.Metaphone.isPreviousChar(Metaphone.java:109)
	at org.apache.commons.codec.language.Metaphone.metaphone(Metaphone.java:42)
	at org.apache.commons.codec.language.Metaphone.isMetaphoneEqual(Metaphone.java:122)
	at org.apache.commons.codec.language.MetaphoneTest.assertIsMetaphoneEqual(MetaphoneTest.java:35)
	at org.apache.commons.codec.language.MetaphoneTest.testIsMetaphoneEqualWright(MetaphoneTest.java:348)

testSHAndSIOAndSIAToX(org.apache.commons.codec.language.MetaphoneTest)  Time elapsed: 0 sec  <<< ERROR!
java.lang.StringIndexOutOfBoundsException: String index out of range: -1
	at java.lang.AbstractStringBuilder.charAt(AbstractStringBuilder.java:203)
	at java.lang.StringBuilder.charAt(StringBuilder.java:72)
	at org.apache.commons.codec.language.Metaphone.isPreviousChar(Metaphone.java:109)
	at org.apache.commons.codec.language.Metaphone.metaphone(Metaphone.java:42)
	at org.apache.commons.codec.language.MetaphoneTest.testSHAndSIOAndSIAToX(MetaphoneTest.java:442)

testSetMaxLengthWithTruncation(org.apache.commons.codec.language.MetaphoneTest)  Time elapsed: 0 sec  <<< ERROR!
java.lang.StringIndexOutOfBoundsException: String index out of range: -1
	at java.lang.AbstractStringBuilder.charAt(AbstractStringBuilder.java:203)
	at java.lang.StringBuilder.charAt(StringBuilder.java:72)
	at org.apache.commons.codec.language.Metaphone.isPreviousChar(Metaphone.java:109)
	at org.apache.commons.codec.language.Metaphone.metaphone(Metaphone.java:42)
	at org.apache.commons.codec.language.MetaphoneTest.testSetMaxLengthWithTruncation(MetaphoneTest.java:469)

testTIOAndTIAToX(org.apache.commons.codec.language.MetaphoneTest)  Time elapsed: 0 sec  <<< ERROR!
java.lang.StringIndexOutOfBoundsException: String index out of range: -1
	at java.lang.AbstractStringBuilder.charAt(AbstractStringBuilder.java:203)
	at java.lang.StringBuilder.charAt(StringBuilder.java:72)
	at org.apache.commons.codec.language.Metaphone.isPreviousChar(Metaphone.java:109)
	at org.apache.commons.codec.language.Metaphone.metaphone(Metaphone.java:42)
	at org.apache.commons.codec.language.MetaphoneTest.testTIOAndTIAToX(MetaphoneTest.java:449)

testExceedLength(org.apache.commons.codec.language.MetaphoneTest)  Time elapsed: 0.001 sec  <<< ERROR!
java.lang.StringIndexOutOfBoundsException: String index out of range: -1
	at java.lang.AbstractStringBuilder.charAt(AbstractStringBuilder.java:203)
	at java.lang.StringBuilder.charAt(StringBuilder.java:72)
	at org.apache.commons.codec.language.Metaphone.isPreviousChar(Metaphone.java:109)
	at org.apache.commons.codec.language.Metaphone.metaphone(Metaphone.java:42)
	at org.apache.commons.codec.language.MetaphoneTest.testExceedLength(MetaphoneTest.java:462)

testWordEndingInMB(org.apache.commons.codec.language.MetaphoneTest)  Time elapsed: 0 sec  <<< ERROR!
java.lang.StringIndexOutOfBoundsException: String index out of range: -1
	at java.lang.AbstractStringBuilder.charAt(AbstractStringBuilder.java:203)
	at java.lang.StringBuilder.charAt(StringBuilder.java:72)
	at org.apache.commons.codec.language.Metaphone.isPreviousChar(Metaphone.java:109)
	at org.apache.commons.codec.language.Metaphone.metaphone(Metaphone.java:48)
	at org.apache.commons.codec.language.MetaphoneTest.testWordEndingInMB(MetaphoneTest.java:378)

testIsMetaphoneEqualAero(org.apache.commons.codec.language.MetaphoneTest)  Time elapsed: 0 sec  <<< ERROR!
java.lang.StringIndexOutOfBoundsException: String index out of range: -1
	at java.lang.AbstractStringBuilder.charAt(AbstractStringBuilder.java:203)
	at java.lang.StringBuilder.charAt(StringBuilder.java:72)
	at org.apache.commons.codec.language.Metaphone.isPreviousChar(Metaphone.java:109)
	at org.apache.commons.codec.language.Metaphone.metaphone(Metaphone.java:42)
	at org.apache.commons.codec.language.Metaphone.isMetaphoneEqual(Metaphone.java:122)
	at org.apache.commons.codec.language.MetaphoneTest.assertIsMetaphoneEqual(MetaphoneTest.java:35)
	at org.apache.commons.codec.language.MetaphoneTest.testIsMetaphoneEqualAero(MetaphoneTest.java:87)

testIsMetaphoneEqualGary(org.apache.commons.codec.language.MetaphoneTest)  Time elapsed: 0 sec  <<< ERROR!
java.lang.StringIndexOutOfBoundsException: String index out of range: -1
	at java.lang.AbstractStringBuilder.charAt(AbstractStringBuilder.java:203)
	at java.lang.StringBuilder.charAt(StringBuilder.java:72)
	at org.apache.commons.codec.language.Metaphone.isPreviousChar(Metaphone.java:109)
	at org.apache.commons.codec.language.Metaphone.metaphone(Metaphone.java:42)
	at org.apache.commons.codec.language.Metaphone.isMetaphoneEqual(Metaphone.java:122)
	at org.apache.commons.codec.language.MetaphoneTest.assertIsMetaphoneEqual(MetaphoneTest.java:35)
	at org.apache.commons.codec.language.MetaphoneTest.testIsMetaphoneEqualGary(MetaphoneTest.java:117)

testIsMetaphoneEqualJohn(org.apache.commons.codec.language.MetaphoneTest)  Time elapsed: 0 sec  <<< ERROR!
java.lang.StringIndexOutOfBoundsException: String index out of range: -1
	at java.lang.AbstractStringBuilder.charAt(AbstractStringBuilder.java:203)
	at java.lang.StringBuilder.charAt(StringBuilder.java:72)
	at org.apache.commons.codec.language.Metaphone.isPreviousChar(Metaphone.java:109)
	at org.apache.commons.codec.language.Metaphone.metaphone(Metaphone.java:42)
	at org.apache.commons.codec.language.Metaphone.isMetaphoneEqual(Metaphone.java:122)
	at org.apache.commons.codec.language.MetaphoneTest.assertIsMetaphoneEqual(MetaphoneTest.java:35)
	at org.apache.commons.codec.language.MetaphoneTest.testIsMetaphoneEqualJohn(MetaphoneTest.java:171)

testIsMetaphoneEqualMary(org.apache.commons.codec.language.MetaphoneTest)  Time elapsed: 0 sec  <<< ERROR!
java.lang.StringIndexOutOfBoundsException: String index out of range: -1
	at java.lang.AbstractStringBuilder.charAt(AbstractStringBuilder.java:203)
	at java.lang.StringBuilder.charAt(StringBuilder.java:72)
	at org.apache.commons.codec.language.Metaphone.isPreviousChar(Metaphone.java:109)
	at org.apache.commons.codec.language.Metaphone.metaphone(Metaphone.java:42)
	at org.apache.commons.codec.language.Metaphone.isMetaphoneEqual(Metaphone.java:122)
	at org.apache.commons.codec.language.MetaphoneTest.assertIsMetaphoneEqual(MetaphoneTest.java:35)
	at org.apache.commons.codec.language.MetaphoneTest.testIsMetaphoneEqualMary(MetaphoneTest.java:267)

testDiscardOfSilentHAfterG(org.apache.commons.codec.language.MetaphoneTest)  Time elapsed: 0 sec  <<< ERROR!
java.lang.StringIndexOutOfBoundsException: String index out of range: -1
	at java.lang.AbstractStringBuilder.charAt(AbstractStringBuilder.java:203)
	at java.lang.StringBuilder.charAt(StringBuilder.java:72)
	at org.apache.commons.codec.language.Metaphone.isPreviousChar(Metaphone.java:109)
	at org.apache.commons.codec.language.Metaphone.metaphone(Metaphone.java:42)
	at org.apache.commons.codec.language.MetaphoneTest.testDiscardOfSilentHAfterG(MetaphoneTest.java:422)

testWordsWithCIA(org.apache.commons.codec.language.MetaphoneTest)  Time elapsed: 0 sec  <<< ERROR!
java.lang.StringIndexOutOfBoundsException: String index out of range: -1
	at java.lang.AbstractStringBuilder.charAt(AbstractStringBuilder.java:203)
	at java.lang.StringBuilder.charAt(StringBuilder.java:72)
	at org.apache.commons.codec.language.Metaphone.isPreviousChar(Metaphone.java:109)
	at org.apache.commons.codec.language.Metaphone.metaphone(Metaphone.java:48)
	at org.apache.commons.codec.language.MetaphoneTest.testWordsWithCIA(MetaphoneTest.java:401)

testDiscardOfSCEOrSCIOrSCY(org.apache.commons.codec.language.MetaphoneTest)  Time elapsed: 0 sec  <<< ERROR!
java.lang.StringIndexOutOfBoundsException: String index out of range: -1
	at java.lang.AbstractStringBuilder.charAt(AbstractStringBuilder.java:203)
	at java.lang.StringBuilder.charAt(StringBuilder.java:72)
	at org.apache.commons.codec.language.Metaphone.isPreviousChar(Metaphone.java:109)
	at org.apache.commons.codec.language.Metaphone.metaphone(Metaphone.java:42)
	at org.apache.commons.codec.language.MetaphoneTest.testDiscardOfSCEOrSCIOrSCY(MetaphoneTest.java:385)

testIsMetaphoneEqualRay(org.apache.commons.codec.language.MetaphoneTest)  Time elapsed: 0 sec  <<< ERROR!
java.lang.StringIndexOutOfBoundsException: String index out of range: -1
	at java.lang.AbstractStringBuilder.charAt(AbstractStringBuilder.java:203)
	at java.lang.StringBuilder.charAt(StringBuilder.java:72)
	at org.apache.commons.codec.language.Metaphone.isPreviousChar(Metaphone.java:109)
	at org.apache.commons.codec.language.Metaphone.metaphone(Metaphone.java:42)
	at org.apache.commons.codec.language.Metaphone.isMetaphoneEqual(Metaphone.java:122)
	at org.apache.commons.codec.language.MetaphoneTest.assertIsMetaphoneEqual(MetaphoneTest.java:35)
	at org.apache.commons.codec.language.MetaphoneTest.testIsMetaphoneEqualRay(MetaphoneTest.java:316)

Running org.apache.commons.codec.CharEncodingTest
Tests run: 7, Failures: 0, Errors: 0, Skipped: 0, Time elapsed: 0 sec - in org.apache.commons.codec.CharEncodingTest

Results :

Tests in error: 
  MetaphoneTest.testTranslateOfSCHAndCH:406 » StringIndexOutOfBounds String inde...
  MetaphoneTest.testTranslateToJOfDGEOrDGIOrDGY:415 » StringIndexOutOfBounds Str...
  MetaphoneTest.testTCH:455 » StringIndexOutOfBounds String index out of range: ...
  MetaphoneTest.testWhy:396 » StringIndexOutOfBounds String index out of range: ...
  MetaphoneTest.testIsMetaphoneEqual1:64->assertMetaphoneEqual:52 » StringIndexOutOfBounds
  MetaphoneTest.testIsMetaphoneEqual2:76->assertMetaphoneEqual:52 » StringIndexOutOfBounds
  MetaphoneTest.testPHTOF:437 » StringIndexOutOfBounds String index out of range...
  MetaphoneTest.testDiscardOfSilentGN:429 » StringIndexOutOfBounds String index ...
  MetaphoneTest.testIsMetaphoneEqualParis:298->assertIsMetaphoneEqual:35 » StringIndexOutOfBounds
  MetaphoneTest.testIsMetaphoneEqualPeter:306->assertIsMetaphoneEqual:35 » StringIndexOutOfBounds
  MetaphoneTest.testIsMetaphoneEqualSusan:324->assertIsMetaphoneEqual:35 » StringIndexOutOfBounds
  MetaphoneTest.testIsMetaphoneEqualWhite:97->assertIsMetaphoneEqual:35 » StringIndexOutOfBounds
  MetaphoneTest.testIsMetaphoneEqualXalan:356->assertIsMetaphoneEqual:35 » StringIndexOutOfBounds
  MetaphoneTest.testIsMetaphoneEqualAlbert:109->assertIsMetaphoneEqual:35 » StringIndexOutOfBounds
  MetaphoneTest.testIsMetaphoneEqualKnight:242->assertIsMetaphoneEqual:35 » StringIndexOutOfBounds
  MetaphoneTest.testMetaphone:363 » StringIndexOutOfBounds String index out of r...
  MetaphoneTest.testIsMetaphoneEqualWright:348->assertIsMetaphoneEqual:35 » StringIndexOutOfBounds
  MetaphoneTest.testSHAndSIOAndSIAToX:442 » StringIndexOutOfBounds String index ...
  MetaphoneTest.testSetMaxLengthWithTruncation:469 » StringIndexOutOfBounds Stri...
  MetaphoneTest.testTIOAndTIAToX:449 » StringIndexOutOfBounds String index out o...
  MetaphoneTest.testExceedLength:462 » StringIndexOutOfBounds String index out o...
  MetaphoneTest.testWordEndingInMB:378 » StringIndexOutOfBounds String index out...
  MetaphoneTest.testIsMetaphoneEqualAero:87->assertIsMetaphoneEqual:35 » StringIndexOutOfBounds
  MetaphoneTest.testIsMetaphoneEqualGary:117->assertIsMetaphoneEqual:35 » StringIndexOutOfBounds
  MetaphoneTest.testIsMetaphoneEqualJohn:171->assertIsMetaphoneEqual:35 » StringIndexOutOfBounds
  MetaphoneTest.testIsMetaphoneEqualMary:267->assertIsMetaphoneEqual:35 » StringIndexOutOfBounds
  MetaphoneTest.testDiscardOfSilentHAfterG:422 » StringIndexOutOfBounds String i...
  MetaphoneTest.testWordsWithCIA:401 » StringIndexOutOfBounds String index out o...
  MetaphoneTest.testDiscardOfSCEOrSCIOrSCY:385 » StringIndexOutOfBounds String i...
  MetaphoneTest.testIsMetaphoneEqualRay:316->assertIsMetaphoneEqual:35 » StringIndexOutOfBounds

Tests run: 662, Failures: 0, Errors: 30, Skipped: 1

[INFO] ------------------------------------------------------------------------
[INFO] BUILD FAILURE
[INFO] ------------------------------------------------------------------------
[INFO] Total time: 13.986s
[INFO] Finished at: Sun Aug 02 12:15:51 BST 2015
[INFO] Final Memory: 21M/344M
[INFO] ------------------------------------------------------------------------
[ERROR] Failed to execute goal org.apache.maven.plugins:maven-surefire-plugin:2.17:test (default-test) on project commons-codec: There are test failures.
[ERROR] 
[ERROR] Please refer to /home/perham/Study/LittleDarwin/Cases/commons-codec-1.10-src/target/surefire-reports for the individual test results.
[ERROR] -> [Help 1]
[ERROR] 
[ERROR] To see the full stack trace of the errors, re-run Maven with the -e switch.
[ERROR] Re-run Maven using the -X switch to enable full debug logging.
[ERROR] 
[ERROR] For more information about the errors and possible solutions, please read the following articles:
[ERROR] [Help 1] http://cwiki.apache.org/confluence/display/MAVEN/MojoFailureException
