[INFO] Scanning for projects...
[INFO]                                                                         
[INFO] ------------------------------------------------------------------------
[INFO] Building Apache Commons Codec 1.10
[INFO] ------------------------------------------------------------------------
[INFO] 
[INFO] --- maven-enforcer-plugin:1.3.1:enforce (enforce-maven-3) @ commons-codec ---
[INFO] 
[INFO] --- maven-antrun-plugin:1.7:run (javadoc.resources) @ commons-codec ---
[INFO] Executing tasks

main:
[INFO] Executed tasks
[INFO] 
[INFO] --- maven-remote-resources-plugin:1.5:process (default) @ commons-codec ---
[INFO] 
[INFO] --- buildnumber-maven-plugin:1.3:create (default) @ commons-codec ---
[INFO] Executing: /bin/sh -c cd /home/perham/Study/LittleDarwin/Cases/commons-codec-1.10-src && svn --non-interactive info
[INFO] Working directory: /home/perham/Study/LittleDarwin/Cases/commons-codec-1.10-src
[INFO] Storing buildNumber: ?????? at timestamp: 1438513139370
[INFO] Executing: /bin/sh -c cd /home/perham/Study/LittleDarwin/Cases/commons-codec-1.10-src && svn --non-interactive info
[INFO] Working directory: /home/perham/Study/LittleDarwin/Cases/commons-codec-1.10-src
[INFO] Storing buildScmBranch: UNKNOWN_BRANCH
[INFO] 
[INFO] --- maven-resources-plugin:2.7:resources (default-resources) @ commons-codec ---
[INFO] Using 'UTF-8' encoding to copy filtered resources.
[INFO] Copying 128 resources
[INFO] Copying 2 resources to META-INF
[INFO] 
[INFO] --- maven-compiler-plugin:3.2:compile (default-compile) @ commons-codec ---
[INFO] Changes detected - recompiling the module!
[INFO] Compiling 60 source files to /home/perham/Study/LittleDarwin/Cases/commons-codec-1.10-src/target/classes
[INFO] /home/perham/Study/LittleDarwin/Cases/commons-codec-1.10-src/src/main/java/org/apache/commons/codec/digest/Sha2Crypt.java: Some input files use or override a deprecated API.
[INFO] /home/perham/Study/LittleDarwin/Cases/commons-codec-1.10-src/src/main/java/org/apache/commons/codec/digest/Sha2Crypt.java: Recompile with -Xlint:deprecation for details.
[INFO] 
[INFO] --- maven-bundle-plugin:2.5.3:manifest (bundle-manifest) @ commons-codec ---
[INFO] 
[INFO] --- maven-resources-plugin:2.7:testResources (default-testResources) @ commons-codec ---
[INFO] Using 'UTF-8' encoding to copy filtered resources.
[INFO] skip non existing resourceDirectory /home/perham/Study/LittleDarwin/Cases/commons-codec-1.10-src/src/test/resources
[INFO] Copying 2 resources to META-INF
[INFO] 
[INFO] --- maven-compiler-plugin:3.2:testCompile (default-testCompile) @ commons-codec ---
[INFO] Nothing to compile - all classes are up to date
[INFO] 
[INFO] --- maven-surefire-plugin:2.17:test (default-test) @ commons-codec ---
[INFO] Surefire report directory: /home/perham/Study/LittleDarwin/Cases/commons-codec-1.10-src/target/surefire-reports

-------------------------------------------------------
 T E S T S
-------------------------------------------------------
Running org.apache.commons.codec.digest.B64Test
Tests run: 2, Failures: 0, Errors: 0, Skipped: 0, Time elapsed: 0.027 sec - in org.apache.commons.codec.digest.B64Test
Running org.apache.commons.codec.digest.DigestUtilsTest
Tests run: 17, Failures: 0, Errors: 0, Skipped: 0, Time elapsed: 0.633 sec - in org.apache.commons.codec.digest.DigestUtilsTest
Running org.apache.commons.codec.digest.Sha512CryptTest
Tests run: 8, Failures: 0, Errors: 0, Skipped: 0, Time elapsed: 0.492 sec - in org.apache.commons.codec.digest.Sha512CryptTest
Running org.apache.commons.codec.digest.Apr1CryptTest
Tests run: 8, Failures: 0, Errors: 0, Skipped: 0, Time elapsed: 0.081 sec - in org.apache.commons.codec.digest.Apr1CryptTest
Running org.apache.commons.codec.digest.HmacUtilsTest
Tests run: 24, Failures: 0, Errors: 0, Skipped: 0, Time elapsed: 0.049 sec - in org.apache.commons.codec.digest.HmacUtilsTest
Running org.apache.commons.codec.digest.Sha2CryptTest
Tests run: 1, Failures: 0, Errors: 0, Skipped: 0, Time elapsed: 0 sec - in org.apache.commons.codec.digest.Sha2CryptTest
Running org.apache.commons.codec.digest.CryptTest
Tests run: 4, Failures: 0, Errors: 0, Skipped: 0, Time elapsed: 0.096 sec - in org.apache.commons.codec.digest.CryptTest
Running org.apache.commons.codec.digest.Sha256CryptTest
Tests run: 7, Failures: 0, Errors: 0, Skipped: 0, Time elapsed: 0.109 sec - in org.apache.commons.codec.digest.Sha256CryptTest
Running org.apache.commons.codec.digest.Md5CryptTest
Tests run: 7, Failures: 0, Errors: 0, Skipped: 0, Time elapsed: 0.02 sec - in org.apache.commons.codec.digest.Md5CryptTest
Running org.apache.commons.codec.digest.UnixCryptTest
Tests run: 9, Failures: 0, Errors: 0, Skipped: 0, Time elapsed: 0.007 sec - in org.apache.commons.codec.digest.UnixCryptTest
Running org.apache.commons.codec.CharsetsTest
Tests run: 7, Failures: 0, Errors: 0, Skipped: 0, Time elapsed: 0.002 sec - in org.apache.commons.codec.CharsetsTest
Running org.apache.commons.codec.binary.Base32Test
Tests run: 8, Failures: 0, Errors: 0, Skipped: 0, Time elapsed: 0.002 sec - in org.apache.commons.codec.binary.Base32Test
Running org.apache.commons.codec.binary.Base64OutputStreamTest
Tests run: 7, Failures: 0, Errors: 0, Skipped: 0, Time elapsed: 0.194 sec - in org.apache.commons.codec.binary.Base64OutputStreamTest
Running org.apache.commons.codec.binary.Base64Codec13Test
Tests run: 8, Failures: 0, Errors: 0, Skipped: 0, Time elapsed: 0.009 sec - in org.apache.commons.codec.binary.Base64Codec13Test
Running org.apache.commons.codec.binary.Base64InputStreamTest
Tests run: 19, Failures: 0, Errors: 0, Skipped: 0, Time elapsed: 0.098 sec - in org.apache.commons.codec.binary.Base64InputStreamTest
Running org.apache.commons.codec.binary.Base32InputStreamTest
Tests run: 16, Failures: 0, Errors: 0, Skipped: 0, Time elapsed: 0.125 sec - in org.apache.commons.codec.binary.Base32InputStreamTest
Running org.apache.commons.codec.binary.Base32OutputStreamTest
Tests run: 6, Failures: 0, Errors: 0, Skipped: 0, Time elapsed: 0.092 sec - in org.apache.commons.codec.binary.Base32OutputStreamTest
Running org.apache.commons.codec.binary.BinaryCodecTest
Tests run: 13, Failures: 0, Errors: 0, Skipped: 0, Time elapsed: 0.012 sec - in org.apache.commons.codec.binary.BinaryCodecTest
Running org.apache.commons.codec.binary.BaseNCodecTest
Tests run: 7, Failures: 0, Errors: 0, Skipped: 0, Time elapsed: 0.003 sec - in org.apache.commons.codec.binary.BaseNCodecTest
Running org.apache.commons.codec.binary.StringUtilsTest
Tests run: 17, Failures: 0, Errors: 0, Skipped: 0, Time elapsed: 0.029 sec - in org.apache.commons.codec.binary.StringUtilsTest
Running org.apache.commons.codec.binary.Base64Test
Tests run: 53, Failures: 0, Errors: 0, Skipped: 1, Time elapsed: 0.047 sec - in org.apache.commons.codec.binary.Base64Test
Running org.apache.commons.codec.binary.HexTest
Tests run: 19, Failures: 0, Errors: 0, Skipped: 0, Time elapsed: 0.182 sec - in org.apache.commons.codec.binary.HexTest
Running org.apache.commons.codec.DecoderExceptionTest
Tests run: 4, Failures: 0, Errors: 0, Skipped: 0, Time elapsed: 0 sec - in org.apache.commons.codec.DecoderExceptionTest
Running org.apache.commons.codec.EncoderExceptionTest
Tests run: 4, Failures: 0, Errors: 0, Skipped: 0, Time elapsed: 0 sec - in org.apache.commons.codec.EncoderExceptionTest
Running org.apache.commons.codec.net.BCodecTest
Tests run: 9, Failures: 0, Errors: 0, Skipped: 0, Time elapsed: 0.007 sec - in org.apache.commons.codec.net.BCodecTest
Running org.apache.commons.codec.net.QCodecTest
Tests run: 12, Failures: 0, Errors: 0, Skipped: 0, Time elapsed: 0.009 sec - in org.apache.commons.codec.net.QCodecTest
Running org.apache.commons.codec.net.UtilsTest
Tests run: 1, Failures: 0, Errors: 0, Skipped: 0, Time elapsed: 0 sec - in org.apache.commons.codec.net.UtilsTest
Running org.apache.commons.codec.net.RFC1522CodecTest
Tests run: 2, Failures: 0, Errors: 0, Skipped: 0, Time elapsed: 0.001 sec - in org.apache.commons.codec.net.RFC1522CodecTest
Running org.apache.commons.codec.net.URLCodecTest
Tests run: 16, Failures: 0, Errors: 0, Skipped: 0, Time elapsed: 0.003 sec - in org.apache.commons.codec.net.URLCodecTest
Running org.apache.commons.codec.net.QuotedPrintableCodecTest
Tests run: 21, Failures: 0, Errors: 0, Skipped: 0, Time elapsed: 0.011 sec - in org.apache.commons.codec.net.QuotedPrintableCodecTest
Running org.apache.commons.codec.StringEncoderComparatorTest
Tests run: 3, Failures: 0, Errors: 0, Skipped: 0, Time elapsed: 0.005 sec - in org.apache.commons.codec.StringEncoderComparatorTest
Running org.apache.commons.codec.language.Caverphone1Test
Tests run: 9, Failures: 0, Errors: 0, Skipped: 0, Time elapsed: 0.029 sec - in org.apache.commons.codec.language.Caverphone1Test
Running org.apache.commons.codec.language.NysiisTest
Tests run: 23, Failures: 0, Errors: 0, Skipped: 0, Time elapsed: 0.019 sec - in org.apache.commons.codec.language.NysiisTest
Running org.apache.commons.codec.language.Caverphone2Test
Tests run: 13, Failures: 0, Errors: 0, Skipped: 0, Time elapsed: 0.132 sec - in org.apache.commons.codec.language.Caverphone2Test
Running org.apache.commons.codec.language.DaitchMokotoffSoundexTest
Tests run: 13, Failures: 0, Errors: 0, Skipped: 0, Time elapsed: 0.054 sec - in org.apache.commons.codec.language.DaitchMokotoffSoundexTest
Running org.apache.commons.codec.language.bm.BeiderMorseEncoderTest
Tests run: 22, Failures: 0, Errors: 0, Skipped: 0, Time elapsed: 3.09 sec - in org.apache.commons.codec.language.bm.BeiderMorseEncoderTest
Running org.apache.commons.codec.language.bm.PhoneticEngineTest
Tests run: 8, Failures: 0, Errors: 0, Skipped: 0, Time elapsed: 0.019 sec - in org.apache.commons.codec.language.bm.PhoneticEngineTest
Running org.apache.commons.codec.language.bm.PhoneticEngineRegressionTest
Tests run: 4, Failures: 0, Errors: 0, Skipped: 0, Time elapsed: 0.013 sec - in org.apache.commons.codec.language.bm.PhoneticEngineRegressionTest
Running org.apache.commons.codec.language.bm.RuleTest
Tests run: 3, Failures: 0, Errors: 0, Skipped: 0, Time elapsed: 0.002 sec - in org.apache.commons.codec.language.bm.RuleTest
Running org.apache.commons.codec.language.bm.LanguageGuessingTest
Tests run: 18, Failures: 0, Errors: 0, Skipped: 0, Time elapsed: 0.013 sec - in org.apache.commons.codec.language.bm.LanguageGuessingTest
Running org.apache.commons.codec.language.DoubleMetaphoneTest
Tests run: 16, Failures: 0, Errors: 0, Skipped: 0, Time elapsed: 0.055 sec - in org.apache.commons.codec.language.DoubleMetaphoneTest
Running org.apache.commons.codec.language.SoundexTest
Tests run: 28, Failures: 0, Errors: 0, Skipped: 0, Time elapsed: 0.011 sec - in org.apache.commons.codec.language.SoundexTest
Running org.apache.commons.codec.language.RefinedSoundexTest
Tests run: 10, Failures: 0, Errors: 0, Skipped: 0, Time elapsed: 0.001 sec - in org.apache.commons.codec.language.RefinedSoundexTest
Running org.apache.commons.codec.language.MatchRatingApproachEncoderTest
Tests run: 96, Failures: 33, Errors: 0, Skipped: 0, Time elapsed: 0.033 sec <<< FAILURE! - in org.apache.commons.codec.language.MatchRatingApproachEncoderTest
testCompare_SOPHIE_SOFIA_SuccessfullyMatched(org.apache.commons.codec.language.MatchRatingApproachEncoderTest)  Time elapsed: 0.005 sec  <<< FAILURE!
java.lang.AssertionError: null
	at org.junit.Assert.fail(Assert.java:86)
	at org.junit.Assert.assertTrue(Assert.java:41)
	at org.junit.Assert.assertTrue(Assert.java:52)
	at org.apache.commons.codec.language.MatchRatingApproachEncoderTest.testCompare_SOPHIE_SOFIA_SuccessfullyMatched(MatchRatingApproachEncoderTest.java:370)

testCompare_SAM_SAMUEL_SuccessfullyMatched(org.apache.commons.codec.language.MatchRatingApproachEncoderTest)  Time elapsed: 0 sec  <<< FAILURE!
java.lang.AssertionError: null
	at org.junit.Assert.fail(Assert.java:86)
	at org.junit.Assert.assertTrue(Assert.java:41)
	at org.junit.Assert.assertTrue(Assert.java:52)
	at org.apache.commons.codec.language.MatchRatingApproachEncoderTest.testCompare_SAM_SAMUEL_SuccessfullyMatched(MatchRatingApproachEncoderTest.java:355)

testCompare_STEPHEN_STEVEN_SuccessfullyMatched(org.apache.commons.codec.language.MatchRatingApproachEncoderTest)  Time elapsed: 0 sec  <<< FAILURE!
java.lang.AssertionError: null
	at org.junit.Assert.fail(Assert.java:86)
	at org.junit.Assert.assertTrue(Assert.java:41)
	at org.junit.Assert.assertTrue(Assert.java:52)
	at org.apache.commons.codec.language.MatchRatingApproachEncoderTest.testCompare_STEPHEN_STEVEN_SuccessfullyMatched(MatchRatingApproachEncoderTest.java:340)

testCompare_Surname_MOSKOWITZ_MOSKOVITZ_SuccessfullyMatched(org.apache.commons.codec.language.MatchRatingApproachEncoderTest)  Time elapsed: 0 sec  <<< FAILURE!
java.lang.AssertionError: null
	at org.junit.Assert.fail(Assert.java:86)
	at org.junit.Assert.assertTrue(Assert.java:41)
	at org.junit.Assert.assertTrue(Assert.java:52)
	at org.apache.commons.codec.language.MatchRatingApproachEncoderTest.testCompare_Surname_MOSKOWITZ_MOSKOVITZ_SuccessfullyMatched(MatchRatingApproachEncoderTest.java:444)

testCompare_OONA_OONAGH_SuccessfullyMatched(org.apache.commons.codec.language.MatchRatingApproachEncoderTest)  Time elapsed: 0 sec  <<< FAILURE!
java.lang.AssertionError: null
	at org.junit.Assert.fail(Assert.java:86)
	at org.junit.Assert.assertTrue(Assert.java:41)
	at org.junit.Assert.assertTrue(Assert.java:52)
	at org.apache.commons.codec.language.MatchRatingApproachEncoderTest.testCompare_OONA_OONAGH_SuccessfullyMatched(MatchRatingApproachEncoderTest.java:365)

testCompare_Forenames_SEAN_JOHN_MatchExpected(org.apache.commons.codec.language.MatchRatingApproachEncoderTest)  Time elapsed: 0 sec  <<< FAILURE!
java.lang.AssertionError: null
	at org.junit.Assert.fail(Assert.java:86)
	at org.junit.Assert.assertTrue(Assert.java:41)
	at org.junit.Assert.assertTrue(Assert.java:52)
	at org.apache.commons.codec.language.MatchRatingApproachEncoderTest.testCompare_Forenames_SEAN_JOHN_MatchExpected(MatchRatingApproachEncoderTest.java:506)

testCompare_Surname_HAILEY_HALLEY_SuccessfullyMatched(org.apache.commons.codec.language.MatchRatingApproachEncoderTest)  Time elapsed: 0 sec  <<< FAILURE!
java.lang.AssertionError: null
	at org.junit.Assert.fail(Assert.java:86)
	at org.junit.Assert.assertTrue(Assert.java:41)
	at org.junit.Assert.assertTrue(Assert.java:52)
	at org.apache.commons.codec.language.MatchRatingApproachEncoderTest.testCompare_Surname_HAILEY_HALLEY_SuccessfullyMatched(MatchRatingApproachEncoderTest.java:432)

testCompare_TOMASZ_TOM_SuccessfullyMatched(org.apache.commons.codec.language.MatchRatingApproachEncoderTest)  Time elapsed: 0 sec  <<< FAILURE!
java.lang.AssertionError: null
	at org.junit.Assert.fail(Assert.java:86)
	at org.junit.Assert.assertTrue(Assert.java:41)
	at org.junit.Assert.assertTrue(Assert.java:52)
	at org.apache.commons.codec.language.MatchRatingApproachEncoderTest.testCompare_TOMASZ_TOM_SuccessfullyMatched(MatchRatingApproachEncoderTest.java:380)

testCompare_Surname_LIPSHITZ_LIPPSZYC_SuccessfullyMatched(org.apache.commons.codec.language.MatchRatingApproachEncoderTest)  Time elapsed: 0 sec  <<< FAILURE!
java.lang.AssertionError: null
	at org.junit.Assert.fail(Assert.java:86)
	at org.junit.Assert.assertTrue(Assert.java:41)
	at org.junit.Assert.assertTrue(Assert.java:52)
	at org.apache.commons.codec.language.MatchRatingApproachEncoderTest.testCompare_Surname_LIPSHITZ_LIPPSZYC_SuccessfullyMatched(MatchRatingApproachEncoderTest.java:449)

testCompare_CATHERINE_KATHRYN_SuccessfullyMatched(org.apache.commons.codec.language.MatchRatingApproachEncoderTest)  Time elapsed: 0 sec  <<< FAILURE!
java.lang.AssertionError: null
	at org.junit.Assert.fail(Assert.java:86)
	at org.junit.Assert.assertTrue(Assert.java:41)
	at org.junit.Assert.assertTrue(Assert.java:52)
	at org.apache.commons.codec.language.MatchRatingApproachEncoderTest.testCompare_CATHERINE_KATHRYN_SuccessfullyMatched(MatchRatingApproachEncoderTest.java:320)

testCompareNameSameNames_ReturnsFalseSuccessfully(org.apache.commons.codec.language.MatchRatingApproachEncoderTest)  Time elapsed: 0.001 sec  <<< FAILURE!
java.lang.AssertionError: null
	at org.junit.Assert.fail(Assert.java:86)
	at org.junit.Assert.assertTrue(Assert.java:41)
	at org.junit.Assert.assertTrue(Assert.java:52)
	at org.apache.commons.codec.language.MatchRatingApproachEncoderTest.testCompareNameSameNames_ReturnsFalseSuccessfully(MatchRatingApproachEncoderTest.java:296)

testCompare_ZACH_ZAKARIA_SuccessfullyMatched(org.apache.commons.codec.language.MatchRatingApproachEncoderTest)  Time elapsed: 0 sec  <<< FAILURE!
java.lang.AssertionError: null
	at org.junit.Assert.fail(Assert.java:86)
	at org.junit.Assert.assertTrue(Assert.java:41)
	at org.junit.Assert.assertTrue(Assert.java:52)
	at org.apache.commons.codec.language.MatchRatingApproachEncoderTest.testCompare_ZACH_ZAKARIA_SuccessfullyMatched(MatchRatingApproachEncoderTest.java:395)

testCompare_MCGOWAN_MCGEOGHEGAN_SuccessfullyMatched(org.apache.commons.codec.language.MatchRatingApproachEncoderTest)  Time elapsed: 0 sec  <<< FAILURE!
java.lang.AssertionError: null
	at org.junit.Assert.fail(Assert.java:86)
	at org.junit.Assert.assertTrue(Assert.java:41)
	at org.junit.Assert.assertTrue(Assert.java:52)
	at org.apache.commons.codec.language.MatchRatingApproachEncoderTest.testCompare_MCGOWAN_MCGEOGHEGAN_SuccessfullyMatched(MatchRatingApproachEncoderTest.java:481)

testCompare_Surname_SZLAMAWICZ_SHLAMOVITZ_SuccessfullyMatched(org.apache.commons.codec.language.MatchRatingApproachEncoderTest)  Time elapsed: 0 sec  <<< FAILURE!
java.lang.AssertionError: null
	at org.junit.Assert.fail(Assert.java:86)
	at org.junit.Assert.assertTrue(Assert.java:41)
	at org.junit.Assert.assertTrue(Assert.java:52)
	at org.apache.commons.codec.language.MatchRatingApproachEncoderTest.testCompare_Surname_SZLAMAWICZ_SHLAMOVITZ_SuccessfullyMatched(MatchRatingApproachEncoderTest.java:459)

testCompare_SMITH_SMYTH_SuccessfullyMatched(org.apache.commons.codec.language.MatchRatingApproachEncoderTest)  Time elapsed: 0 sec  <<< FAILURE!
java.lang.AssertionError: null
	at org.junit.Assert.fail(Assert.java:86)
	at org.junit.Assert.assertTrue(Assert.java:41)
	at org.junit.Assert.assertTrue(Assert.java:52)
	at org.apache.commons.codec.language.MatchRatingApproachEncoderTest.testCompare_SMITH_SMYTH_SuccessfullyMatched(MatchRatingApproachEncoderTest.java:305)

testCompare_STEPHEN_STEFAN_SuccessfullyMatched(org.apache.commons.codec.language.MatchRatingApproachEncoderTest)  Time elapsed: 0 sec  <<< FAILURE!
java.lang.AssertionError: null
	at org.junit.Assert.fail(Assert.java:86)
	at org.junit.Assert.assertTrue(Assert.java:41)
	at org.junit.Assert.assertTrue(Assert.java:52)
	at org.apache.commons.codec.language.MatchRatingApproachEncoderTest.testCompare_STEPHEN_STEFAN_SuccessfullyMatched(MatchRatingApproachEncoderTest.java:350)

testCompare_MICKY_MICHAEL_SuccessfullyMatched(org.apache.commons.codec.language.MatchRatingApproachEncoderTest)  Time elapsed: 0 sec  <<< FAILURE!
java.lang.AssertionError: null
	at org.junit.Assert.fail(Assert.java:86)
	at org.junit.Assert.assertTrue(Assert.java:41)
	at org.junit.Assert.assertTrue(Assert.java:52)
	at org.apache.commons.codec.language.MatchRatingApproachEncoderTest.testCompare_MICKY_MICHAEL_SuccessfullyMatched(MatchRatingApproachEncoderTest.java:360)

testCompare_Surname_COOPERFLYNN_SUPERLYN_SuccessfullyMatched(org.apache.commons.codec.language.MatchRatingApproachEncoderTest)  Time elapsed: 0 sec  <<< FAILURE!
java.lang.AssertionError: null
	at org.junit.Assert.fail(Assert.java:86)
	at org.junit.Assert.assertTrue(Assert.java:41)
	at org.junit.Assert.assertTrue(Assert.java:52)
	at org.apache.commons.codec.language.MatchRatingApproachEncoderTest.testCompare_Surname_COOPERFLYNN_SUPERLYN_SuccessfullyMatched(MatchRatingApproachEncoderTest.java:427)

testCompare_Surname_PRZEMYSL_PSHEMESHIL_SuccessfullyMatched(org.apache.commons.codec.language.MatchRatingApproachEncoderTest)  Time elapsed: 0 sec  <<< FAILURE!
java.lang.AssertionError: null
	at org.junit.Assert.fail(Assert.java:86)
	at org.junit.Assert.assertTrue(Assert.java:41)
	at org.junit.Assert.assertTrue(Assert.java:52)
	at org.apache.commons.codec.language.MatchRatingApproachEncoderTest.testCompare_Surname_PRZEMYSL_PSHEMESHIL_SuccessfullyMatched(MatchRatingApproachEncoderTest.java:469)

testCompare_BURNS_BOURNE_SuccessfullyMatched(org.apache.commons.codec.language.MatchRatingApproachEncoderTest)  Time elapsed: 0 sec  <<< FAILURE!
java.lang.AssertionError: null
	at org.junit.Assert.fail(Assert.java:86)
	at org.junit.Assert.assertTrue(Assert.java:41)
	at org.junit.Assert.assertTrue(Assert.java:52)
	at org.apache.commons.codec.language.MatchRatingApproachEncoderTest.testCompare_BURNS_BOURNE_SuccessfullyMatched(MatchRatingApproachEncoderTest.java:310)

testCompare_SmallInput_CARK_Kl_SuccessfullyMatched(org.apache.commons.codec.language.MatchRatingApproachEncoderTest)  Time elapsed: 0 sec  <<< FAILURE!
java.lang.AssertionError: null
	at org.junit.Assert.fail(Assert.java:86)
	at org.junit.Assert.assertTrue(Assert.java:41)
	at org.junit.Assert.assertTrue(Assert.java:52)
	at org.apache.commons.codec.language.MatchRatingApproachEncoderTest.testCompare_SmallInput_CARK_Kl_SuccessfullyMatched(MatchRatingApproachEncoderTest.java:385)

testCompare_PETERSON_PETERS_SuccessfullyMatched(org.apache.commons.codec.language.MatchRatingApproachEncoderTest)  Time elapsed: 0.001 sec  <<< FAILURE!
java.lang.AssertionError: null
	at org.junit.Assert.fail(Assert.java:86)
	at org.junit.Assert.assertTrue(Assert.java:41)
	at org.junit.Assert.assertTrue(Assert.java:52)
	at org.apache.commons.codec.language.MatchRatingApproachEncoderTest.testCompare_PETERSON_PETERS_SuccessfullyMatched(MatchRatingApproachEncoderTest.java:476)

testCompare_Surname_ROSOCHOWACIEC_ROSOKHOVATSETS_SuccessfullyMatched(org.apache.commons.codec.language.MatchRatingApproachEncoderTest)  Time elapsed: 0 sec  <<< FAILURE!
java.lang.AssertionError: null
	at org.junit.Assert.fail(Assert.java:86)
	at org.junit.Assert.assertTrue(Assert.java:41)
	at org.junit.Assert.assertTrue(Assert.java:52)
	at org.apache.commons.codec.language.MatchRatingApproachEncoderTest.testCompare_Surname_ROSOCHOWACIEC_ROSOKHOVATSETS_SuccessfullyMatched(MatchRatingApproachEncoderTest.java:464)

testCompare_Surname_AUERBACH_UHRBACH_SuccessfullyMatched(org.apache.commons.codec.language.MatchRatingApproachEncoderTest)  Time elapsed: 0 sec  <<< FAILURE!
java.lang.AssertionError: null
	at org.junit.Assert.fail(Assert.java:86)
	at org.junit.Assert.assertTrue(Assert.java:41)
	at org.junit.Assert.assertTrue(Assert.java:52)
	at org.apache.commons.codec.language.MatchRatingApproachEncoderTest.testCompare_Surname_AUERBACH_UHRBACH_SuccessfullyMatched(MatchRatingApproachEncoderTest.java:439)

testisEncodeEquals_CornerCase_FirstNameJust1Letter_ReturnsFalse(org.apache.commons.codec.language.MatchRatingApproachEncoderTest)  Time elapsed: 0.001 sec  <<< FAILURE!
java.lang.AssertionError: null
	at org.junit.Assert.fail(Assert.java:86)
	at org.junit.Assert.assertTrue(Assert.java:41)
	at org.junit.Assert.assertFalse(Assert.java:64)
	at org.junit.Assert.assertFalse(Assert.java:74)
	at org.apache.commons.codec.language.MatchRatingApproachEncoderTest.testisEncodeEquals_CornerCase_FirstNameJust1Letter_ReturnsFalse(MatchRatingApproachEncoderTest.java:242)

testCompare_LongSurnames_OMUIRCHEARTAIGH_OMIREADHAIGH_SuccessfulMatch(org.apache.commons.codec.language.MatchRatingApproachEncoderTest)  Time elapsed: 0 sec  <<< FAILURE!
java.lang.AssertionError: null
	at org.junit.Assert.fail(Assert.java:86)
	at org.junit.Assert.assertTrue(Assert.java:41)
	at org.junit.Assert.assertTrue(Assert.java:52)
	at org.apache.commons.codec.language.MatchRatingApproachEncoderTest.testCompare_LongSurnames_OMUIRCHEARTAIGH_OMIREADHAIGH_SuccessfulMatch(MatchRatingApproachEncoderTest.java:422)

testCompare_STEVEN_STEFAN_SuccessfullyMatched(org.apache.commons.codec.language.MatchRatingApproachEncoderTest)  Time elapsed: 0 sec  <<< FAILURE!
java.lang.AssertionError: null
	at org.junit.Assert.fail(Assert.java:86)
	at org.junit.Assert.assertTrue(Assert.java:41)
	at org.junit.Assert.assertTrue(Assert.java:52)
	at org.apache.commons.codec.language.MatchRatingApproachEncoderTest.testCompare_STEVEN_STEFAN_SuccessfullyMatched(MatchRatingApproachEncoderTest.java:345)

testCompare_COLM_COLIN_WithAccentsAndSymbolsAndSpaces_SuccessfullyMatched(org.apache.commons.codec.language.MatchRatingApproachEncoderTest)  Time elapsed: 0 sec  <<< FAILURE!
java.lang.AssertionError: null
	at org.junit.Assert.fail(Assert.java:86)
	at org.junit.Assert.assertTrue(Assert.java:41)
	at org.junit.Assert.assertTrue(Assert.java:52)
	at org.apache.commons.codec.language.MatchRatingApproachEncoderTest.testCompare_COLM_COLIN_WithAccentsAndSymbolsAndSpaces_SuccessfullyMatched(MatchRatingApproachEncoderTest.java:335)

testCompare_Surname_OSULLIVAN_OSUILLEABHAIN_SuccessfulMatch(org.apache.commons.codec.language.MatchRatingApproachEncoderTest)  Time elapsed: 0 sec  <<< FAILURE!
java.lang.AssertionError: null
	at org.junit.Assert.fail(Assert.java:86)
	at org.junit.Assert.assertTrue(Assert.java:41)
	at org.junit.Assert.assertTrue(Assert.java:52)
	at org.apache.commons.codec.language.MatchRatingApproachEncoderTest.testCompare_Surname_OSULLIVAN_OSUILLEABHAIN_SuccessfulMatch(MatchRatingApproachEncoderTest.java:412)

testCompare_SEAN_SHAUN_SuccessfullyMatched(org.apache.commons.codec.language.MatchRatingApproachEncoderTest)  Time elapsed: 0 sec  <<< FAILURE!
java.lang.AssertionError: null
	at org.junit.Assert.fail(Assert.java:86)
	at org.junit.Assert.assertTrue(Assert.java:41)
	at org.junit.Assert.assertTrue(Assert.java:52)
	at org.apache.commons.codec.language.MatchRatingApproachEncoderTest.testCompare_SEAN_SHAUN_SuccessfullyMatched(MatchRatingApproachEncoderTest.java:330)

testCompare_FRANCISZEK_FRANCES_SuccessfullyMatched(org.apache.commons.codec.language.MatchRatingApproachEncoderTest)  Time elapsed: 0 sec  <<< FAILURE!
java.lang.AssertionError: null
	at org.junit.Assert.fail(Assert.java:86)
	at org.junit.Assert.assertTrue(Assert.java:41)
	at org.junit.Assert.assertTrue(Assert.java:52)
	at org.apache.commons.codec.language.MatchRatingApproachEncoderTest.testCompare_FRANCISZEK_FRANCES_SuccessfullyMatched(MatchRatingApproachEncoderTest.java:375)

testCompare_Surname_LEWINSKY_LEVINSKI_SuccessfullyMatched(org.apache.commons.codec.language.MatchRatingApproachEncoderTest)  Time elapsed: 0 sec  <<< FAILURE!
java.lang.AssertionError: null
	at org.junit.Assert.fail(Assert.java:86)
	at org.junit.Assert.assertTrue(Assert.java:41)
	at org.junit.Assert.assertTrue(Assert.java:52)
	at org.apache.commons.codec.language.MatchRatingApproachEncoderTest.testCompare_Surname_LEWINSKY_LEVINSKI_SuccessfullyMatched(MatchRatingApproachEncoderTest.java:454)

testCompare_BRIAN_BRYAN_SuccessfullyMatched(org.apache.commons.codec.language.MatchRatingApproachEncoderTest)  Time elapsed: 0 sec  <<< FAILURE!
java.lang.AssertionError: null
	at org.junit.Assert.fail(Assert.java:86)
	at org.junit.Assert.assertTrue(Assert.java:41)
	at org.junit.Assert.assertTrue(Assert.java:52)
	at org.apache.commons.codec.language.MatchRatingApproachEncoderTest.testCompare_BRIAN_BRYAN_SuccessfullyMatched(MatchRatingApproachEncoderTest.java:325)

Running org.apache.commons.codec.language.ColognePhoneticTest
Tests run: 13, Failures: 0, Errors: 0, Skipped: 0, Time elapsed: 0 sec - in org.apache.commons.codec.language.ColognePhoneticTest
Running org.apache.commons.codec.language.DoubleMetaphone2Test
Tests run: 6, Failures: 0, Errors: 0, Skipped: 0, Time elapsed: 0.019 sec - in org.apache.commons.codec.language.DoubleMetaphone2Test
Running org.apache.commons.codec.language.MetaphoneTest
Tests run: 34, Failures: 0, Errors: 0, Skipped: 0, Time elapsed: 0.108 sec - in org.apache.commons.codec.language.MetaphoneTest
Running org.apache.commons.codec.CharEncodingTest
Tests run: 7, Failures: 0, Errors: 0, Skipped: 0, Time elapsed: 0 sec - in org.apache.commons.codec.CharEncodingTest

Results :

Failed tests: 
  MatchRatingApproachEncoderTest.testCompare_SOPHIE_SOFIA_SuccessfullyMatched:370 null
  MatchRatingApproachEncoderTest.testCompare_SAM_SAMUEL_SuccessfullyMatched:355 null
  MatchRatingApproachEncoderTest.testCompare_STEPHEN_STEVEN_SuccessfullyMatched:340 null
  MatchRatingApproachEncoderTest.testCompare_Surname_MOSKOWITZ_MOSKOVITZ_SuccessfullyMatched:444 null
  MatchRatingApproachEncoderTest.testCompare_OONA_OONAGH_SuccessfullyMatched:365 null
  MatchRatingApproachEncoderTest.testCompare_Forenames_SEAN_JOHN_MatchExpected:506 null
  MatchRatingApproachEncoderTest.testCompare_Surname_HAILEY_HALLEY_SuccessfullyMatched:432 null
  MatchRatingApproachEncoderTest.testCompare_TOMASZ_TOM_SuccessfullyMatched:380 null
  MatchRatingApproachEncoderTest.testCompare_Surname_LIPSHITZ_LIPPSZYC_SuccessfullyMatched:449 null
  MatchRatingApproachEncoderTest.testCompare_CATHERINE_KATHRYN_SuccessfullyMatched:320 null
  MatchRatingApproachEncoderTest.testCompareNameSameNames_ReturnsFalseSuccessfully:296 null
  MatchRatingApproachEncoderTest.testCompare_ZACH_ZAKARIA_SuccessfullyMatched:395 null
  MatchRatingApproachEncoderTest.testCompare_MCGOWAN_MCGEOGHEGAN_SuccessfullyMatched:481 null
  MatchRatingApproachEncoderTest.testCompare_Surname_SZLAMAWICZ_SHLAMOVITZ_SuccessfullyMatched:459 null
  MatchRatingApproachEncoderTest.testCompare_SMITH_SMYTH_SuccessfullyMatched:305 null
  MatchRatingApproachEncoderTest.testCompare_STEPHEN_STEFAN_SuccessfullyMatched:350 null
  MatchRatingApproachEncoderTest.testCompare_MICKY_MICHAEL_SuccessfullyMatched:360 null
  MatchRatingApproachEncoderTest.testCompare_Surname_COOPERFLYNN_SUPERLYN_SuccessfullyMatched:427 null
  MatchRatingApproachEncoderTest.testCompare_Surname_PRZEMYSL_PSHEMESHIL_SuccessfullyMatched:469 null
  MatchRatingApproachEncoderTest.testCompare_BURNS_BOURNE_SuccessfullyMatched:310 null
  MatchRatingApproachEncoderTest.testCompare_SmallInput_CARK_Kl_SuccessfullyMatched:385 null
  MatchRatingApproachEncoderTest.testCompare_PETERSON_PETERS_SuccessfullyMatched:476 null
  MatchRatingApproachEncoderTest.testCompare_Surname_ROSOCHOWACIEC_ROSOKHOVATSETS_SuccessfullyMatched:464 null
  MatchRatingApproachEncoderTest.testCompare_Surname_AUERBACH_UHRBACH_SuccessfullyMatched:439 null
  MatchRatingApproachEncoderTest.testisEncodeEquals_CornerCase_FirstNameJust1Letter_ReturnsFalse:242 null
  MatchRatingApproachEncoderTest.testCompare_LongSurnames_OMUIRCHEARTAIGH_OMIREADHAIGH_SuccessfulMatch:422 null
  MatchRatingApproachEncoderTest.testCompare_STEVEN_STEFAN_SuccessfullyMatched:345 null
  MatchRatingApproachEncoderTest.testCompare_COLM_COLIN_WithAccentsAndSymbolsAndSpaces_SuccessfullyMatched:335 null
  MatchRatingApproachEncoderTest.testCompare_Surname_OSULLIVAN_OSUILLEABHAIN_SuccessfulMatch:412 null
  MatchRatingApproachEncoderTest.testCompare_SEAN_SHAUN_SuccessfullyMatched:330 null
  MatchRatingApproachEncoderTest.testCompare_FRANCISZEK_FRANCES_SuccessfullyMatched:375 null
  MatchRatingApproachEncoderTest.testCompare_Surname_LEWINSKY_LEVINSKI_SuccessfullyMatched:454 null
  MatchRatingApproachEncoderTest.testCompare_BRIAN_BRYAN_SuccessfullyMatched:325 null

Tests run: 662, Failures: 33, Errors: 0, Skipped: 1

[INFO] ------------------------------------------------------------------------
[INFO] BUILD FAILURE
[INFO] ------------------------------------------------------------------------
[INFO] Total time: 13.875s
[INFO] Finished at: Sun Aug 02 11:59:10 BST 2015
[INFO] Final Memory: 21M/344M
[INFO] ------------------------------------------------------------------------
[ERROR] Failed to execute goal org.apache.maven.plugins:maven-surefire-plugin:2.17:test (default-test) on project commons-codec: There are test failures.
[ERROR] 
[ERROR] Please refer to /home/perham/Study/LittleDarwin/Cases/commons-codec-1.10-src/target/surefire-reports for the individual test results.
[ERROR] -> [Help 1]
[ERROR] 
[ERROR] To see the full stack trace of the errors, re-run Maven with the -e switch.
[ERROR] Re-run Maven using the -X switch to enable full debug logging.
[ERROR] 
[ERROR] For more information about the errors and possible solutions, please read the following articles:
[ERROR] [Help 1] http://cwiki.apache.org/confluence/display/MAVEN/MojoFailureException
