[INFO] Scanning for projects...
[INFO]                                                                         
[INFO] ------------------------------------------------------------------------
[INFO] Building Apache Commons Codec 1.10
[INFO] ------------------------------------------------------------------------
[INFO] 
[INFO] --- maven-enforcer-plugin:1.3.1:enforce (enforce-maven-3) @ commons-codec ---
[INFO] 
[INFO] --- maven-antrun-plugin:1.7:run (javadoc.resources) @ commons-codec ---
[INFO] Executing tasks

main:
[INFO] Executed tasks
[INFO] 
[INFO] --- maven-remote-resources-plugin:1.5:process (default) @ commons-codec ---
[INFO] 
[INFO] --- buildnumber-maven-plugin:1.3:create (default) @ commons-codec ---
[INFO] Executing: /bin/sh -c cd /home/perham/Study/LittleDarwin/Cases/commons-codec-1.10-src && svn --non-interactive info
[INFO] Working directory: /home/perham/Study/LittleDarwin/Cases/commons-codec-1.10-src
[INFO] Storing buildNumber: ?????? at timestamp: 1438512946589
[INFO] Executing: /bin/sh -c cd /home/perham/Study/LittleDarwin/Cases/commons-codec-1.10-src && svn --non-interactive info
[INFO] Working directory: /home/perham/Study/LittleDarwin/Cases/commons-codec-1.10-src
[INFO] Storing buildScmBranch: UNKNOWN_BRANCH
[INFO] 
[INFO] --- maven-resources-plugin:2.7:resources (default-resources) @ commons-codec ---
[INFO] Using 'UTF-8' encoding to copy filtered resources.
[INFO] Copying 128 resources
[INFO] Copying 2 resources to META-INF
[INFO] 
[INFO] --- maven-compiler-plugin:3.2:compile (default-compile) @ commons-codec ---
[INFO] Changes detected - recompiling the module!
[INFO] Compiling 60 source files to /home/perham/Study/LittleDarwin/Cases/commons-codec-1.10-src/target/classes
[INFO] /home/perham/Study/LittleDarwin/Cases/commons-codec-1.10-src/src/main/java/org/apache/commons/codec/digest/Sha2Crypt.java: Some input files use or override a deprecated API.
[INFO] /home/perham/Study/LittleDarwin/Cases/commons-codec-1.10-src/src/main/java/org/apache/commons/codec/digest/Sha2Crypt.java: Recompile with -Xlint:deprecation for details.
[INFO] 
[INFO] --- maven-bundle-plugin:2.5.3:manifest (bundle-manifest) @ commons-codec ---
[INFO] 
[INFO] --- maven-resources-plugin:2.7:testResources (default-testResources) @ commons-codec ---
[INFO] Using 'UTF-8' encoding to copy filtered resources.
[INFO] skip non existing resourceDirectory /home/perham/Study/LittleDarwin/Cases/commons-codec-1.10-src/src/test/resources
[INFO] Copying 2 resources to META-INF
[INFO] 
[INFO] --- maven-compiler-plugin:3.2:testCompile (default-testCompile) @ commons-codec ---
[INFO] Nothing to compile - all classes are up to date
[INFO] 
[INFO] --- maven-surefire-plugin:2.17:test (default-test) @ commons-codec ---
[INFO] Surefire report directory: /home/perham/Study/LittleDarwin/Cases/commons-codec-1.10-src/target/surefire-reports

-------------------------------------------------------
 T E S T S
-------------------------------------------------------
Running org.apache.commons.codec.digest.B64Test
Tests run: 2, Failures: 0, Errors: 0, Skipped: 0, Time elapsed: 0.028 sec - in org.apache.commons.codec.digest.B64Test
Running org.apache.commons.codec.digest.DigestUtilsTest
Tests run: 17, Failures: 0, Errors: 0, Skipped: 0, Time elapsed: 0.644 sec - in org.apache.commons.codec.digest.DigestUtilsTest
Running org.apache.commons.codec.digest.Sha512CryptTest
Tests run: 8, Failures: 0, Errors: 0, Skipped: 0, Time elapsed: 0.48 sec - in org.apache.commons.codec.digest.Sha512CryptTest
Running org.apache.commons.codec.digest.Apr1CryptTest
Tests run: 8, Failures: 0, Errors: 0, Skipped: 0, Time elapsed: 0.095 sec - in org.apache.commons.codec.digest.Apr1CryptTest
Running org.apache.commons.codec.digest.HmacUtilsTest
Tests run: 24, Failures: 0, Errors: 0, Skipped: 0, Time elapsed: 0.044 sec - in org.apache.commons.codec.digest.HmacUtilsTest
Running org.apache.commons.codec.digest.Sha2CryptTest
Tests run: 1, Failures: 0, Errors: 0, Skipped: 0, Time elapsed: 0.001 sec - in org.apache.commons.codec.digest.Sha2CryptTest
Running org.apache.commons.codec.digest.CryptTest
Tests run: 4, Failures: 0, Errors: 0, Skipped: 0, Time elapsed: 0.111 sec - in org.apache.commons.codec.digest.CryptTest
Running org.apache.commons.codec.digest.Sha256CryptTest
Tests run: 7, Failures: 0, Errors: 0, Skipped: 0, Time elapsed: 0.107 sec - in org.apache.commons.codec.digest.Sha256CryptTest
Running org.apache.commons.codec.digest.Md5CryptTest
Tests run: 7, Failures: 0, Errors: 0, Skipped: 0, Time elapsed: 0.019 sec - in org.apache.commons.codec.digest.Md5CryptTest
Running org.apache.commons.codec.digest.UnixCryptTest
Tests run: 9, Failures: 0, Errors: 0, Skipped: 0, Time elapsed: 0.01 sec - in org.apache.commons.codec.digest.UnixCryptTest
Running org.apache.commons.codec.CharsetsTest
Tests run: 7, Failures: 0, Errors: 0, Skipped: 0, Time elapsed: 0.001 sec - in org.apache.commons.codec.CharsetsTest
Running org.apache.commons.codec.binary.Base32Test
Tests run: 8, Failures: 0, Errors: 0, Skipped: 0, Time elapsed: 0.005 sec - in org.apache.commons.codec.binary.Base32Test
Running org.apache.commons.codec.binary.Base64OutputStreamTest
Tests run: 7, Failures: 0, Errors: 0, Skipped: 0, Time elapsed: 0.199 sec - in org.apache.commons.codec.binary.Base64OutputStreamTest
Running org.apache.commons.codec.binary.Base64Codec13Test
Tests run: 8, Failures: 0, Errors: 0, Skipped: 0, Time elapsed: 0.011 sec - in org.apache.commons.codec.binary.Base64Codec13Test
Running org.apache.commons.codec.binary.Base64InputStreamTest
Tests run: 19, Failures: 0, Errors: 0, Skipped: 0, Time elapsed: 0.118 sec - in org.apache.commons.codec.binary.Base64InputStreamTest
Running org.apache.commons.codec.binary.Base32InputStreamTest
Tests run: 16, Failures: 0, Errors: 0, Skipped: 0, Time elapsed: 0.191 sec - in org.apache.commons.codec.binary.Base32InputStreamTest
Running org.apache.commons.codec.binary.Base32OutputStreamTest
Tests run: 6, Failures: 0, Errors: 0, Skipped: 0, Time elapsed: 0.077 sec - in org.apache.commons.codec.binary.Base32OutputStreamTest
Running org.apache.commons.codec.binary.BinaryCodecTest
Tests run: 13, Failures: 0, Errors: 0, Skipped: 0, Time elapsed: 0.002 sec - in org.apache.commons.codec.binary.BinaryCodecTest
Running org.apache.commons.codec.binary.BaseNCodecTest
Tests run: 7, Failures: 0, Errors: 0, Skipped: 0, Time elapsed: 0.003 sec - in org.apache.commons.codec.binary.BaseNCodecTest
Running org.apache.commons.codec.binary.StringUtilsTest
Tests run: 17, Failures: 0, Errors: 0, Skipped: 0, Time elapsed: 0.026 sec - in org.apache.commons.codec.binary.StringUtilsTest
Running org.apache.commons.codec.binary.Base64Test
Tests run: 53, Failures: 0, Errors: 0, Skipped: 1, Time elapsed: 0.049 sec - in org.apache.commons.codec.binary.Base64Test
Running org.apache.commons.codec.binary.HexTest
Tests run: 19, Failures: 0, Errors: 0, Skipped: 0, Time elapsed: 0.19 sec - in org.apache.commons.codec.binary.HexTest
Running org.apache.commons.codec.DecoderExceptionTest
Tests run: 4, Failures: 0, Errors: 0, Skipped: 0, Time elapsed: 0.001 sec - in org.apache.commons.codec.DecoderExceptionTest
Running org.apache.commons.codec.EncoderExceptionTest
Tests run: 4, Failures: 0, Errors: 0, Skipped: 0, Time elapsed: 0.001 sec - in org.apache.commons.codec.EncoderExceptionTest
Running org.apache.commons.codec.net.BCodecTest
Tests run: 9, Failures: 0, Errors: 0, Skipped: 0, Time elapsed: 0.004 sec - in org.apache.commons.codec.net.BCodecTest
Running org.apache.commons.codec.net.QCodecTest
Tests run: 12, Failures: 0, Errors: 0, Skipped: 0, Time elapsed: 0.006 sec - in org.apache.commons.codec.net.QCodecTest
Running org.apache.commons.codec.net.UtilsTest
Tests run: 1, Failures: 0, Errors: 0, Skipped: 0, Time elapsed: 0 sec - in org.apache.commons.codec.net.UtilsTest
Running org.apache.commons.codec.net.RFC1522CodecTest
Tests run: 2, Failures: 0, Errors: 0, Skipped: 0, Time elapsed: 0.001 sec - in org.apache.commons.codec.net.RFC1522CodecTest
Running org.apache.commons.codec.net.URLCodecTest
Tests run: 16, Failures: 0, Errors: 0, Skipped: 0, Time elapsed: 0.008 sec - in org.apache.commons.codec.net.URLCodecTest
Running org.apache.commons.codec.net.QuotedPrintableCodecTest
Tests run: 21, Failures: 0, Errors: 0, Skipped: 0, Time elapsed: 0.009 sec - in org.apache.commons.codec.net.QuotedPrintableCodecTest
Running org.apache.commons.codec.StringEncoderComparatorTest
Tests run: 3, Failures: 0, Errors: 0, Skipped: 0, Time elapsed: 0.004 sec - in org.apache.commons.codec.StringEncoderComparatorTest
Running org.apache.commons.codec.language.Caverphone1Test
Tests run: 9, Failures: 0, Errors: 0, Skipped: 0, Time elapsed: 0.03 sec - in org.apache.commons.codec.language.Caverphone1Test
Running org.apache.commons.codec.language.NysiisTest
Tests run: 23, Failures: 0, Errors: 0, Skipped: 0, Time elapsed: 0.018 sec - in org.apache.commons.codec.language.NysiisTest
Running org.apache.commons.codec.language.Caverphone2Test
Tests run: 13, Failures: 0, Errors: 0, Skipped: 0, Time elapsed: 0.13 sec - in org.apache.commons.codec.language.Caverphone2Test
Running org.apache.commons.codec.language.DaitchMokotoffSoundexTest
Tests run: 13, Failures: 0, Errors: 0, Skipped: 0, Time elapsed: 0.051 sec - in org.apache.commons.codec.language.DaitchMokotoffSoundexTest
Running org.apache.commons.codec.language.bm.BeiderMorseEncoderTest
Tests run: 22, Failures: 0, Errors: 0, Skipped: 0, Time elapsed: 3.007 sec - in org.apache.commons.codec.language.bm.BeiderMorseEncoderTest
Running org.apache.commons.codec.language.bm.PhoneticEngineTest
Tests run: 8, Failures: 0, Errors: 0, Skipped: 0, Time elapsed: 0.017 sec - in org.apache.commons.codec.language.bm.PhoneticEngineTest
Running org.apache.commons.codec.language.bm.PhoneticEngineRegressionTest
Tests run: 4, Failures: 0, Errors: 0, Skipped: 0, Time elapsed: 0.014 sec - in org.apache.commons.codec.language.bm.PhoneticEngineRegressionTest
Running org.apache.commons.codec.language.bm.RuleTest
Tests run: 3, Failures: 0, Errors: 0, Skipped: 0, Time elapsed: 0.002 sec - in org.apache.commons.codec.language.bm.RuleTest
Running org.apache.commons.codec.language.bm.LanguageGuessingTest
Tests run: 18, Failures: 0, Errors: 0, Skipped: 0, Time elapsed: 0.011 sec - in org.apache.commons.codec.language.bm.LanguageGuessingTest
Running org.apache.commons.codec.language.DoubleMetaphoneTest
Tests run: 16, Failures: 0, Errors: 0, Skipped: 0, Time elapsed: 0.057 sec - in org.apache.commons.codec.language.DoubleMetaphoneTest
Running org.apache.commons.codec.language.SoundexTest
Tests run: 28, Failures: 0, Errors: 0, Skipped: 0, Time elapsed: 0.013 sec - in org.apache.commons.codec.language.SoundexTest
Running org.apache.commons.codec.language.RefinedSoundexTest
Tests run: 10, Failures: 0, Errors: 0, Skipped: 0, Time elapsed: 0.002 sec - in org.apache.commons.codec.language.RefinedSoundexTest
Running org.apache.commons.codec.language.MatchRatingApproachEncoderTest
Tests run: 96, Failures: 0, Errors: 48, Skipped: 0, Time elapsed: 0.053 sec <<< FAILURE! - in org.apache.commons.codec.language.MatchRatingApproachEncoderTest
testCompare_SOPHIE_SOFIA_SuccessfullyMatched(org.apache.commons.codec.language.MatchRatingApproachEncoderTest)  Time elapsed: 0.009 sec  <<< ERROR!
java.lang.StringIndexOutOfBoundsException: String index out of range: -1
	at java.lang.String.charAt(String.java:658)
	at org.apache.commons.codec.language.MatchRatingApproachEncoder.removeAccents(MatchRatingApproachEncoder.java:91)
	at org.apache.commons.codec.language.MatchRatingApproachEncoder.cleanName(MatchRatingApproachEncoder.java:21)
	at org.apache.commons.codec.language.MatchRatingApproachEncoder.isEncodeEquals(MatchRatingApproachEncoder.java:48)
	at org.apache.commons.codec.language.MatchRatingApproachEncoderTest.testCompare_SOPHIE_SOFIA_SuccessfullyMatched(MatchRatingApproachEncoderTest.java:370)

testCompare_SAM_SAMUEL_SuccessfullyMatched(org.apache.commons.codec.language.MatchRatingApproachEncoderTest)  Time elapsed: 0 sec  <<< ERROR!
java.lang.StringIndexOutOfBoundsException: String index out of range: -1
	at java.lang.String.charAt(String.java:658)
	at org.apache.commons.codec.language.MatchRatingApproachEncoder.removeAccents(MatchRatingApproachEncoder.java:91)
	at org.apache.commons.codec.language.MatchRatingApproachEncoder.cleanName(MatchRatingApproachEncoder.java:21)
	at org.apache.commons.codec.language.MatchRatingApproachEncoder.isEncodeEquals(MatchRatingApproachEncoder.java:48)
	at org.apache.commons.codec.language.MatchRatingApproachEncoderTest.testCompare_SAM_SAMUEL_SuccessfullyMatched(MatchRatingApproachEncoderTest.java:355)

testCompare_STEPHEN_STEVEN_SuccessfullyMatched(org.apache.commons.codec.language.MatchRatingApproachEncoderTest)  Time elapsed: 0 sec  <<< ERROR!
java.lang.StringIndexOutOfBoundsException: String index out of range: -1
	at java.lang.String.charAt(String.java:658)
	at org.apache.commons.codec.language.MatchRatingApproachEncoder.removeAccents(MatchRatingApproachEncoder.java:91)
	at org.apache.commons.codec.language.MatchRatingApproachEncoder.cleanName(MatchRatingApproachEncoder.java:21)
	at org.apache.commons.codec.language.MatchRatingApproachEncoder.isEncodeEquals(MatchRatingApproachEncoder.java:48)
	at org.apache.commons.codec.language.MatchRatingApproachEncoderTest.testCompare_STEPHEN_STEVEN_SuccessfullyMatched(MatchRatingApproachEncoderTest.java:340)

testCompare_Surname_MOSKOWITZ_MOSKOVITZ_SuccessfullyMatched(org.apache.commons.codec.language.MatchRatingApproachEncoderTest)  Time elapsed: 0.001 sec  <<< ERROR!
java.lang.StringIndexOutOfBoundsException: String index out of range: -1
	at java.lang.String.charAt(String.java:658)
	at org.apache.commons.codec.language.MatchRatingApproachEncoder.removeAccents(MatchRatingApproachEncoder.java:91)
	at org.apache.commons.codec.language.MatchRatingApproachEncoder.cleanName(MatchRatingApproachEncoder.java:21)
	at org.apache.commons.codec.language.MatchRatingApproachEncoder.isEncodeEquals(MatchRatingApproachEncoder.java:48)
	at org.apache.commons.codec.language.MatchRatingApproachEncoderTest.testCompare_Surname_MOSKOWITZ_MOSKOVITZ_SuccessfullyMatched(MatchRatingApproachEncoderTest.java:444)

testCompare_OONA_OONAGH_SuccessfullyMatched(org.apache.commons.codec.language.MatchRatingApproachEncoderTest)  Time elapsed: 0 sec  <<< ERROR!
java.lang.StringIndexOutOfBoundsException: String index out of range: -1
	at java.lang.String.charAt(String.java:658)
	at org.apache.commons.codec.language.MatchRatingApproachEncoder.removeAccents(MatchRatingApproachEncoder.java:91)
	at org.apache.commons.codec.language.MatchRatingApproachEncoder.cleanName(MatchRatingApproachEncoder.java:21)
	at org.apache.commons.codec.language.MatchRatingApproachEncoder.isEncodeEquals(MatchRatingApproachEncoder.java:48)
	at org.apache.commons.codec.language.MatchRatingApproachEncoderTest.testCompare_OONA_OONAGH_SuccessfullyMatched(MatchRatingApproachEncoderTest.java:365)

testCompare_Forenames_SEAN_JOHN_MatchExpected(org.apache.commons.codec.language.MatchRatingApproachEncoderTest)  Time elapsed: 0 sec  <<< ERROR!
java.lang.StringIndexOutOfBoundsException: String index out of range: -1
	at java.lang.String.charAt(String.java:658)
	at org.apache.commons.codec.language.MatchRatingApproachEncoder.removeAccents(MatchRatingApproachEncoder.java:91)
	at org.apache.commons.codec.language.MatchRatingApproachEncoder.cleanName(MatchRatingApproachEncoder.java:21)
	at org.apache.commons.codec.language.MatchRatingApproachEncoder.isEncodeEquals(MatchRatingApproachEncoder.java:48)
	at org.apache.commons.codec.language.MatchRatingApproachEncoderTest.testCompare_Forenames_SEAN_JOHN_MatchExpected(MatchRatingApproachEncoderTest.java:506)

testCompare_Surname_HAILEY_HALLEY_SuccessfullyMatched(org.apache.commons.codec.language.MatchRatingApproachEncoderTest)  Time elapsed: 0.001 sec  <<< ERROR!
java.lang.StringIndexOutOfBoundsException: String index out of range: -1
	at java.lang.String.charAt(String.java:658)
	at org.apache.commons.codec.language.MatchRatingApproachEncoder.removeAccents(MatchRatingApproachEncoder.java:91)
	at org.apache.commons.codec.language.MatchRatingApproachEncoder.cleanName(MatchRatingApproachEncoder.java:21)
	at org.apache.commons.codec.language.MatchRatingApproachEncoder.isEncodeEquals(MatchRatingApproachEncoder.java:48)
	at org.apache.commons.codec.language.MatchRatingApproachEncoderTest.testCompare_Surname_HAILEY_HALLEY_SuccessfullyMatched(MatchRatingApproachEncoderTest.java:432)

testCompare_TOMASZ_TOM_SuccessfullyMatched(org.apache.commons.codec.language.MatchRatingApproachEncoderTest)  Time elapsed: 0 sec  <<< ERROR!
java.lang.StringIndexOutOfBoundsException: String index out of range: -1
	at java.lang.String.charAt(String.java:658)
	at org.apache.commons.codec.language.MatchRatingApproachEncoder.removeAccents(MatchRatingApproachEncoder.java:91)
	at org.apache.commons.codec.language.MatchRatingApproachEncoder.cleanName(MatchRatingApproachEncoder.java:21)
	at org.apache.commons.codec.language.MatchRatingApproachEncoder.isEncodeEquals(MatchRatingApproachEncoder.java:48)
	at org.apache.commons.codec.language.MatchRatingApproachEncoderTest.testCompare_TOMASZ_TOM_SuccessfullyMatched(MatchRatingApproachEncoderTest.java:380)

testCompare_KARL_ALESSANDRO_DoesNotMatch(org.apache.commons.codec.language.MatchRatingApproachEncoderTest)  Time elapsed: 0.001 sec  <<< ERROR!
java.lang.StringIndexOutOfBoundsException: String index out of range: -1
	at java.lang.String.charAt(String.java:658)
	at org.apache.commons.codec.language.MatchRatingApproachEncoder.removeAccents(MatchRatingApproachEncoder.java:91)
	at org.apache.commons.codec.language.MatchRatingApproachEncoder.cleanName(MatchRatingApproachEncoder.java:21)
	at org.apache.commons.codec.language.MatchRatingApproachEncoder.isEncodeEquals(MatchRatingApproachEncoder.java:48)
	at org.apache.commons.codec.language.MatchRatingApproachEncoderTest.testCompare_KARL_ALESSANDRO_DoesNotMatch(MatchRatingApproachEncoderTest.java:400)

testCompare_Surname_LIPSHITZ_LIPPSZYC_SuccessfullyMatched(org.apache.commons.codec.language.MatchRatingApproachEncoderTest)  Time elapsed: 0 sec  <<< ERROR!
java.lang.StringIndexOutOfBoundsException: String index out of range: -1
	at java.lang.String.charAt(String.java:658)
	at org.apache.commons.codec.language.MatchRatingApproachEncoder.removeAccents(MatchRatingApproachEncoder.java:91)
	at org.apache.commons.codec.language.MatchRatingApproachEncoder.cleanName(MatchRatingApproachEncoder.java:21)
	at org.apache.commons.codec.language.MatchRatingApproachEncoder.isEncodeEquals(MatchRatingApproachEncoder.java:48)
	at org.apache.commons.codec.language.MatchRatingApproachEncoderTest.testCompare_Surname_LIPSHITZ_LIPPSZYC_SuccessfullyMatched(MatchRatingApproachEncoderTest.java:449)

testCompare_CATHERINE_KATHRYN_SuccessfullyMatched(org.apache.commons.codec.language.MatchRatingApproachEncoderTest)  Time elapsed: 0.001 sec  <<< ERROR!
java.lang.StringIndexOutOfBoundsException: String index out of range: -1
	at java.lang.String.charAt(String.java:658)
	at org.apache.commons.codec.language.MatchRatingApproachEncoder.removeAccents(MatchRatingApproachEncoder.java:91)
	at org.apache.commons.codec.language.MatchRatingApproachEncoder.cleanName(MatchRatingApproachEncoder.java:21)
	at org.apache.commons.codec.language.MatchRatingApproachEncoder.isEncodeEquals(MatchRatingApproachEncoder.java:48)
	at org.apache.commons.codec.language.MatchRatingApproachEncoderTest.testCompare_CATHERINE_KATHRYN_SuccessfullyMatched(MatchRatingApproachEncoderTest.java:320)

testAccentRemoval_MixedWithUnusualChars_SuccessfullyRemovedAndUnusualcharactersInvariant(org.apache.commons.codec.language.MatchRatingApproachEncoderTest)  Time elapsed: 0 sec  <<< ERROR!
java.lang.StringIndexOutOfBoundsException: String index out of range: -1
	at java.lang.String.charAt(String.java:658)
	at org.apache.commons.codec.language.MatchRatingApproachEncoder.removeAccents(MatchRatingApproachEncoder.java:91)
	at org.apache.commons.codec.language.MatchRatingApproachEncoderTest.testAccentRemoval_MixedWithUnusualChars_SuccessfullyRemovedAndUnusualcharactersInvariant(MatchRatingApproachEncoderTest.java:56)

testCompare_ZACH_ZAKARIA_SuccessfullyMatched(org.apache.commons.codec.language.MatchRatingApproachEncoderTest)  Time elapsed: 0 sec  <<< ERROR!
java.lang.StringIndexOutOfBoundsException: String index out of range: -1
	at java.lang.String.charAt(String.java:658)
	at org.apache.commons.codec.language.MatchRatingApproachEncoder.removeAccents(MatchRatingApproachEncoder.java:91)
	at org.apache.commons.codec.language.MatchRatingApproachEncoder.cleanName(MatchRatingApproachEncoder.java:21)
	at org.apache.commons.codec.language.MatchRatingApproachEncoder.isEncodeEquals(MatchRatingApproachEncoder.java:48)
	at org.apache.commons.codec.language.MatchRatingApproachEncoderTest.testCompare_ZACH_ZAKARIA_SuccessfullyMatched(MatchRatingApproachEncoderTest.java:395)

testCompare_MCGOWAN_MCGEOGHEGAN_SuccessfullyMatched(org.apache.commons.codec.language.MatchRatingApproachEncoderTest)  Time elapsed: 0.001 sec  <<< ERROR!
java.lang.StringIndexOutOfBoundsException: String index out of range: -1
	at java.lang.String.charAt(String.java:658)
	at org.apache.commons.codec.language.MatchRatingApproachEncoder.removeAccents(MatchRatingApproachEncoder.java:91)
	at org.apache.commons.codec.language.MatchRatingApproachEncoder.cleanName(MatchRatingApproachEncoder.java:21)
	at org.apache.commons.codec.language.MatchRatingApproachEncoder.isEncodeEquals(MatchRatingApproachEncoder.java:48)
	at org.apache.commons.codec.language.MatchRatingApproachEncoderTest.testCompare_MCGOWAN_MCGEOGHEGAN_SuccessfullyMatched(MatchRatingApproachEncoderTest.java:481)

testCompare_Surname_SZLAMAWICZ_SHLAMOVITZ_SuccessfullyMatched(org.apache.commons.codec.language.MatchRatingApproachEncoderTest)  Time elapsed: 0 sec  <<< ERROR!
java.lang.StringIndexOutOfBoundsException: String index out of range: -1
	at java.lang.String.charAt(String.java:658)
	at org.apache.commons.codec.language.MatchRatingApproachEncoder.removeAccents(MatchRatingApproachEncoder.java:91)
	at org.apache.commons.codec.language.MatchRatingApproachEncoder.cleanName(MatchRatingApproachEncoder.java:21)
	at org.apache.commons.codec.language.MatchRatingApproachEncoder.isEncodeEquals(MatchRatingApproachEncoder.java:48)
	at org.apache.commons.codec.language.MatchRatingApproachEncoderTest.testCompare_Surname_SZLAMAWICZ_SHLAMOVITZ_SuccessfullyMatched(MatchRatingApproachEncoderTest.java:459)

testCompare_ShortNames_AL_ED_WorksButNoMatch(org.apache.commons.codec.language.MatchRatingApproachEncoderTest)  Time elapsed: 0 sec  <<< ERROR!
java.lang.StringIndexOutOfBoundsException: String index out of range: -1
	at java.lang.String.charAt(String.java:658)
	at org.apache.commons.codec.language.MatchRatingApproachEncoder.removeAccents(MatchRatingApproachEncoder.java:91)
	at org.apache.commons.codec.language.MatchRatingApproachEncoder.cleanName(MatchRatingApproachEncoder.java:21)
	at org.apache.commons.codec.language.MatchRatingApproachEncoder.isEncodeEquals(MatchRatingApproachEncoder.java:48)
	at org.apache.commons.codec.language.MatchRatingApproachEncoderTest.testCompare_ShortNames_AL_ED_WorksButNoMatch(MatchRatingApproachEncoderTest.java:315)

testAccentRemoval_ComprehensiveAccentMix_AllSuccessfullyRemoved(org.apache.commons.codec.language.MatchRatingApproachEncoderTest)  Time elapsed: 0 sec  <<< ERROR!
java.lang.StringIndexOutOfBoundsException: String index out of range: -1
	at java.lang.String.charAt(String.java:658)
	at org.apache.commons.codec.language.MatchRatingApproachEncoder.removeAccents(MatchRatingApproachEncoder.java:91)
	at org.apache.commons.codec.language.MatchRatingApproachEncoderTest.testAccentRemoval_ComprehensiveAccentMix_AllSuccessfullyRemoved(MatchRatingApproachEncoderTest.java:66)

testCompare_SMITH_SMYTH_SuccessfullyMatched(org.apache.commons.codec.language.MatchRatingApproachEncoderTest)  Time elapsed: 0 sec  <<< ERROR!
java.lang.StringIndexOutOfBoundsException: String index out of range: -1
	at java.lang.String.charAt(String.java:658)
	at org.apache.commons.codec.language.MatchRatingApproachEncoder.removeAccents(MatchRatingApproachEncoder.java:91)
	at org.apache.commons.codec.language.MatchRatingApproachEncoder.cleanName(MatchRatingApproachEncoder.java:21)
	at org.apache.commons.codec.language.MatchRatingApproachEncoder.isEncodeEquals(MatchRatingApproachEncoder.java:48)
	at org.apache.commons.codec.language.MatchRatingApproachEncoderTest.testCompare_SMITH_SMYTH_SuccessfullyMatched(MatchRatingApproachEncoderTest.java:305)

testGetEncoding_HARPER_HRPR(org.apache.commons.codec.language.MatchRatingApproachEncoderTest)  Time elapsed: 0.001 sec  <<< ERROR!
java.lang.StringIndexOutOfBoundsException: String index out of range: -1
	at java.lang.String.charAt(String.java:658)
	at org.apache.commons.codec.language.MatchRatingApproachEncoder.removeAccents(MatchRatingApproachEncoder.java:91)
	at org.apache.commons.codec.language.MatchRatingApproachEncoder.cleanName(MatchRatingApproachEncoder.java:21)
	at org.apache.commons.codec.language.MatchRatingApproachEncoder.encode(MatchRatingApproachEncoder.java:27)
	at org.apache.commons.codec.language.MatchRatingApproachEncoderTest.testGetEncoding_HARPER_HRPR(MatchRatingApproachEncoderTest.java:256)

testCompare_STEPHEN_STEFAN_SuccessfullyMatched(org.apache.commons.codec.language.MatchRatingApproachEncoderTest)  Time elapsed: 0 sec  <<< ERROR!
java.lang.StringIndexOutOfBoundsException: String index out of range: -1
	at java.lang.String.charAt(String.java:658)
	at org.apache.commons.codec.language.MatchRatingApproachEncoder.removeAccents(MatchRatingApproachEncoder.java:91)
	at org.apache.commons.codec.language.MatchRatingApproachEncoder.cleanName(MatchRatingApproachEncoder.java:21)
	at org.apache.commons.codec.language.MatchRatingApproachEncoder.isEncodeEquals(MatchRatingApproachEncoder.java:48)
	at org.apache.commons.codec.language.MatchRatingApproachEncoderTest.testCompare_STEPHEN_STEFAN_SuccessfullyMatched(MatchRatingApproachEncoderTest.java:350)

testCompare_MICKY_MICHAEL_SuccessfullyMatched(org.apache.commons.codec.language.MatchRatingApproachEncoderTest)  Time elapsed: 0.001 sec  <<< ERROR!
java.lang.StringIndexOutOfBoundsException: String index out of range: -1
	at java.lang.String.charAt(String.java:658)
	at org.apache.commons.codec.language.MatchRatingApproachEncoder.removeAccents(MatchRatingApproachEncoder.java:91)
	at org.apache.commons.codec.language.MatchRatingApproachEncoder.cleanName(MatchRatingApproachEncoder.java:21)
	at org.apache.commons.codec.language.MatchRatingApproachEncoder.isEncodeEquals(MatchRatingApproachEncoder.java:48)
	at org.apache.commons.codec.language.MatchRatingApproachEncoderTest.testCompare_MICKY_MICHAEL_SuccessfullyMatched(MatchRatingApproachEncoderTest.java:360)

testAccentRemoval_GerSpanFrenMix_SuccessfullyRemoved(org.apache.commons.codec.language.MatchRatingApproachEncoderTest)  Time elapsed: 0 sec  <<< ERROR!
java.lang.StringIndexOutOfBoundsException: String index out of range: -1
	at java.lang.String.charAt(String.java:658)
	at org.apache.commons.codec.language.MatchRatingApproachEncoder.removeAccents(MatchRatingApproachEncoder.java:91)
	at org.apache.commons.codec.language.MatchRatingApproachEncoderTest.testAccentRemoval_GerSpanFrenMix_SuccessfullyRemoved(MatchRatingApproachEncoderTest.java:61)

testCompare_Surname_COOPERFLYNN_SUPERLYN_SuccessfullyMatched(org.apache.commons.codec.language.MatchRatingApproachEncoderTest)  Time elapsed: 0 sec  <<< ERROR!
java.lang.StringIndexOutOfBoundsException: String index out of range: -1
	at java.lang.String.charAt(String.java:658)
	at org.apache.commons.codec.language.MatchRatingApproachEncoder.removeAccents(MatchRatingApproachEncoder.java:91)
	at org.apache.commons.codec.language.MatchRatingApproachEncoder.cleanName(MatchRatingApproachEncoder.java:21)
	at org.apache.commons.codec.language.MatchRatingApproachEncoder.isEncodeEquals(MatchRatingApproachEncoder.java:48)
	at org.apache.commons.codec.language.MatchRatingApproachEncoderTest.testCompare_Surname_COOPERFLYNN_SUPERLYN_SuccessfullyMatched(MatchRatingApproachEncoderTest.java:427)

testCompare_Surname_PRZEMYSL_PSHEMESHIL_SuccessfullyMatched(org.apache.commons.codec.language.MatchRatingApproachEncoderTest)  Time elapsed: 0 sec  <<< ERROR!
java.lang.StringIndexOutOfBoundsException: String index out of range: -1
	at java.lang.String.charAt(String.java:658)
	at org.apache.commons.codec.language.MatchRatingApproachEncoder.removeAccents(MatchRatingApproachEncoder.java:91)
	at org.apache.commons.codec.language.MatchRatingApproachEncoder.cleanName(MatchRatingApproachEncoder.java:21)
	at org.apache.commons.codec.language.MatchRatingApproachEncoder.isEncodeEquals(MatchRatingApproachEncoder.java:48)
	at org.apache.commons.codec.language.MatchRatingApproachEncoderTest.testCompare_Surname_PRZEMYSL_PSHEMESHIL_SuccessfullyMatched(MatchRatingApproachEncoderTest.java:469)

testCompare_BURNS_BOURNE_SuccessfullyMatched(org.apache.commons.codec.language.MatchRatingApproachEncoderTest)  Time elapsed: 0.001 sec  <<< ERROR!
java.lang.StringIndexOutOfBoundsException: String index out of range: -1
	at java.lang.String.charAt(String.java:658)
	at org.apache.commons.codec.language.MatchRatingApproachEncoder.removeAccents(MatchRatingApproachEncoder.java:91)
	at org.apache.commons.codec.language.MatchRatingApproachEncoder.cleanName(MatchRatingApproachEncoder.java:21)
	at org.apache.commons.codec.language.MatchRatingApproachEncoder.isEncodeEquals(MatchRatingApproachEncoder.java:48)
	at org.apache.commons.codec.language.MatchRatingApproachEncoderTest.testCompare_BURNS_BOURNE_SuccessfullyMatched(MatchRatingApproachEncoderTest.java:310)

testAccentRemovalNormalString_NoChange(org.apache.commons.codec.language.MatchRatingApproachEncoderTest)  Time elapsed: 0 sec  <<< ERROR!
java.lang.StringIndexOutOfBoundsException: String index out of range: -1
	at java.lang.String.charAt(String.java:658)
	at org.apache.commons.codec.language.MatchRatingApproachEncoder.removeAccents(MatchRatingApproachEncoder.java:91)
	at org.apache.commons.codec.language.MatchRatingApproachEncoderTest.testAccentRemovalNormalString_NoChange(MatchRatingApproachEncoderTest.java:72)

testCompare_SmallInput_CARK_Kl_SuccessfullyMatched(org.apache.commons.codec.language.MatchRatingApproachEncoderTest)  Time elapsed: 0.001 sec  <<< ERROR!
java.lang.StringIndexOutOfBoundsException: String index out of range: -1
	at java.lang.String.charAt(String.java:658)
	at org.apache.commons.codec.language.MatchRatingApproachEncoder.removeAccents(MatchRatingApproachEncoder.java:91)
	at org.apache.commons.codec.language.MatchRatingApproachEncoder.cleanName(MatchRatingApproachEncoder.java:21)
	at org.apache.commons.codec.language.MatchRatingApproachEncoder.isEncodeEquals(MatchRatingApproachEncoder.java:48)
	at org.apache.commons.codec.language.MatchRatingApproachEncoderTest.testCompare_SmallInput_CARK_Kl_SuccessfullyMatched(MatchRatingApproachEncoderTest.java:385)

testCompare_PETERSON_PETERS_SuccessfullyMatched(org.apache.commons.codec.language.MatchRatingApproachEncoderTest)  Time elapsed: 0 sec  <<< ERROR!
java.lang.StringIndexOutOfBoundsException: String index out of range: -1
	at java.lang.String.charAt(String.java:658)
	at org.apache.commons.codec.language.MatchRatingApproachEncoder.removeAccents(MatchRatingApproachEncoder.java:91)
	at org.apache.commons.codec.language.MatchRatingApproachEncoder.cleanName(MatchRatingApproachEncoder.java:21)
	at org.apache.commons.codec.language.MatchRatingApproachEncoder.isEncodeEquals(MatchRatingApproachEncoder.java:48)
	at org.apache.commons.codec.language.MatchRatingApproachEncoderTest.testCompare_PETERSON_PETERS_SuccessfullyMatched(MatchRatingApproachEncoderTest.java:476)

testCompare_Surname_ROSOCHOWACIEC_ROSOKHOVATSETS_SuccessfullyMatched(org.apache.commons.codec.language.MatchRatingApproachEncoderTest)  Time elapsed: 0.001 sec  <<< ERROR!
java.lang.StringIndexOutOfBoundsException: String index out of range: -1
	at java.lang.String.charAt(String.java:658)
	at org.apache.commons.codec.language.MatchRatingApproachEncoder.removeAccents(MatchRatingApproachEncoder.java:91)
	at org.apache.commons.codec.language.MatchRatingApproachEncoder.cleanName(MatchRatingApproachEncoder.java:21)
	at org.apache.commons.codec.language.MatchRatingApproachEncoder.isEncodeEquals(MatchRatingApproachEncoder.java:48)
	at org.apache.commons.codec.language.MatchRatingApproachEncoderTest.testCompare_Surname_ROSOCHOWACIEC_ROSOKHOVATSETS_SuccessfullyMatched(MatchRatingApproachEncoderTest.java:464)

testCompare_Surname_AUERBACH_UHRBACH_SuccessfullyMatched(org.apache.commons.codec.language.MatchRatingApproachEncoderTest)  Time elapsed: 0 sec  <<< ERROR!
java.lang.StringIndexOutOfBoundsException: String index out of range: -1
	at java.lang.String.charAt(String.java:658)
	at org.apache.commons.codec.language.MatchRatingApproachEncoder.removeAccents(MatchRatingApproachEncoder.java:91)
	at org.apache.commons.codec.language.MatchRatingApproachEncoder.cleanName(MatchRatingApproachEncoder.java:21)
	at org.apache.commons.codec.language.MatchRatingApproachEncoder.isEncodeEquals(MatchRatingApproachEncoder.java:48)
	at org.apache.commons.codec.language.MatchRatingApproachEncoderTest.testCompare_Surname_AUERBACH_UHRBACH_SuccessfullyMatched(MatchRatingApproachEncoderTest.java:439)

testCompare_LongSurnames_OMUIRCHEARTAIGH_OMIREADHAIGH_SuccessfulMatch(org.apache.commons.codec.language.MatchRatingApproachEncoderTest)  Time elapsed: 0 sec  <<< ERROR!
java.lang.StringIndexOutOfBoundsException: String index out of range: -1
	at java.lang.String.charAt(String.java:658)
	at org.apache.commons.codec.language.MatchRatingApproachEncoder.removeAccents(MatchRatingApproachEncoder.java:91)
	at org.apache.commons.codec.language.MatchRatingApproachEncoder.cleanName(MatchRatingApproachEncoder.java:21)
	at org.apache.commons.codec.language.MatchRatingApproachEncoder.isEncodeEquals(MatchRatingApproachEncoder.java:48)
	at org.apache.commons.codec.language.MatchRatingApproachEncoderTest.testCompare_LongSurnames_OMUIRCHEARTAIGH_OMIREADHAIGH_SuccessfulMatch(MatchRatingApproachEncoderTest.java:422)

testCompare_Forenames_UNA_OONAGH_ShouldSuccessfullyMatchButDoesNot(org.apache.commons.codec.language.MatchRatingApproachEncoderTest)  Time elapsed: 0 sec  <<< ERROR!
java.lang.StringIndexOutOfBoundsException: String index out of range: -1
	at java.lang.String.charAt(String.java:658)
	at org.apache.commons.codec.language.MatchRatingApproachEncoder.removeAccents(MatchRatingApproachEncoder.java:91)
	at org.apache.commons.codec.language.MatchRatingApproachEncoder.cleanName(MatchRatingApproachEncoder.java:21)
	at org.apache.commons.codec.language.MatchRatingApproachEncoder.isEncodeEquals(MatchRatingApproachEncoder.java:48)
	at org.apache.commons.codec.language.MatchRatingApproachEncoderTest.testCompare_Forenames_UNA_OONAGH_ShouldSuccessfullyMatchButDoesNot(MatchRatingApproachEncoderTest.java:405)

testCompare_STEVEN_STEFAN_SuccessfullyMatched(org.apache.commons.codec.language.MatchRatingApproachEncoderTest)  Time elapsed: 0 sec  <<< ERROR!
java.lang.StringIndexOutOfBoundsException: String index out of range: -1
	at java.lang.String.charAt(String.java:658)
	at org.apache.commons.codec.language.MatchRatingApproachEncoder.removeAccents(MatchRatingApproachEncoder.java:91)
	at org.apache.commons.codec.language.MatchRatingApproachEncoder.cleanName(MatchRatingApproachEncoder.java:21)
	at org.apache.commons.codec.language.MatchRatingApproachEncoder.isEncodeEquals(MatchRatingApproachEncoder.java:48)
	at org.apache.commons.codec.language.MatchRatingApproachEncoderTest.testCompare_STEVEN_STEFAN_SuccessfullyMatched(MatchRatingApproachEncoderTest.java:345)

testAccentRemoval_UpperandLower_SuccessfullyRemovedAndCaseInvariant(org.apache.commons.codec.language.MatchRatingApproachEncoderTest)  Time elapsed: 0 sec  <<< ERROR!
java.lang.StringIndexOutOfBoundsException: String index out of range: -1
	at java.lang.String.charAt(String.java:658)
	at org.apache.commons.codec.language.MatchRatingApproachEncoder.removeAccents(MatchRatingApproachEncoder.java:91)
	at org.apache.commons.codec.language.MatchRatingApproachEncoderTest.testAccentRemoval_UpperandLower_SuccessfullyRemovedAndCaseInvariant(MatchRatingApproachEncoderTest.java:51)

testcleanName_SuccessfullyClean(org.apache.commons.codec.language.MatchRatingApproachEncoderTest)  Time elapsed: 0 sec  <<< ERROR!
java.lang.StringIndexOutOfBoundsException: String index out of range: -1
	at java.lang.String.charAt(String.java:658)
	at org.apache.commons.codec.language.MatchRatingApproachEncoder.removeAccents(MatchRatingApproachEncoder.java:91)
	at org.apache.commons.codec.language.MatchRatingApproachEncoder.cleanName(MatchRatingApproachEncoder.java:21)
	at org.apache.commons.codec.language.MatchRatingApproachEncoderTest.testcleanName_SuccessfullyClean(MatchRatingApproachEncoderTest.java:202)

testCompare_Forenames_SEAN_PETE_NoMatchExpected(org.apache.commons.codec.language.MatchRatingApproachEncoderTest)  Time elapsed: 0.001 sec  <<< ERROR!
java.lang.StringIndexOutOfBoundsException: String index out of range: -1
	at java.lang.String.charAt(String.java:658)
	at org.apache.commons.codec.language.MatchRatingApproachEncoder.removeAccents(MatchRatingApproachEncoder.java:91)
	at org.apache.commons.codec.language.MatchRatingApproachEncoder.cleanName(MatchRatingApproachEncoder.java:21)
	at org.apache.commons.codec.language.MatchRatingApproachEncoder.isEncodeEquals(MatchRatingApproachEncoder.java:48)
	at org.apache.commons.codec.language.MatchRatingApproachEncoderTest.testCompare_Forenames_SEAN_PETE_NoMatchExpected(MatchRatingApproachEncoderTest.java:511)

testCompare_COLM_COLIN_WithAccentsAndSymbolsAndSpaces_SuccessfullyMatched(org.apache.commons.codec.language.MatchRatingApproachEncoderTest)  Time elapsed: 0 sec  <<< ERROR!
java.lang.StringIndexOutOfBoundsException: String index out of range: -1
	at java.lang.String.charAt(String.java:658)
	at org.apache.commons.codec.language.MatchRatingApproachEncoder.removeAccents(MatchRatingApproachEncoder.java:91)
	at org.apache.commons.codec.language.MatchRatingApproachEncoder.cleanName(MatchRatingApproachEncoder.java:21)
	at org.apache.commons.codec.language.MatchRatingApproachEncoder.isEncodeEquals(MatchRatingApproachEncoder.java:48)
	at org.apache.commons.codec.language.MatchRatingApproachEncoderTest.testCompare_COLM_COLIN_WithAccentsAndSymbolsAndSpaces_SuccessfullyMatched(MatchRatingApproachEncoderTest.java:335)

testCompare_LongSurnames_MORIARTY_OMUIRCHEARTAIGH_DoesNotSuccessfulMatch(org.apache.commons.codec.language.MatchRatingApproachEncoderTest)  Time elapsed: 0.001 sec  <<< ERROR!
java.lang.StringIndexOutOfBoundsException: String index out of range: -1
	at java.lang.String.charAt(String.java:658)
	at org.apache.commons.codec.language.MatchRatingApproachEncoder.removeAccents(MatchRatingApproachEncoder.java:91)
	at org.apache.commons.codec.language.MatchRatingApproachEncoder.cleanName(MatchRatingApproachEncoder.java:21)
	at org.apache.commons.codec.language.MatchRatingApproachEncoder.isEncodeEquals(MatchRatingApproachEncoder.java:48)
	at org.apache.commons.codec.language.MatchRatingApproachEncoderTest.testCompare_LongSurnames_MORIARTY_OMUIRCHEARTAIGH_DoesNotSuccessfulMatch(MatchRatingApproachEncoderTest.java:417)

testCompare_Surname_OSULLIVAN_OSUILLEABHAIN_SuccessfulMatch(org.apache.commons.codec.language.MatchRatingApproachEncoderTest)  Time elapsed: 0 sec  <<< ERROR!
java.lang.StringIndexOutOfBoundsException: String index out of range: -1
	at java.lang.String.charAt(String.java:658)
	at org.apache.commons.codec.language.MatchRatingApproachEncoder.removeAccents(MatchRatingApproachEncoder.java:91)
	at org.apache.commons.codec.language.MatchRatingApproachEncoder.cleanName(MatchRatingApproachEncoder.java:21)
	at org.apache.commons.codec.language.MatchRatingApproachEncoder.isEncodeEquals(MatchRatingApproachEncoder.java:48)
	at org.apache.commons.codec.language.MatchRatingApproachEncoderTest.testCompare_Surname_OSULLIVAN_OSUILLEABHAIN_SuccessfulMatch(MatchRatingApproachEncoderTest.java:412)

testCompare_Surnames_MURPHY_LYNCH_NoMatchExpected(org.apache.commons.codec.language.MatchRatingApproachEncoderTest)  Time elapsed: 0.001 sec  <<< ERROR!
java.lang.StringIndexOutOfBoundsException: String index out of range: -1
	at java.lang.String.charAt(String.java:658)
	at org.apache.commons.codec.language.MatchRatingApproachEncoder.removeAccents(MatchRatingApproachEncoder.java:91)
	at org.apache.commons.codec.language.MatchRatingApproachEncoder.cleanName(MatchRatingApproachEncoder.java:21)
	at org.apache.commons.codec.language.MatchRatingApproachEncoder.isEncodeEquals(MatchRatingApproachEncoder.java:48)
	at org.apache.commons.codec.language.MatchRatingApproachEncoderTest.testCompare_Surnames_MURPHY_LYNCH_NoMatchExpected(MatchRatingApproachEncoderTest.java:501)

testCompare_SEAN_SHAUN_SuccessfullyMatched(org.apache.commons.codec.language.MatchRatingApproachEncoderTest)  Time elapsed: 0 sec  <<< ERROR!
java.lang.StringIndexOutOfBoundsException: String index out of range: -1
	at java.lang.String.charAt(String.java:658)
	at org.apache.commons.codec.language.MatchRatingApproachEncoder.removeAccents(MatchRatingApproachEncoder.java:91)
	at org.apache.commons.codec.language.MatchRatingApproachEncoder.cleanName(MatchRatingApproachEncoder.java:21)
	at org.apache.commons.codec.language.MatchRatingApproachEncoder.isEncodeEquals(MatchRatingApproachEncoder.java:48)
	at org.apache.commons.codec.language.MatchRatingApproachEncoderTest.testCompare_SEAN_SHAUN_SuccessfullyMatched(MatchRatingApproachEncoderTest.java:330)

testCompare_FRANCISZEK_FRANCES_SuccessfullyMatched(org.apache.commons.codec.language.MatchRatingApproachEncoderTest)  Time elapsed: 0.001 sec  <<< ERROR!
java.lang.StringIndexOutOfBoundsException: String index out of range: -1
	at java.lang.String.charAt(String.java:658)
	at org.apache.commons.codec.language.MatchRatingApproachEncoder.removeAccents(MatchRatingApproachEncoder.java:91)
	at org.apache.commons.codec.language.MatchRatingApproachEncoder.cleanName(MatchRatingApproachEncoder.java:21)
	at org.apache.commons.codec.language.MatchRatingApproachEncoder.isEncodeEquals(MatchRatingApproachEncoder.java:48)
	at org.apache.commons.codec.language.MatchRatingApproachEncoderTest.testCompare_FRANCISZEK_FRANCES_SuccessfullyMatched(MatchRatingApproachEncoderTest.java:375)

testGetEncoding_SMYTH_to_SMYTH(org.apache.commons.codec.language.MatchRatingApproachEncoderTest)  Time elapsed: 0 sec  <<< ERROR!
java.lang.StringIndexOutOfBoundsException: String index out of range: -1
	at java.lang.String.charAt(String.java:658)
	at org.apache.commons.codec.language.MatchRatingApproachEncoder.removeAccents(MatchRatingApproachEncoder.java:91)
	at org.apache.commons.codec.language.MatchRatingApproachEncoder.cleanName(MatchRatingApproachEncoder.java:21)
	at org.apache.commons.codec.language.MatchRatingApproachEncoder.encode(MatchRatingApproachEncoder.java:27)
	at org.apache.commons.codec.language.MatchRatingApproachEncoderTest.testGetEncoding_SMYTH_to_SMYTH(MatchRatingApproachEncoderTest.java:266)

testAccentRemoval_AllLower_SuccessfullyRemoved(org.apache.commons.codec.language.MatchRatingApproachEncoderTest)  Time elapsed: 0.001 sec  <<< ERROR!
java.lang.StringIndexOutOfBoundsException: String index out of range: -1
	at java.lang.String.charAt(String.java:658)
	at org.apache.commons.codec.language.MatchRatingApproachEncoder.removeAccents(MatchRatingApproachEncoder.java:91)
	at org.apache.commons.codec.language.MatchRatingApproachEncoderTest.testAccentRemoval_AllLower_SuccessfullyRemoved(MatchRatingApproachEncoderTest.java:41)

testGetEncoding_SMITH_to_SMTH(org.apache.commons.codec.language.MatchRatingApproachEncoderTest)  Time elapsed: 0 sec  <<< ERROR!
java.lang.StringIndexOutOfBoundsException: String index out of range: -1
	at java.lang.String.charAt(String.java:658)
	at org.apache.commons.codec.language.MatchRatingApproachEncoder.removeAccents(MatchRatingApproachEncoder.java:91)
	at org.apache.commons.codec.language.MatchRatingApproachEncoder.cleanName(MatchRatingApproachEncoder.java:21)
	at org.apache.commons.codec.language.MatchRatingApproachEncoder.encode(MatchRatingApproachEncoder.java:27)
	at org.apache.commons.codec.language.MatchRatingApproachEncoderTest.testGetEncoding_SMITH_to_SMTH(MatchRatingApproachEncoderTest.java:261)

testAccentRemoval_WithSpaces_SuccessfullyRemovedAndSpacesInvariant(org.apache.commons.codec.language.MatchRatingApproachEncoderTest)  Time elapsed: 0 sec  <<< ERROR!
java.lang.StringIndexOutOfBoundsException: String index out of range: -1
	at java.lang.String.charAt(String.java:658)
	at org.apache.commons.codec.language.MatchRatingApproachEncoder.removeAccents(MatchRatingApproachEncoder.java:91)
	at org.apache.commons.codec.language.MatchRatingApproachEncoderTest.testAccentRemoval_WithSpaces_SuccessfullyRemovedAndSpacesInvariant(MatchRatingApproachEncoderTest.java:46)

testCompare_Surname_LEWINSKY_LEVINSKI_SuccessfullyMatched(org.apache.commons.codec.language.MatchRatingApproachEncoderTest)  Time elapsed: 0.001 sec  <<< ERROR!
java.lang.StringIndexOutOfBoundsException: String index out of range: -1
	at java.lang.String.charAt(String.java:658)
	at org.apache.commons.codec.language.MatchRatingApproachEncoder.removeAccents(MatchRatingApproachEncoder.java:91)
	at org.apache.commons.codec.language.MatchRatingApproachEncoder.cleanName(MatchRatingApproachEncoder.java:21)
	at org.apache.commons.codec.language.MatchRatingApproachEncoder.isEncodeEquals(MatchRatingApproachEncoder.java:48)
	at org.apache.commons.codec.language.MatchRatingApproachEncoderTest.testCompare_Surname_LEWINSKY_LEVINSKI_SuccessfullyMatched(MatchRatingApproachEncoderTest.java:454)

testCompare_BRIAN_BRYAN_SuccessfullyMatched(org.apache.commons.codec.language.MatchRatingApproachEncoderTest)  Time elapsed: 0 sec  <<< ERROR!
java.lang.StringIndexOutOfBoundsException: String index out of range: -1
	at java.lang.String.charAt(String.java:658)
	at org.apache.commons.codec.language.MatchRatingApproachEncoder.removeAccents(MatchRatingApproachEncoder.java:91)
	at org.apache.commons.codec.language.MatchRatingApproachEncoder.cleanName(MatchRatingApproachEncoder.java:21)
	at org.apache.commons.codec.language.MatchRatingApproachEncoder.isEncodeEquals(MatchRatingApproachEncoder.java:48)
	at org.apache.commons.codec.language.MatchRatingApproachEncoderTest.testCompare_BRIAN_BRYAN_SuccessfullyMatched(MatchRatingApproachEncoderTest.java:325)

Running org.apache.commons.codec.language.ColognePhoneticTest
Tests run: 13, Failures: 0, Errors: 0, Skipped: 0, Time elapsed: 0 sec - in org.apache.commons.codec.language.ColognePhoneticTest
Running org.apache.commons.codec.language.DoubleMetaphone2Test
Tests run: 6, Failures: 0, Errors: 0, Skipped: 0, Time elapsed: 0.034 sec - in org.apache.commons.codec.language.DoubleMetaphone2Test
Running org.apache.commons.codec.language.MetaphoneTest
Tests run: 34, Failures: 0, Errors: 0, Skipped: 0, Time elapsed: 0.105 sec - in org.apache.commons.codec.language.MetaphoneTest
Running org.apache.commons.codec.CharEncodingTest
Tests run: 7, Failures: 0, Errors: 0, Skipped: 0, Time elapsed: 0 sec - in org.apache.commons.codec.CharEncodingTest

Results :

Tests in error: 
  MatchRatingApproachEncoderTest.testCompare_SOPHIE_SOFIA_SuccessfullyMatched:370 » StringIndexOutOfBounds
  MatchRatingApproachEncoderTest.testCompare_SAM_SAMUEL_SuccessfullyMatched:355 » StringIndexOutOfBounds
  MatchRatingApproachEncoderTest.testCompare_STEPHEN_STEVEN_SuccessfullyMatched:340 » StringIndexOutOfBounds
  MatchRatingApproachEncoderTest.testCompare_Surname_MOSKOWITZ_MOSKOVITZ_SuccessfullyMatched:444 » StringIndexOutOfBounds
  MatchRatingApproachEncoderTest.testCompare_OONA_OONAGH_SuccessfullyMatched:365 » StringIndexOutOfBounds
  MatchRatingApproachEncoderTest.testCompare_Forenames_SEAN_JOHN_MatchExpected:506 » StringIndexOutOfBounds
  MatchRatingApproachEncoderTest.testCompare_Surname_HAILEY_HALLEY_SuccessfullyMatched:432 » StringIndexOutOfBounds
  MatchRatingApproachEncoderTest.testCompare_TOMASZ_TOM_SuccessfullyMatched:380 » StringIndexOutOfBounds
  MatchRatingApproachEncoderTest.testCompare_KARL_ALESSANDRO_DoesNotMatch:400 » StringIndexOutOfBounds
  MatchRatingApproachEncoderTest.testCompare_Surname_LIPSHITZ_LIPPSZYC_SuccessfullyMatched:449 » StringIndexOutOfBounds
  MatchRatingApproachEncoderTest.testCompare_CATHERINE_KATHRYN_SuccessfullyMatched:320 » StringIndexOutOfBounds
  MatchRatingApproachEncoderTest.testAccentRemoval_MixedWithUnusualChars_SuccessfullyRemovedAndUnusualcharactersInvariant:56 » StringIndexOutOfBounds
  MatchRatingApproachEncoderTest.testCompare_ZACH_ZAKARIA_SuccessfullyMatched:395 » StringIndexOutOfBounds
  MatchRatingApproachEncoderTest.testCompare_MCGOWAN_MCGEOGHEGAN_SuccessfullyMatched:481 » StringIndexOutOfBounds
  MatchRatingApproachEncoderTest.testCompare_Surname_SZLAMAWICZ_SHLAMOVITZ_SuccessfullyMatched:459 » StringIndexOutOfBounds
  MatchRatingApproachEncoderTest.testCompare_ShortNames_AL_ED_WorksButNoMatch:315 » StringIndexOutOfBounds
  MatchRatingApproachEncoderTest.testAccentRemoval_ComprehensiveAccentMix_AllSuccessfullyRemoved:66 » StringIndexOutOfBounds
  MatchRatingApproachEncoderTest.testCompare_SMITH_SMYTH_SuccessfullyMatched:305 » StringIndexOutOfBounds
  MatchRatingApproachEncoderTest.testGetEncoding_HARPER_HRPR:256 » StringIndexOutOfBounds
  MatchRatingApproachEncoderTest.testCompare_STEPHEN_STEFAN_SuccessfullyMatched:350 » StringIndexOutOfBounds
  MatchRatingApproachEncoderTest.testCompare_MICKY_MICHAEL_SuccessfullyMatched:360 » StringIndexOutOfBounds
  MatchRatingApproachEncoderTest.testAccentRemoval_GerSpanFrenMix_SuccessfullyRemoved:61 » StringIndexOutOfBounds
  MatchRatingApproachEncoderTest.testCompare_Surname_COOPERFLYNN_SUPERLYN_SuccessfullyMatched:427 » StringIndexOutOfBounds
  MatchRatingApproachEncoderTest.testCompare_Surname_PRZEMYSL_PSHEMESHIL_SuccessfullyMatched:469 » StringIndexOutOfBounds
  MatchRatingApproachEncoderTest.testCompare_BURNS_BOURNE_SuccessfullyMatched:310 » StringIndexOutOfBounds
  MatchRatingApproachEncoderTest.testAccentRemovalNormalString_NoChange:72 » StringIndexOutOfBounds
  MatchRatingApproachEncoderTest.testCompare_SmallInput_CARK_Kl_SuccessfullyMatched:385 » StringIndexOutOfBounds
  MatchRatingApproachEncoderTest.testCompare_PETERSON_PETERS_SuccessfullyMatched:476 » StringIndexOutOfBounds
  MatchRatingApproachEncoderTest.testCompare_Surname_ROSOCHOWACIEC_ROSOKHOVATSETS_SuccessfullyMatched:464 » StringIndexOutOfBounds
  MatchRatingApproachEncoderTest.testCompare_Surname_AUERBACH_UHRBACH_SuccessfullyMatched:439 » StringIndexOutOfBounds
  MatchRatingApproachEncoderTest.testCompare_LongSurnames_OMUIRCHEARTAIGH_OMIREADHAIGH_SuccessfulMatch:422 » StringIndexOutOfBounds
  MatchRatingApproachEncoderTest.testCompare_Forenames_UNA_OONAGH_ShouldSuccessfullyMatchButDoesNot:405 » StringIndexOutOfBounds
  MatchRatingApproachEncoderTest.testCompare_STEVEN_STEFAN_SuccessfullyMatched:345 » StringIndexOutOfBounds
  MatchRatingApproachEncoderTest.testAccentRemoval_UpperandLower_SuccessfullyRemovedAndCaseInvariant:51 » StringIndexOutOfBounds
  MatchRatingApproachEncoderTest.testcleanName_SuccessfullyClean:202 » StringIndexOutOfBounds
  MatchRatingApproachEncoderTest.testCompare_Forenames_SEAN_PETE_NoMatchExpected:511 » StringIndexOutOfBounds
  MatchRatingApproachEncoderTest.testCompare_COLM_COLIN_WithAccentsAndSymbolsAndSpaces_SuccessfullyMatched:335 » StringIndexOutOfBounds
  MatchRatingApproachEncoderTest.testCompare_LongSurnames_MORIARTY_OMUIRCHEARTAIGH_DoesNotSuccessfulMatch:417 » StringIndexOutOfBounds
  MatchRatingApproachEncoderTest.testCompare_Surname_OSULLIVAN_OSUILLEABHAIN_SuccessfulMatch:412 » StringIndexOutOfBounds
  MatchRatingApproachEncoderTest.testCompare_Surnames_MURPHY_LYNCH_NoMatchExpected:501 » StringIndexOutOfBounds
  MatchRatingApproachEncoderTest.testCompare_SEAN_SHAUN_SuccessfullyMatched:330 » StringIndexOutOfBounds
  MatchRatingApproachEncoderTest.testCompare_FRANCISZEK_FRANCES_SuccessfullyMatched:375 » StringIndexOutOfBounds
  MatchRatingApproachEncoderTest.testGetEncoding_SMYTH_to_SMYTH:266 » StringIndexOutOfBounds
  MatchRatingApproachEncoderTest.testAccentRemoval_AllLower_SuccessfullyRemoved:41 » StringIndexOutOfBounds
  MatchRatingApproachEncoderTest.testGetEncoding_SMITH_to_SMTH:261 » StringIndexOutOfBounds
  MatchRatingApproachEncoderTest.testAccentRemoval_WithSpaces_SuccessfullyRemovedAndSpacesInvariant:46 » StringIndexOutOfBounds
  MatchRatingApproachEncoderTest.testCompare_Surname_LEWINSKY_LEVINSKI_SuccessfullyMatched:454 » StringIndexOutOfBounds
  MatchRatingApproachEncoderTest.testCompare_BRIAN_BRYAN_SuccessfullyMatched:325 » StringIndexOutOfBounds

Tests run: 662, Failures: 0, Errors: 48, Skipped: 1

[INFO] ------------------------------------------------------------------------
[INFO] BUILD FAILURE
[INFO] ------------------------------------------------------------------------
[INFO] Total time: 14.291s
[INFO] Finished at: Sun Aug 02 11:55:57 BST 2015
[INFO] Final Memory: 20M/287M
[INFO] ------------------------------------------------------------------------
[ERROR] Failed to execute goal org.apache.maven.plugins:maven-surefire-plugin:2.17:test (default-test) on project commons-codec: There are test failures.
[ERROR] 
[ERROR] Please refer to /home/perham/Study/LittleDarwin/Cases/commons-codec-1.10-src/target/surefire-reports for the individual test results.
[ERROR] -> [Help 1]
[ERROR] 
[ERROR] To see the full stack trace of the errors, re-run Maven with the -e switch.
[ERROR] Re-run Maven using the -X switch to enable full debug logging.
[ERROR] 
[ERROR] For more information about the errors and possible solutions, please read the following articles:
[ERROR] [Help 1] http://cwiki.apache.org/confluence/display/MAVEN/MojoFailureException
