[INFO] Scanning for projects...
[INFO]                                                                         
[INFO] ------------------------------------------------------------------------
[INFO] Building Apache Commons Codec 1.10
[INFO] ------------------------------------------------------------------------
[INFO] 
[INFO] --- maven-enforcer-plugin:1.3.1:enforce (enforce-maven-3) @ commons-codec ---
[INFO] 
[INFO] --- maven-antrun-plugin:1.7:run (javadoc.resources) @ commons-codec ---
[INFO] Executing tasks

main:
[INFO] Executed tasks
[INFO] 
[INFO] --- maven-remote-resources-plugin:1.5:process (default) @ commons-codec ---
[INFO] 
[INFO] --- buildnumber-maven-plugin:1.3:create (default) @ commons-codec ---
[INFO] Executing: /bin/sh -c cd /home/perham/Study/LittleDarwin/Cases/commons-codec-1.10-src && svn --non-interactive info
[INFO] Working directory: /home/perham/Study/LittleDarwin/Cases/commons-codec-1.10-src
[INFO] Storing buildNumber: ?????? at timestamp: 1438510207945
[INFO] Executing: /bin/sh -c cd /home/perham/Study/LittleDarwin/Cases/commons-codec-1.10-src && svn --non-interactive info
[INFO] Working directory: /home/perham/Study/LittleDarwin/Cases/commons-codec-1.10-src
[INFO] Storing buildScmBranch: UNKNOWN_BRANCH
[INFO] 
[INFO] --- maven-resources-plugin:2.7:resources (default-resources) @ commons-codec ---
[INFO] Using 'UTF-8' encoding to copy filtered resources.
[INFO] Copying 128 resources
[INFO] Copying 2 resources to META-INF
[INFO] 
[INFO] --- maven-compiler-plugin:3.2:compile (default-compile) @ commons-codec ---
[INFO] Changes detected - recompiling the module!
[INFO] Compiling 60 source files to /home/perham/Study/LittleDarwin/Cases/commons-codec-1.10-src/target/classes
[INFO] /home/perham/Study/LittleDarwin/Cases/commons-codec-1.10-src/src/main/java/org/apache/commons/codec/digest/Sha2Crypt.java: Some input files use or override a deprecated API.
[INFO] /home/perham/Study/LittleDarwin/Cases/commons-codec-1.10-src/src/main/java/org/apache/commons/codec/digest/Sha2Crypt.java: Recompile with -Xlint:deprecation for details.
[INFO] 
[INFO] --- maven-bundle-plugin:2.5.3:manifest (bundle-manifest) @ commons-codec ---
[INFO] 
[INFO] --- maven-resources-plugin:2.7:testResources (default-testResources) @ commons-codec ---
[INFO] Using 'UTF-8' encoding to copy filtered resources.
[INFO] skip non existing resourceDirectory /home/perham/Study/LittleDarwin/Cases/commons-codec-1.10-src/src/test/resources
[INFO] Copying 2 resources to META-INF
[INFO] 
[INFO] --- maven-compiler-plugin:3.2:testCompile (default-testCompile) @ commons-codec ---
[INFO] Nothing to compile - all classes are up to date
[INFO] 
[INFO] --- maven-surefire-plugin:2.17:test (default-test) @ commons-codec ---
[INFO] Surefire report directory: /home/perham/Study/LittleDarwin/Cases/commons-codec-1.10-src/target/surefire-reports

-------------------------------------------------------
 T E S T S
-------------------------------------------------------
Running org.apache.commons.codec.digest.B64Test
Tests run: 2, Failures: 0, Errors: 0, Skipped: 0, Time elapsed: 0.025 sec - in org.apache.commons.codec.digest.B64Test
Running org.apache.commons.codec.digest.DigestUtilsTest
Tests run: 17, Failures: 0, Errors: 0, Skipped: 0, Time elapsed: 0.668 sec - in org.apache.commons.codec.digest.DigestUtilsTest
Running org.apache.commons.codec.digest.Sha512CryptTest
Tests run: 8, Failures: 0, Errors: 0, Skipped: 0, Time elapsed: 0.526 sec - in org.apache.commons.codec.digest.Sha512CryptTest
Running org.apache.commons.codec.digest.Apr1CryptTest
Tests run: 8, Failures: 0, Errors: 0, Skipped: 0, Time elapsed: 0.078 sec - in org.apache.commons.codec.digest.Apr1CryptTest
Running org.apache.commons.codec.digest.HmacUtilsTest
Tests run: 24, Failures: 0, Errors: 0, Skipped: 0, Time elapsed: 0.048 sec - in org.apache.commons.codec.digest.HmacUtilsTest
Running org.apache.commons.codec.digest.Sha2CryptTest
Tests run: 1, Failures: 0, Errors: 0, Skipped: 0, Time elapsed: 0 sec - in org.apache.commons.codec.digest.Sha2CryptTest
Running org.apache.commons.codec.digest.CryptTest
Tests run: 4, Failures: 0, Errors: 0, Skipped: 0, Time elapsed: 0.113 sec - in org.apache.commons.codec.digest.CryptTest
Running org.apache.commons.codec.digest.Sha256CryptTest
Tests run: 7, Failures: 0, Errors: 0, Skipped: 0, Time elapsed: 0.103 sec - in org.apache.commons.codec.digest.Sha256CryptTest
Running org.apache.commons.codec.digest.Md5CryptTest
Tests run: 7, Failures: 0, Errors: 0, Skipped: 0, Time elapsed: 0.018 sec - in org.apache.commons.codec.digest.Md5CryptTest
Running org.apache.commons.codec.digest.UnixCryptTest
Tests run: 9, Failures: 0, Errors: 0, Skipped: 0, Time elapsed: 0.009 sec - in org.apache.commons.codec.digest.UnixCryptTest
Running org.apache.commons.codec.CharsetsTest
Tests run: 7, Failures: 0, Errors: 0, Skipped: 0, Time elapsed: 0.001 sec - in org.apache.commons.codec.CharsetsTest
Running org.apache.commons.codec.binary.Base32Test
Tests run: 8, Failures: 0, Errors: 0, Skipped: 0, Time elapsed: 0.006 sec - in org.apache.commons.codec.binary.Base32Test
Running org.apache.commons.codec.binary.Base64OutputStreamTest
Tests run: 7, Failures: 0, Errors: 0, Skipped: 0, Time elapsed: 0.2 sec - in org.apache.commons.codec.binary.Base64OutputStreamTest
Running org.apache.commons.codec.binary.Base64Codec13Test
Tests run: 8, Failures: 0, Errors: 0, Skipped: 0, Time elapsed: 0.01 sec - in org.apache.commons.codec.binary.Base64Codec13Test
Running org.apache.commons.codec.binary.Base64InputStreamTest
Tests run: 19, Failures: 0, Errors: 0, Skipped: 0, Time elapsed: 0.099 sec - in org.apache.commons.codec.binary.Base64InputStreamTest
Running org.apache.commons.codec.binary.Base32InputStreamTest
Tests run: 16, Failures: 0, Errors: 0, Skipped: 0, Time elapsed: 0.123 sec - in org.apache.commons.codec.binary.Base32InputStreamTest
Running org.apache.commons.codec.binary.Base32OutputStreamTest
Tests run: 6, Failures: 0, Errors: 0, Skipped: 0, Time elapsed: 0.079 sec - in org.apache.commons.codec.binary.Base32OutputStreamTest
Running org.apache.commons.codec.binary.BinaryCodecTest
Tests run: 13, Failures: 0, Errors: 0, Skipped: 0, Time elapsed: 0.011 sec - in org.apache.commons.codec.binary.BinaryCodecTest
Running org.apache.commons.codec.binary.BaseNCodecTest
Tests run: 7, Failures: 0, Errors: 0, Skipped: 0, Time elapsed: 0.002 sec - in org.apache.commons.codec.binary.BaseNCodecTest
Running org.apache.commons.codec.binary.StringUtilsTest
Tests run: 17, Failures: 0, Errors: 0, Skipped: 0, Time elapsed: 0.029 sec - in org.apache.commons.codec.binary.StringUtilsTest
Running org.apache.commons.codec.binary.Base64Test
Tests run: 53, Failures: 0, Errors: 0, Skipped: 1, Time elapsed: 0.047 sec - in org.apache.commons.codec.binary.Base64Test
Running org.apache.commons.codec.binary.HexTest
Tests run: 19, Failures: 0, Errors: 0, Skipped: 0, Time elapsed: 0.184 sec - in org.apache.commons.codec.binary.HexTest
Running org.apache.commons.codec.DecoderExceptionTest
Tests run: 4, Failures: 0, Errors: 0, Skipped: 0, Time elapsed: 0.001 sec - in org.apache.commons.codec.DecoderExceptionTest
Running org.apache.commons.codec.EncoderExceptionTest
Tests run: 4, Failures: 0, Errors: 0, Skipped: 0, Time elapsed: 0 sec - in org.apache.commons.codec.EncoderExceptionTest
Running org.apache.commons.codec.net.BCodecTest
Tests run: 9, Failures: 0, Errors: 0, Skipped: 0, Time elapsed: 0.005 sec - in org.apache.commons.codec.net.BCodecTest
Running org.apache.commons.codec.net.QCodecTest
Tests run: 12, Failures: 0, Errors: 0, Skipped: 0, Time elapsed: 0.007 sec - in org.apache.commons.codec.net.QCodecTest
Running org.apache.commons.codec.net.UtilsTest
Tests run: 1, Failures: 0, Errors: 0, Skipped: 0, Time elapsed: 0 sec - in org.apache.commons.codec.net.UtilsTest
Running org.apache.commons.codec.net.RFC1522CodecTest
Tests run: 2, Failures: 0, Errors: 0, Skipped: 0, Time elapsed: 0.001 sec - in org.apache.commons.codec.net.RFC1522CodecTest
Running org.apache.commons.codec.net.URLCodecTest
Tests run: 16, Failures: 0, Errors: 0, Skipped: 0, Time elapsed: 0.008 sec - in org.apache.commons.codec.net.URLCodecTest
Running org.apache.commons.codec.net.QuotedPrintableCodecTest
Tests run: 21, Failures: 0, Errors: 0, Skipped: 0, Time elapsed: 0.011 sec - in org.apache.commons.codec.net.QuotedPrintableCodecTest
Running org.apache.commons.codec.StringEncoderComparatorTest
Tests run: 3, Failures: 0, Errors: 1, Skipped: 0, Time elapsed: 0.013 sec <<< FAILURE! - in org.apache.commons.codec.StringEncoderComparatorTest
testComparatorWithDoubleMetaphone(org.apache.commons.codec.StringEncoderComparatorTest)  Time elapsed: 0.012 sec  <<< ERROR!
java.lang.StringIndexOutOfBoundsException: String index out of range: -1
	at java.lang.String.substring(String.java:1904)
	at org.apache.commons.codec.language.DoubleMetaphone.contains(DoubleMetaphone.java:279)
	at org.apache.commons.codec.language.DoubleMetaphone.handleS(DoubleMetaphone.java:195)
	at org.apache.commons.codec.language.DoubleMetaphone.doubleMetaphone(DoubleMetaphone.java:67)
	at org.apache.commons.codec.language.DoubleMetaphone.doubleMetaphone(DoubleMetaphone.java:19)
	at org.apache.commons.codec.language.DoubleMetaphone.encode(DoubleMetaphone.java:84)
	at org.apache.commons.codec.StringEncoderComparator.compare(StringEncoderComparator.java:82)
	at java.util.TimSort.countRunAndMakeAscending(TimSort.java:324)
	at java.util.TimSort.sort(TimSort.java:189)
	at java.util.TimSort.sort(TimSort.java:173)
	at java.util.Arrays.sort(Arrays.java:659)
	at java.util.Collections.sort(Collections.java:217)
	at org.apache.commons.codec.StringEncoderComparatorTest.testComparatorWithDoubleMetaphone(StringEncoderComparatorTest.java:57)

Running org.apache.commons.codec.language.Caverphone1Test
Tests run: 9, Failures: 0, Errors: 0, Skipped: 0, Time elapsed: 0.027 sec - in org.apache.commons.codec.language.Caverphone1Test
Running org.apache.commons.codec.language.NysiisTest
Tests run: 23, Failures: 0, Errors: 0, Skipped: 0, Time elapsed: 0.016 sec - in org.apache.commons.codec.language.NysiisTest
Running org.apache.commons.codec.language.Caverphone2Test
Tests run: 13, Failures: 0, Errors: 0, Skipped: 0, Time elapsed: 0.135 sec - in org.apache.commons.codec.language.Caverphone2Test
Running org.apache.commons.codec.language.DaitchMokotoffSoundexTest
Tests run: 13, Failures: 0, Errors: 0, Skipped: 0, Time elapsed: 0.045 sec - in org.apache.commons.codec.language.DaitchMokotoffSoundexTest
Running org.apache.commons.codec.language.bm.BeiderMorseEncoderTest
Tests run: 22, Failures: 0, Errors: 0, Skipped: 0, Time elapsed: 3.087 sec - in org.apache.commons.codec.language.bm.BeiderMorseEncoderTest
Running org.apache.commons.codec.language.bm.PhoneticEngineTest
Tests run: 8, Failures: 0, Errors: 0, Skipped: 0, Time elapsed: 0.02 sec - in org.apache.commons.codec.language.bm.PhoneticEngineTest
Running org.apache.commons.codec.language.bm.PhoneticEngineRegressionTest
Tests run: 4, Failures: 0, Errors: 0, Skipped: 0, Time elapsed: 0.015 sec - in org.apache.commons.codec.language.bm.PhoneticEngineRegressionTest
Running org.apache.commons.codec.language.bm.RuleTest
Tests run: 3, Failures: 0, Errors: 0, Skipped: 0, Time elapsed: 0.002 sec - in org.apache.commons.codec.language.bm.RuleTest
Running org.apache.commons.codec.language.bm.LanguageGuessingTest
Tests run: 18, Failures: 0, Errors: 0, Skipped: 0, Time elapsed: 0.02 sec - in org.apache.commons.codec.language.bm.LanguageGuessingTest
Running org.apache.commons.codec.language.DoubleMetaphoneTest
Tests run: 16, Failures: 0, Errors: 7, Skipped: 0, Time elapsed: 0.003 sec <<< FAILURE! - in org.apache.commons.codec.language.DoubleMetaphoneTest
testSetMaxCodeLength(org.apache.commons.codec.language.DoubleMetaphoneTest)  Time elapsed: 0 sec  <<< ERROR!
java.lang.StringIndexOutOfBoundsException: String index out of range: 7
	at java.lang.String.substring(String.java:1907)
	at org.apache.commons.codec.language.DoubleMetaphone.contains(DoubleMetaphone.java:279)
	at org.apache.commons.codec.language.DoubleMetaphone.handleD(DoubleMetaphone.java:128)
	at org.apache.commons.codec.language.DoubleMetaphone.doubleMetaphone(DoubleMetaphone.java:35)
	at org.apache.commons.codec.language.DoubleMetaphoneTest.testSetMaxCodeLength(DoubleMetaphoneTest.java:1231)

testIsDoubleMetaphoneEqualBasic(org.apache.commons.codec.language.DoubleMetaphoneTest)  Time elapsed: 0 sec  <<< ERROR!
java.lang.StringIndexOutOfBoundsException: String index out of range: 6
	at java.lang.String.substring(String.java:1907)
	at org.apache.commons.codec.language.DoubleMetaphone.contains(DoubleMetaphone.java:279)
	at org.apache.commons.codec.language.DoubleMetaphone.handleC(DoubleMetaphone.java:94)
	at org.apache.commons.codec.language.DoubleMetaphone.doubleMetaphone(DoubleMetaphone.java:33)
	at org.apache.commons.codec.language.DoubleMetaphone.isDoubleMetaphoneEqual(DoubleMetaphone.java:87)
	at org.apache.commons.codec.language.DoubleMetaphoneTest.doubleMetaphoneEqualTest(DoubleMetaphoneTest.java:1039)
	at org.apache.commons.codec.language.DoubleMetaphoneTest.testIsDoubleMetaphoneEqualBasic(DoubleMetaphoneTest.java:1136)

testCCedilla(org.apache.commons.codec.language.DoubleMetaphoneTest)  Time elapsed: 0 sec  <<< ERROR!
java.lang.StringIndexOutOfBoundsException: String index out of range: 5
	at java.lang.String.substring(String.java:1907)
	at org.apache.commons.codec.language.DoubleMetaphone.contains(DoubleMetaphone.java:279)
	at org.apache.commons.codec.language.DoubleMetaphone.handleS(DoubleMetaphone.java:196)
	at org.apache.commons.codec.language.DoubleMetaphone.doubleMetaphone(DoubleMetaphone.java:67)
	at org.apache.commons.codec.language.DoubleMetaphone.isDoubleMetaphoneEqual(DoubleMetaphone.java:87)
	at org.apache.commons.codec.language.DoubleMetaphone.isDoubleMetaphoneEqual(DoubleMetaphone.java:86)
	at org.apache.commons.codec.language.DoubleMetaphoneTest.testCCedilla(DoubleMetaphoneTest.java:1060)

testIsDoubleMetaphoneEqualExtended3(org.apache.commons.codec.language.DoubleMetaphoneTest)  Time elapsed: 0 sec  <<< ERROR!
java.lang.StringIndexOutOfBoundsException: String index out of range: 7
	at java.lang.String.substring(String.java:1907)
	at org.apache.commons.codec.language.DoubleMetaphone.contains(DoubleMetaphone.java:279)
	at org.apache.commons.codec.language.DoubleMetaphone.conditionC0(DoubleMetaphone.java:250)
	at org.apache.commons.codec.language.DoubleMetaphone.handleC(DoubleMetaphone.java:92)
	at org.apache.commons.codec.language.DoubleMetaphone.doubleMetaphone(DoubleMetaphone.java:33)
	at org.apache.commons.codec.language.DoubleMetaphone.isDoubleMetaphoneEqual(DoubleMetaphone.java:87)
	at org.apache.commons.codec.language.DoubleMetaphoneTest.testIsDoubleMetaphoneEqualExtended3(DoubleMetaphoneTest.java:1174)

testIsDoubleMetaphoneEqualWithMATCHES(org.apache.commons.codec.language.DoubleMetaphoneTest)  Time elapsed: 0 sec  <<< ERROR!
java.lang.StringIndexOutOfBoundsException: String index out of range: -1
	at java.lang.String.substring(String.java:1904)
	at org.apache.commons.codec.language.DoubleMetaphone.contains(DoubleMetaphone.java:279)
	at org.apache.commons.codec.language.DoubleMetaphone.conditionM0(DoubleMetaphone.java:265)
	at org.apache.commons.codec.language.DoubleMetaphone.doubleMetaphone(DoubleMetaphone.java:52)
	at org.apache.commons.codec.language.DoubleMetaphone.isDoubleMetaphoneEqual(DoubleMetaphone.java:87)
	at org.apache.commons.codec.language.DoubleMetaphoneTest.testIsDoubleMetaphoneEqualWithMATCHES(DoubleMetaphoneTest.java:1201)

testDoubleMetaphone(org.apache.commons.codec.language.DoubleMetaphoneTest)  Time elapsed: 0 sec  <<< ERROR!
java.lang.StringIndexOutOfBoundsException: String index out of range: 4
	at java.lang.String.substring(String.java:1907)
	at org.apache.commons.codec.language.DoubleMetaphone.contains(DoubleMetaphone.java:279)
	at org.apache.commons.codec.language.DoubleMetaphone.handleT(DoubleMetaphone.java:218)
	at org.apache.commons.codec.language.DoubleMetaphone.doubleMetaphone(DoubleMetaphone.java:69)
	at org.apache.commons.codec.language.DoubleMetaphone.doubleMetaphone(DoubleMetaphone.java:19)
	at org.apache.commons.codec.language.DoubleMetaphone.encode(DoubleMetaphone.java:85)
	at org.apache.commons.codec.language.DoubleMetaphoneTest.assertDoubleMetaphone(DoubleMetaphoneTest.java:1011)
	at org.apache.commons.codec.language.DoubleMetaphoneTest.testDoubleMetaphone(DoubleMetaphoneTest.java:1076)

testIsDoubleMetaphoneNotEqual(org.apache.commons.codec.language.DoubleMetaphoneTest)  Time elapsed: 0.001 sec  <<< ERROR!
java.lang.StringIndexOutOfBoundsException: String index out of range: 5
	at java.lang.String.substring(String.java:1907)
	at org.apache.commons.codec.language.DoubleMetaphone.contains(DoubleMetaphone.java:279)
	at org.apache.commons.codec.language.DoubleMetaphone.handleD(DoubleMetaphone.java:128)
	at org.apache.commons.codec.language.DoubleMetaphone.doubleMetaphone(DoubleMetaphone.java:35)
	at org.apache.commons.codec.language.DoubleMetaphone.isDoubleMetaphoneEqual(DoubleMetaphone.java:87)
	at org.apache.commons.codec.language.DoubleMetaphoneTest.doubleMetaphoneNotEqualTest(DoubleMetaphoneTest.java:1049)
	at org.apache.commons.codec.language.DoubleMetaphoneTest.testIsDoubleMetaphoneNotEqual(DoubleMetaphoneTest.java:1211)

Running org.apache.commons.codec.language.SoundexTest
Tests run: 28, Failures: 0, Errors: 0, Skipped: 0, Time elapsed: 0.007 sec - in org.apache.commons.codec.language.SoundexTest
Running org.apache.commons.codec.language.RefinedSoundexTest
Tests run: 10, Failures: 0, Errors: 0, Skipped: 0, Time elapsed: 0.002 sec - in org.apache.commons.codec.language.RefinedSoundexTest
Running org.apache.commons.codec.language.MatchRatingApproachEncoderTest
Tests run: 96, Failures: 0, Errors: 0, Skipped: 0, Time elapsed: 0.028 sec - in org.apache.commons.codec.language.MatchRatingApproachEncoderTest
Running org.apache.commons.codec.language.ColognePhoneticTest
Tests run: 13, Failures: 0, Errors: 0, Skipped: 0, Time elapsed: 0.003 sec - in org.apache.commons.codec.language.ColognePhoneticTest
Running org.apache.commons.codec.language.DoubleMetaphone2Test
Tests run: 6, Failures: 0, Errors: 2, Skipped: 0, Time elapsed: 0.002 sec <<< FAILURE! - in org.apache.commons.codec.language.DoubleMetaphone2Test
testDoubleMetaphonePrimary(org.apache.commons.codec.language.DoubleMetaphone2Test)  Time elapsed: 0 sec  <<< ERROR!
java.lang.StringIndexOutOfBoundsException: String index out of range: 9
	at java.lang.String.substring(String.java:1907)
	at org.apache.commons.codec.language.DoubleMetaphone.contains(DoubleMetaphone.java:279)
	at org.apache.commons.codec.language.DoubleMetaphone.handleT(DoubleMetaphone.java:218)
	at org.apache.commons.codec.language.DoubleMetaphone.doubleMetaphone(DoubleMetaphone.java:69)
	at org.apache.commons.codec.language.DoubleMetaphone2Test.checkDoubleMetaphone(DoubleMetaphone2Test.java:1267)
	at org.apache.commons.codec.language.DoubleMetaphone2Test.testDoubleMetaphonePrimary(DoubleMetaphone2Test.java:1289)

testDoubleMetaphoneAlternate(org.apache.commons.codec.language.DoubleMetaphone2Test)  Time elapsed: 0 sec  <<< ERROR!
java.lang.StringIndexOutOfBoundsException: String index out of range: 9
	at java.lang.String.substring(String.java:1907)
	at org.apache.commons.codec.language.DoubleMetaphone.contains(DoubleMetaphone.java:279)
	at org.apache.commons.codec.language.DoubleMetaphone.handleT(DoubleMetaphone.java:218)
	at org.apache.commons.codec.language.DoubleMetaphone.doubleMetaphone(DoubleMetaphone.java:69)
	at org.apache.commons.codec.language.DoubleMetaphone2Test.checkDoubleMetaphone(DoubleMetaphone2Test.java:1267)
	at org.apache.commons.codec.language.DoubleMetaphone2Test.testDoubleMetaphoneAlternate(DoubleMetaphone2Test.java:1281)

Running org.apache.commons.codec.language.MetaphoneTest
Tests run: 34, Failures: 0, Errors: 0, Skipped: 0, Time elapsed: 0.084 sec - in org.apache.commons.codec.language.MetaphoneTest
Running org.apache.commons.codec.CharEncodingTest
Tests run: 7, Failures: 0, Errors: 0, Skipped: 0, Time elapsed: 0 sec - in org.apache.commons.codec.CharEncodingTest

Results :

Tests in error: 
  StringEncoderComparatorTest.testComparatorWithDoubleMetaphone:57 » StringIndexOutOfBounds
  DoubleMetaphoneTest.testSetMaxCodeLength:1231 » StringIndexOutOfBounds String ...
  DoubleMetaphoneTest.testIsDoubleMetaphoneEqualBasic:1136->doubleMetaphoneEqualTest:1039 » StringIndexOutOfBounds
  DoubleMetaphoneTest.testCCedilla:1060 » StringIndexOutOfBounds String index ou...
  DoubleMetaphoneTest.testIsDoubleMetaphoneEqualExtended3:1174 » StringIndexOutOfBounds
  DoubleMetaphoneTest.testIsDoubleMetaphoneEqualWithMATCHES:1201 » StringIndexOutOfBounds
  DoubleMetaphoneTest.testDoubleMetaphone:1076->assertDoubleMetaphone:1011 » StringIndexOutOfBounds
  DoubleMetaphoneTest.testIsDoubleMetaphoneNotEqual:1211->doubleMetaphoneNotEqualTest:1049 » StringIndexOutOfBounds
  DoubleMetaphone2Test.testDoubleMetaphonePrimary:1289->checkDoubleMetaphone:1267 » StringIndexOutOfBounds
  DoubleMetaphone2Test.testDoubleMetaphoneAlternate:1281->checkDoubleMetaphone:1267 » StringIndexOutOfBounds

Tests run: 662, Failures: 0, Errors: 10, Skipped: 1

[INFO] ------------------------------------------------------------------------
[INFO] BUILD FAILURE
[INFO] ------------------------------------------------------------------------
[INFO] Total time: 13.692s
[INFO] Finished at: Sun Aug 02 11:10:18 BST 2015
[INFO] Final Memory: 22M/344M
[INFO] ------------------------------------------------------------------------
[ERROR] Failed to execute goal org.apache.maven.plugins:maven-surefire-plugin:2.17:test (default-test) on project commons-codec: There are test failures.
[ERROR] 
[ERROR] Please refer to /home/perham/Study/LittleDarwin/Cases/commons-codec-1.10-src/target/surefire-reports for the individual test results.
[ERROR] -> [Help 1]
[ERROR] 
[ERROR] To see the full stack trace of the errors, re-run Maven with the -e switch.
[ERROR] Re-run Maven using the -X switch to enable full debug logging.
[ERROR] 
[ERROR] For more information about the errors and possible solutions, please read the following articles:
[ERROR] [Help 1] http://cwiki.apache.org/confluence/display/MAVEN/MojoFailureException
