[INFO] Scanning for projects...
[INFO]                                                                         
[INFO] ------------------------------------------------------------------------
[INFO] Building Apache Commons Codec 1.10
[INFO] ------------------------------------------------------------------------
[INFO] 
[INFO] --- maven-enforcer-plugin:1.3.1:enforce (enforce-maven-3) @ commons-codec ---
[INFO] 
[INFO] --- maven-antrun-plugin:1.7:run (javadoc.resources) @ commons-codec ---
[INFO] Executing tasks

main:
[INFO] Executed tasks
[INFO] 
[INFO] --- maven-remote-resources-plugin:1.5:process (default) @ commons-codec ---
[INFO] 
[INFO] --- buildnumber-maven-plugin:1.3:create (default) @ commons-codec ---
[INFO] Executing: /bin/sh -c cd /home/perham/Study/LittleDarwin/Cases/commons-codec-1.10-src && svn --non-interactive info
[INFO] Working directory: /home/perham/Study/LittleDarwin/Cases/commons-codec-1.10-src
[INFO] Storing buildNumber: ?????? at timestamp: 1438500473014
[INFO] Executing: /bin/sh -c cd /home/perham/Study/LittleDarwin/Cases/commons-codec-1.10-src && svn --non-interactive info
[INFO] Working directory: /home/perham/Study/LittleDarwin/Cases/commons-codec-1.10-src
[INFO] Storing buildScmBranch: UNKNOWN_BRANCH
[INFO] 
[INFO] --- maven-resources-plugin:2.7:resources (default-resources) @ commons-codec ---
[INFO] Using 'UTF-8' encoding to copy filtered resources.
[INFO] Copying 128 resources
[INFO] Copying 2 resources to META-INF
[INFO] 
[INFO] --- maven-compiler-plugin:3.2:compile (default-compile) @ commons-codec ---
[INFO] Changes detected - recompiling the module!
[INFO] Compiling 60 source files to /home/perham/Study/LittleDarwin/Cases/commons-codec-1.10-src/target/classes
[INFO] /home/perham/Study/LittleDarwin/Cases/commons-codec-1.10-src/src/main/java/org/apache/commons/codec/digest/Sha2Crypt.java: Some input files use or override a deprecated API.
[INFO] /home/perham/Study/LittleDarwin/Cases/commons-codec-1.10-src/src/main/java/org/apache/commons/codec/digest/Sha2Crypt.java: Recompile with -Xlint:deprecation for details.
[INFO] 
[INFO] --- maven-bundle-plugin:2.5.3:manifest (bundle-manifest) @ commons-codec ---
[INFO] 
[INFO] --- maven-resources-plugin:2.7:testResources (default-testResources) @ commons-codec ---
[INFO] Using 'UTF-8' encoding to copy filtered resources.
[INFO] skip non existing resourceDirectory /home/perham/Study/LittleDarwin/Cases/commons-codec-1.10-src/src/test/resources
[INFO] Copying 2 resources to META-INF
[INFO] 
[INFO] --- maven-compiler-plugin:3.2:testCompile (default-testCompile) @ commons-codec ---
[INFO] Nothing to compile - all classes are up to date
[INFO] 
[INFO] --- maven-surefire-plugin:2.17:test (default-test) @ commons-codec ---
[INFO] Surefire report directory: /home/perham/Study/LittleDarwin/Cases/commons-codec-1.10-src/target/surefire-reports

-------------------------------------------------------
 T E S T S
-------------------------------------------------------
Running org.apache.commons.codec.digest.B64Test
Tests run: 2, Failures: 0, Errors: 0, Skipped: 0, Time elapsed: 0.024 sec - in org.apache.commons.codec.digest.B64Test
Running org.apache.commons.codec.digest.DigestUtilsTest
Tests run: 17, Failures: 0, Errors: 0, Skipped: 0, Time elapsed: 0.643 sec - in org.apache.commons.codec.digest.DigestUtilsTest
Running org.apache.commons.codec.digest.Sha512CryptTest
Tests run: 8, Failures: 4, Errors: 0, Skipped: 0, Time elapsed: 26.439 sec <<< FAILURE! - in org.apache.commons.codec.digest.Sha512CryptTest
testSha2CryptRounds(org.apache.commons.codec.digest.Sha512CryptTest)  Time elapsed: 0.028 sec  <<< FAILURE!
org.junit.ComparisonFailure: expected:<$5$rounds=1000$abcd$[b8MCU4GEeZIekOy5ahQ8EWfT330hvYGVeDYkBxXBva].> but was:<$5$rounds=1000$abcd$[VduuhARml/YP2P5MEvmM.qaQhim8AVggQoePNmtVTA].>
	at org.junit.Assert.assertEquals(Assert.java:115)
	at org.junit.Assert.assertEquals(Assert.java:144)
	at org.apache.commons.codec.digest.Sha512CryptTest.testSha2CryptRounds(Sha512CryptTest.java:73)

testSha256LargetThanBlocksize(org.apache.commons.codec.digest.Sha512CryptTest)  Time elapsed: 0.129 sec  <<< FAILURE!
org.junit.ComparisonFailure: expected:<$6$abc$[oP/h8PRhCKIA66KSTjGwNsQMSLLZnuFOTjOhrqNrDkKgjTlpePSqibB0qtmDapMbP/zN1cUEYSeHFrpgqZ.GG1]> but was:<$6$abc$[HCrjqFfS2UWe4ubQZjankJ.feOezN5Wj4P8OwpXy4CP.nGqRhSfaCzvONVoTwFBwqnkD0ioZuu5YVO3So4/Jd.]>
	at org.junit.Assert.assertEquals(Assert.java:115)
	at org.junit.Assert.assertEquals(Assert.java:144)
	at org.apache.commons.codec.digest.Sha512CryptTest.testSha256LargetThanBlocksize(Sha512CryptTest.java:92)

testSha512CryptBytes(org.apache.commons.codec.digest.Sha512CryptTest)  Time elapsed: 12.998 sec  <<< FAILURE!
org.junit.ComparisonFailure: expected:<$6$./$[fKtWqslQkwI8ZxjdWoeS.jHHrte97bZxiwB5gwCRHX6LG62fUhT6Bb5MRrjWvieh0C/gxh8ItFuTsVy80VrED1]> but was:<$6$./$[De6mtk2BCw3cO.BIobZb45Z1n0DVviSTmDUa/UPzWnL0Fb2WFrY/..pttjeY2t1EqRMf.QeBYeyF37POMvUzy0]>
	at org.junit.Assert.assertEquals(Assert.java:115)
	at org.junit.Assert.assertEquals(Assert.java:144)
	at org.apache.commons.codec.digest.Sha512CryptTest.testSha512CryptBytes(Sha512CryptTest.java:48)

testSha512CryptStrings(org.apache.commons.codec.digest.Sha512CryptTest)  Time elapsed: 13.257 sec  <<< FAILURE!
org.junit.ComparisonFailure: expected:<$6$45678$[f2en/Y053Knir/wu/T8DQKSbiUGcPcbXKsmyVlP820dIpXoY0KlqgUqRVFfavdRXwDMUZYsxPOymA4zgX0qE5.]> but was:<$6$45678$[9EHEbwQLqvjmGZGPUiZrAcNrI95sP1F2XsSDhW8f1TTMIDmdRkK1PUoX2lorDltg.VFed71z2zpoBKxgSqh150]>
	at org.junit.Assert.assertEquals(Assert.java:115)
	at org.junit.Assert.assertEquals(Assert.java:144)
	at org.apache.commons.codec.digest.Sha512CryptTest.testSha512CryptStrings(Sha512CryptTest.java:35)

Running org.apache.commons.codec.digest.Apr1CryptTest
Tests run: 8, Failures: 0, Errors: 0, Skipped: 0, Time elapsed: 0.084 sec - in org.apache.commons.codec.digest.Apr1CryptTest
Running org.apache.commons.codec.digest.HmacUtilsTest
Tests run: 24, Failures: 0, Errors: 0, Skipped: 0, Time elapsed: 0.043 sec - in org.apache.commons.codec.digest.HmacUtilsTest
Running org.apache.commons.codec.digest.Sha2CryptTest
Tests run: 1, Failures: 0, Errors: 0, Skipped: 0, Time elapsed: 0 sec - in org.apache.commons.codec.digest.Sha2CryptTest
Running org.apache.commons.codec.digest.CryptTest
Tests run: 4, Failures: 0, Errors: 0, Skipped: 0, Time elapsed: 0.101 sec - in org.apache.commons.codec.digest.CryptTest
Running org.apache.commons.codec.digest.Sha256CryptTest
