[INFO] Scanning for projects...
[INFO]                                                                         
[INFO] ------------------------------------------------------------------------
[INFO] Building Apache Commons Codec 1.10
[INFO] ------------------------------------------------------------------------
[INFO] 
[INFO] --- maven-enforcer-plugin:1.3.1:enforce (enforce-maven-3) @ commons-codec ---
[INFO] 
[INFO] --- maven-antrun-plugin:1.7:run (javadoc.resources) @ commons-codec ---
[INFO] Executing tasks

main:
[INFO] Executed tasks
[INFO] 
[INFO] --- maven-remote-resources-plugin:1.5:process (default) @ commons-codec ---
[INFO] 
[INFO] --- buildnumber-maven-plugin:1.3:create (default) @ commons-codec ---
[INFO] Executing: /bin/sh -c cd /home/perham/Study/LittleDarwin/Cases/commons-codec-1.10-src && svn --non-interactive info
[INFO] Working directory: /home/perham/Study/LittleDarwin/Cases/commons-codec-1.10-src
[INFO] Storing buildNumber: ?????? at timestamp: 1438500332383
[INFO] Executing: /bin/sh -c cd /home/perham/Study/LittleDarwin/Cases/commons-codec-1.10-src && svn --non-interactive info
[INFO] Working directory: /home/perham/Study/LittleDarwin/Cases/commons-codec-1.10-src
[INFO] Storing buildScmBranch: UNKNOWN_BRANCH
[INFO] 
[INFO] --- maven-resources-plugin:2.7:resources (default-resources) @ commons-codec ---
[INFO] Using 'UTF-8' encoding to copy filtered resources.
[INFO] Copying 128 resources
[INFO] Copying 2 resources to META-INF
[INFO] 
[INFO] --- maven-compiler-plugin:3.2:compile (default-compile) @ commons-codec ---
[INFO] Changes detected - recompiling the module!
[INFO] Compiling 60 source files to /home/perham/Study/LittleDarwin/Cases/commons-codec-1.10-src/target/classes
[INFO] /home/perham/Study/LittleDarwin/Cases/commons-codec-1.10-src/src/main/java/org/apache/commons/codec/digest/Sha2Crypt.java: Some input files use or override a deprecated API.
[INFO] /home/perham/Study/LittleDarwin/Cases/commons-codec-1.10-src/src/main/java/org/apache/commons/codec/digest/Sha2Crypt.java: Recompile with -Xlint:deprecation for details.
[INFO] 
[INFO] --- maven-bundle-plugin:2.5.3:manifest (bundle-manifest) @ commons-codec ---
[INFO] 
[INFO] --- maven-resources-plugin:2.7:testResources (default-testResources) @ commons-codec ---
[INFO] Using 'UTF-8' encoding to copy filtered resources.
[INFO] skip non existing resourceDirectory /home/perham/Study/LittleDarwin/Cases/commons-codec-1.10-src/src/test/resources
[INFO] Copying 2 resources to META-INF
[INFO] 
[INFO] --- maven-compiler-plugin:3.2:testCompile (default-testCompile) @ commons-codec ---
[INFO] Nothing to compile - all classes are up to date
[INFO] 
[INFO] --- maven-surefire-plugin:2.17:test (default-test) @ commons-codec ---
[INFO] Surefire report directory: /home/perham/Study/LittleDarwin/Cases/commons-codec-1.10-src/target/surefire-reports

-------------------------------------------------------
 T E S T S
-------------------------------------------------------
Running org.apache.commons.codec.digest.B64Test
Tests run: 2, Failures: 0, Errors: 0, Skipped: 0, Time elapsed: 0.025 sec - in org.apache.commons.codec.digest.B64Test
Running org.apache.commons.codec.digest.DigestUtilsTest
Tests run: 17, Failures: 0, Errors: 0, Skipped: 0, Time elapsed: 0.677 sec - in org.apache.commons.codec.digest.DigestUtilsTest
Running org.apache.commons.codec.digest.Sha512CryptTest
Tests run: 8, Failures: 3, Errors: 1, Skipped: 0, Time elapsed: 0.368 sec <<< FAILURE! - in org.apache.commons.codec.digest.Sha512CryptTest
testSha2CryptRounds(org.apache.commons.codec.digest.Sha512CryptTest)  Time elapsed: 0.033 sec  <<< ERROR!
java.lang.ArrayIndexOutOfBoundsException: 42
	at org.apache.commons.codec.digest.Sha2Crypt.sha2Crypt(Sha2Crypt.java:103)
	at org.apache.commons.codec.digest.Sha2Crypt.sha256Crypt(Sha2Crypt.java:26)
	at org.apache.commons.codec.digest.Sha512CryptTest.testSha2CryptRounds(Sha512CryptTest.java:73)

testSha256LargetThanBlocksize(org.apache.commons.codec.digest.Sha512CryptTest)  Time elapsed: 0.125 sec  <<< FAILURE!
org.junit.ComparisonFailure: expected:<$6$abc$[oP/h8PRhCKIA66KSTjGwNsQMSLLZnuFOTjOhrqNrDkKgjTlpePSqibB0qtmDapMbP/zN1cUEYSeHFrpgqZ.GG1]> but was:<$6$abc$[7w.hLcg33JPqCuSSiwhMC5TbNgJZ8APRfaaHT5RrR49]>
	at org.junit.Assert.assertEquals(Assert.java:115)
	at org.junit.Assert.assertEquals(Assert.java:144)
	at org.apache.commons.codec.digest.Sha512CryptTest.testSha256LargetThanBlocksize(Sha512CryptTest.java:92)

testSha512CryptBytes(org.apache.commons.codec.digest.Sha512CryptTest)  Time elapsed: 0.093 sec  <<< FAILURE!
org.junit.ComparisonFailure: expected:<$6$foo$[Nywkte7LPWjaJhWjNeGJN.dFdY3pN1wYlGifyRLYOVlGS9EMSiZaDDe/BGSOYQ327q9.32I4UqQ5odsqvsBLX/]> but was:<$6$foo$[Sfpk0YvnsnZaPygjYbt8EK32NY6p/ZRKYDN5lGLYrh2]>
	at org.junit.Assert.assertEquals(Assert.java:115)
	at org.junit.Assert.assertEquals(Assert.java:144)
	at org.apache.commons.codec.digest.Sha512CryptTest.testSha512CryptBytes(Sha512CryptTest.java:46)

testSha512CryptStrings(org.apache.commons.codec.digest.Sha512CryptTest)  Time elapsed: 0.047 sec  <<< FAILURE!
org.junit.ComparisonFailure: expected:<$6$foo$[Nywkte7LPWjaJhWjNeGJN.dFdY3pN1wYlGifyRLYOVlGS9EMSiZaDDe/BGSOYQ327q9.32I4UqQ5odsqvsBLX/]> but was:<$6$foo$[Sfpk0YvnsnZaPygjYbt8EK32NY6p/ZRKYDN5lGLYrh2]>
	at org.junit.Assert.assertEquals(Assert.java:115)
	at org.junit.Assert.assertEquals(Assert.java:144)
	at org.apache.commons.codec.digest.Sha512CryptTest.testSha512CryptStrings(Sha512CryptTest.java:33)

Running org.apache.commons.codec.digest.Apr1CryptTest
Tests run: 8, Failures: 0, Errors: 0, Skipped: 0, Time elapsed: 0.095 sec - in org.apache.commons.codec.digest.Apr1CryptTest
Running org.apache.commons.codec.digest.HmacUtilsTest
Tests run: 24, Failures: 0, Errors: 0, Skipped: 0, Time elapsed: 0.038 sec - in org.apache.commons.codec.digest.HmacUtilsTest
Running org.apache.commons.codec.digest.Sha2CryptTest
Tests run: 1, Failures: 0, Errors: 0, Skipped: 0, Time elapsed: 0 sec - in org.apache.commons.codec.digest.Sha2CryptTest
Running org.apache.commons.codec.digest.CryptTest
Tests run: 4, Failures: 0, Errors: 0, Skipped: 0, Time elapsed: 0.11 sec - in org.apache.commons.codec.digest.CryptTest
Running org.apache.commons.codec.digest.Sha256CryptTest
Tests run: 7, Failures: 0, Errors: 5, Skipped: 0, Time elapsed: 0.126 sec <<< FAILURE! - in org.apache.commons.codec.digest.Sha256CryptTest
testSha256CryptBytes(org.apache.commons.codec.digest.Sha256CryptTest)  Time elapsed: 0.041 sec  <<< ERROR!
java.lang.ArrayIndexOutOfBoundsException: 42
	at org.apache.commons.codec.digest.Sha2Crypt.sha2Crypt(Sha2Crypt.java:103)
	at org.apache.commons.codec.digest.Sha2Crypt.sha256Crypt(Sha2Crypt.java:26)
	at org.apache.commons.codec.digest.Crypt.crypt(Crypt.java:71)
	at org.apache.commons.codec.digest.Sha256CryptTest.testSha256CryptBytes(Sha256CryptTest.java:45)

testSha2CryptRounds(org.apache.commons.codec.digest.Sha256CryptTest)  Time elapsed: 0.014 sec  <<< ERROR!
java.lang.ArrayIndexOutOfBoundsException: 42
	at org.apache.commons.codec.digest.Sha2Crypt.sha2Crypt(Sha2Crypt.java:103)
	at org.apache.commons.codec.digest.Sha2Crypt.sha256Crypt(Sha2Crypt.java:26)
	at org.apache.commons.codec.digest.Sha256CryptTest.testSha2CryptRounds(Sha256CryptTest.java:55)

testSha256LargetThanBlocksize(org.apache.commons.codec.digest.Sha256CryptTest)  Time elapsed: 0.048 sec  <<< ERROR!
java.lang.ArrayIndexOutOfBoundsException: 42
	at org.apache.commons.codec.digest.Sha2Crypt.sha2Crypt(Sha2Crypt.java:103)
	at org.apache.commons.codec.digest.Sha2Crypt.sha256Crypt(Sha2Crypt.java:26)
	at org.apache.commons.codec.digest.Sha256CryptTest.testSha256LargetThanBlocksize(Sha256CryptTest.java:80)

testSha256CryptExplicitCall(org.apache.commons.codec.digest.Sha256CryptTest)  Time elapsed: 0.014 sec  <<< ERROR!
java.lang.ArrayIndexOutOfBoundsException: 42
	at org.apache.commons.codec.digest.Sha2Crypt.sha2Crypt(Sha2Crypt.java:103)
	at org.apache.commons.codec.digest.Sha2Crypt.sha256Crypt(Sha2Crypt.java:26)
	at org.apache.commons.codec.digest.Sha2Crypt.sha256Crypt(Sha2Crypt.java:24)
	at org.apache.commons.codec.digest.Sha256CryptTest.testSha256CryptExplicitCall(Sha256CryptTest.java:62)

testSha256CryptStrings(org.apache.commons.codec.digest.Sha256CryptTest)  Time elapsed: 0.008 sec  <<< ERROR!
java.lang.ArrayIndexOutOfBoundsException: 42
	at org.apache.commons.codec.digest.Sha2Crypt.sha2Crypt(Sha2Crypt.java:103)
	at org.apache.commons.codec.digest.Sha2Crypt.sha256Crypt(Sha2Crypt.java:26)
	at org.apache.commons.codec.digest.Crypt.crypt(Crypt.java:71)
	at org.apache.commons.codec.digest.Crypt.crypt(Crypt.java:149)
	at org.apache.commons.codec.digest.Sha256CryptTest.testSha256CryptStrings(Sha256CryptTest.java:32)

Running org.apache.commons.codec.digest.Md5CryptTest
Tests run: 7, Failures: 0, Errors: 0, Skipped: 0, Time elapsed: 0.015 sec - in org.apache.commons.codec.digest.Md5CryptTest
Running org.apache.commons.codec.digest.UnixCryptTest
Tests run: 9, Failures: 0, Errors: 0, Skipped: 0, Time elapsed: 0.006 sec - in org.apache.commons.codec.digest.UnixCryptTest
Running org.apache.commons.codec.CharsetsTest
Tests run: 7, Failures: 0, Errors: 0, Skipped: 0, Time elapsed: 0.001 sec - in org.apache.commons.codec.CharsetsTest
Running org.apache.commons.codec.binary.Base32Test
Tests run: 8, Failures: 0, Errors: 0, Skipped: 0, Time elapsed: 0.016 sec - in org.apache.commons.codec.binary.Base32Test
Running org.apache.commons.codec.binary.Base64OutputStreamTest
Tests run: 7, Failures: 0, Errors: 0, Skipped: 0, Time elapsed: 0.237 sec - in org.apache.commons.codec.binary.Base64OutputStreamTest
Running org.apache.commons.codec.binary.Base64Codec13Test
Tests run: 8, Failures: 0, Errors: 0, Skipped: 0, Time elapsed: 0.006 sec - in org.apache.commons.codec.binary.Base64Codec13Test
Running org.apache.commons.codec.binary.Base64InputStreamTest
Tests run: 19, Failures: 0, Errors: 0, Skipped: 0, Time elapsed: 0.137 sec - in org.apache.commons.codec.binary.Base64InputStreamTest
Running org.apache.commons.codec.binary.Base32InputStreamTest
Tests run: 16, Failures: 0, Errors: 0, Skipped: 0, Time elapsed: 0.127 sec - in org.apache.commons.codec.binary.Base32InputStreamTest
Running org.apache.commons.codec.binary.Base32OutputStreamTest
Tests run: 6, Failures: 0, Errors: 0, Skipped: 0, Time elapsed: 0.078 sec - in org.apache.commons.codec.binary.Base32OutputStreamTest
Running org.apache.commons.codec.binary.BinaryCodecTest
Tests run: 13, Failures: 0, Errors: 0, Skipped: 0, Time elapsed: 0.009 sec - in org.apache.commons.codec.binary.BinaryCodecTest
Running org.apache.commons.codec.binary.BaseNCodecTest
Tests run: 7, Failures: 0, Errors: 0, Skipped: 0, Time elapsed: 0.002 sec - in org.apache.commons.codec.binary.BaseNCodecTest
Running org.apache.commons.codec.binary.StringUtilsTest
Tests run: 17, Failures: 0, Errors: 0, Skipped: 0, Time elapsed: 0.025 sec - in org.apache.commons.codec.binary.StringUtilsTest
Running org.apache.commons.codec.binary.Base64Test
Tests run: 53, Failures: 0, Errors: 0, Skipped: 1, Time elapsed: 0.042 sec - in org.apache.commons.codec.binary.Base64Test
Running org.apache.commons.codec.binary.HexTest
Tests run: 19, Failures: 0, Errors: 0, Skipped: 0, Time elapsed: 0.174 sec - in org.apache.commons.codec.binary.HexTest
Running org.apache.commons.codec.DecoderExceptionTest
Tests run: 4, Failures: 0, Errors: 0, Skipped: 0, Time elapsed: 0 sec - in org.apache.commons.codec.DecoderExceptionTest
Running org.apache.commons.codec.EncoderExceptionTest
Tests run: 4, Failures: 0, Errors: 0, Skipped: 0, Time elapsed: 0.001 sec - in org.apache.commons.codec.EncoderExceptionTest
Running org.apache.commons.codec.net.BCodecTest
Tests run: 9, Failures: 0, Errors: 0, Skipped: 0, Time elapsed: 0.005 sec - in org.apache.commons.codec.net.BCodecTest
Running org.apache.commons.codec.net.QCodecTest
Tests run: 12, Failures: 0, Errors: 0, Skipped: 0, Time elapsed: 0.007 sec - in org.apache.commons.codec.net.QCodecTest
Running org.apache.commons.codec.net.UtilsTest
Tests run: 1, Failures: 0, Errors: 0, Skipped: 0, Time elapsed: 0 sec - in org.apache.commons.codec.net.UtilsTest
Running org.apache.commons.codec.net.RFC1522CodecTest
Tests run: 2, Failures: 0, Errors: 0, Skipped: 0, Time elapsed: 0 sec - in org.apache.commons.codec.net.RFC1522CodecTest
Running org.apache.commons.codec.net.URLCodecTest
Tests run: 16, Failures: 0, Errors: 0, Skipped: 0, Time elapsed: 0.005 sec - in org.apache.commons.codec.net.URLCodecTest
Running org.apache.commons.codec.net.QuotedPrintableCodecTest
Tests run: 21, Failures: 0, Errors: 0, Skipped: 0, Time elapsed: 0.01 sec - in org.apache.commons.codec.net.QuotedPrintableCodecTest
Running org.apache.commons.codec.StringEncoderComparatorTest
Tests run: 3, Failures: 0, Errors: 0, Skipped: 0, Time elapsed: 0.003 sec - in org.apache.commons.codec.StringEncoderComparatorTest
Running org.apache.commons.codec.language.Caverphone1Test
Tests run: 9, Failures: 0, Errors: 0, Skipped: 0, Time elapsed: 0.027 sec - in org.apache.commons.codec.language.Caverphone1Test
Running org.apache.commons.codec.language.NysiisTest
Tests run: 23, Failures: 0, Errors: 0, Skipped: 0, Time elapsed: 0.017 sec - in org.apache.commons.codec.language.NysiisTest
Running org.apache.commons.codec.language.Caverphone2Test
Tests run: 13, Failures: 0, Errors: 0, Skipped: 0, Time elapsed: 0.138 sec - in org.apache.commons.codec.language.Caverphone2Test
Running org.apache.commons.codec.language.DaitchMokotoffSoundexTest
Tests run: 13, Failures: 0, Errors: 0, Skipped: 0, Time elapsed: 0.052 sec - in org.apache.commons.codec.language.DaitchMokotoffSoundexTest
Running org.apache.commons.codec.language.bm.BeiderMorseEncoderTest
Tests run: 22, Failures: 0, Errors: 0, Skipped: 0, Time elapsed: 3.013 sec - in org.apache.commons.codec.language.bm.BeiderMorseEncoderTest
Running org.apache.commons.codec.language.bm.PhoneticEngineTest
Tests run: 8, Failures: 0, Errors: 0, Skipped: 0, Time elapsed: 0.019 sec - in org.apache.commons.codec.language.bm.PhoneticEngineTest
Running org.apache.commons.codec.language.bm.PhoneticEngineRegressionTest
Tests run: 4, Failures: 0, Errors: 0, Skipped: 0, Time elapsed: 0.016 sec - in org.apache.commons.codec.language.bm.PhoneticEngineRegressionTest
Running org.apache.commons.codec.language.bm.RuleTest
Tests run: 3, Failures: 0, Errors: 0, Skipped: 0, Time elapsed: 0.002 sec - in org.apache.commons.codec.language.bm.RuleTest
Running org.apache.commons.codec.language.bm.LanguageGuessingTest
Tests run: 18, Failures: 0, Errors: 0, Skipped: 0, Time elapsed: 0.012 sec - in org.apache.commons.codec.language.bm.LanguageGuessingTest
Running org.apache.commons.codec.language.DoubleMetaphoneTest
Tests run: 16, Failures: 0, Errors: 0, Skipped: 0, Time elapsed: 0.044 sec - in org.apache.commons.codec.language.DoubleMetaphoneTest
Running org.apache.commons.codec.language.SoundexTest
Tests run: 28, Failures: 0, Errors: 0, Skipped: 0, Time elapsed: 0.009 sec - in org.apache.commons.codec.language.SoundexTest
Running org.apache.commons.codec.language.RefinedSoundexTest
Tests run: 10, Failures: 0, Errors: 0, Skipped: 0, Time elapsed: 0.002 sec - in org.apache.commons.codec.language.RefinedSoundexTest
Running org.apache.commons.codec.language.MatchRatingApproachEncoderTest
Tests run: 96, Failures: 0, Errors: 0, Skipped: 0, Time elapsed: 0.032 sec - in org.apache.commons.codec.language.MatchRatingApproachEncoderTest
Running org.apache.commons.codec.language.ColognePhoneticTest
Tests run: 13, Failures: 0, Errors: 0, Skipped: 0, Time elapsed: 0.004 sec - in org.apache.commons.codec.language.ColognePhoneticTest
Running org.apache.commons.codec.language.DoubleMetaphone2Test
Tests run: 6, Failures: 0, Errors: 0, Skipped: 0, Time elapsed: 0.027 sec - in org.apache.commons.codec.language.DoubleMetaphone2Test
Running org.apache.commons.codec.language.MetaphoneTest
Tests run: 34, Failures: 0, Errors: 0, Skipped: 0, Time elapsed: 0.085 sec - in org.apache.commons.codec.language.MetaphoneTest
Running org.apache.commons.codec.CharEncodingTest
Tests run: 7, Failures: 0, Errors: 0, Skipped: 0, Time elapsed: 0 sec - in org.apache.commons.codec.CharEncodingTest

Results :

Failed tests: 
  Sha512CryptTest.testSha256LargetThanBlocksize:92 expected:<$6$abc$[oP/h8PRhCKIA66KSTjGwNsQMSLLZnuFOTjOhrqNrDkKgjTlpePSqibB0qtmDapMbP/zN1cUEYSeHFrpgqZ.GG1]> but was:<$6$abc$[7w.hLcg33JPqCuSSiwhMC5TbNgJZ8APRfaaHT5RrR49]>
  Sha512CryptTest.testSha512CryptBytes:46 expected:<$6$foo$[Nywkte7LPWjaJhWjNeGJN.dFdY3pN1wYlGifyRLYOVlGS9EMSiZaDDe/BGSOYQ327q9.32I4UqQ5odsqvsBLX/]> but was:<$6$foo$[Sfpk0YvnsnZaPygjYbt8EK32NY6p/ZRKYDN5lGLYrh2]>
  Sha512CryptTest.testSha512CryptStrings:33 expected:<$6$foo$[Nywkte7LPWjaJhWjNeGJN.dFdY3pN1wYlGifyRLYOVlGS9EMSiZaDDe/BGSOYQ327q9.32I4UqQ5odsqvsBLX/]> but was:<$6$foo$[Sfpk0YvnsnZaPygjYbt8EK32NY6p/ZRKYDN5lGLYrh2]>

Tests in error: 
  Sha512CryptTest.testSha2CryptRounds:73 » ArrayIndexOutOfBounds 42
  Sha256CryptTest.testSha256CryptBytes:45 » ArrayIndexOutOfBounds 42
  Sha256CryptTest.testSha2CryptRounds:55 » ArrayIndexOutOfBounds 42
  Sha256CryptTest.testSha256LargetThanBlocksize:80 » ArrayIndexOutOfBounds 42
  Sha256CryptTest.testSha256CryptExplicitCall:62 » ArrayIndexOutOfBounds 42
  Sha256CryptTest.testSha256CryptStrings:32 » ArrayIndexOutOfBounds 42

Tests run: 662, Failures: 3, Errors: 6, Skipped: 1

[INFO] ------------------------------------------------------------------------
[INFO] BUILD FAILURE
[INFO] ------------------------------------------------------------------------
[INFO] Total time: 13.702s
[INFO] Finished at: Sun Aug 02 08:25:43 BST 2015
[INFO] Final Memory: 20M/344M
[INFO] ------------------------------------------------------------------------
[ERROR] Failed to execute goal org.apache.maven.plugins:maven-surefire-plugin:2.17:test (default-test) on project commons-codec: There are test failures.
[ERROR] 
[ERROR] Please refer to /home/perham/Study/LittleDarwin/Cases/commons-codec-1.10-src/target/surefire-reports for the individual test results.
[ERROR] -> [Help 1]
[ERROR] 
[ERROR] To see the full stack trace of the errors, re-run Maven with the -e switch.
[ERROR] Re-run Maven using the -X switch to enable full debug logging.
[ERROR] 
[ERROR] For more information about the errors and possible solutions, please read the following articles:
[ERROR] [Help 1] http://cwiki.apache.org/confluence/display/MAVEN/MojoFailureException
