[INFO] Scanning for projects...
[INFO]                                                                         
[INFO] ------------------------------------------------------------------------
[INFO] Building Apache Commons Codec 1.10
[INFO] ------------------------------------------------------------------------
[INFO] 
[INFO] --- maven-enforcer-plugin:1.3.1:enforce (enforce-maven-3) @ commons-codec ---
[INFO] 
[INFO] --- maven-antrun-plugin:1.7:run (javadoc.resources) @ commons-codec ---
[INFO] Executing tasks

main:
[INFO] Executed tasks
[INFO] 
[INFO] --- maven-remote-resources-plugin:1.5:process (default) @ commons-codec ---
[INFO] 
[INFO] --- buildnumber-maven-plugin:1.3:create (default) @ commons-codec ---
[INFO] Executing: /bin/sh -c cd /home/perham/Study/LittleDarwin/Cases/commons-codec-1.10-src && svn --non-interactive info
[INFO] Working directory: /home/perham/Study/LittleDarwin/Cases/commons-codec-1.10-src
[INFO] Storing buildNumber: ?????? at timestamp: 1438499825255
[INFO] Executing: /bin/sh -c cd /home/perham/Study/LittleDarwin/Cases/commons-codec-1.10-src && svn --non-interactive info
[INFO] Working directory: /home/perham/Study/LittleDarwin/Cases/commons-codec-1.10-src
[INFO] Storing buildScmBranch: UNKNOWN_BRANCH
[INFO] 
[INFO] --- maven-resources-plugin:2.7:resources (default-resources) @ commons-codec ---
[INFO] Using 'UTF-8' encoding to copy filtered resources.
[INFO] Copying 128 resources
[INFO] Copying 2 resources to META-INF
[INFO] 
[INFO] --- maven-compiler-plugin:3.2:compile (default-compile) @ commons-codec ---
[INFO] Changes detected - recompiling the module!
[INFO] Compiling 60 source files to /home/perham/Study/LittleDarwin/Cases/commons-codec-1.10-src/target/classes
[INFO] /home/perham/Study/LittleDarwin/Cases/commons-codec-1.10-src/src/main/java/org/apache/commons/codec/digest/Sha2Crypt.java: Some input files use or override a deprecated API.
[INFO] /home/perham/Study/LittleDarwin/Cases/commons-codec-1.10-src/src/main/java/org/apache/commons/codec/digest/Sha2Crypt.java: Recompile with -Xlint:deprecation for details.
[INFO] 
[INFO] --- maven-bundle-plugin:2.5.3:manifest (bundle-manifest) @ commons-codec ---
[INFO] 
[INFO] --- maven-resources-plugin:2.7:testResources (default-testResources) @ commons-codec ---
[INFO] Using 'UTF-8' encoding to copy filtered resources.
[INFO] skip non existing resourceDirectory /home/perham/Study/LittleDarwin/Cases/commons-codec-1.10-src/src/test/resources
[INFO] Copying 2 resources to META-INF
[INFO] 
[INFO] --- maven-compiler-plugin:3.2:testCompile (default-testCompile) @ commons-codec ---
[INFO] Nothing to compile - all classes are up to date
[INFO] 
[INFO] --- maven-surefire-plugin:2.17:test (default-test) @ commons-codec ---
[INFO] Surefire report directory: /home/perham/Study/LittleDarwin/Cases/commons-codec-1.10-src/target/surefire-reports

-------------------------------------------------------
 T E S T S
-------------------------------------------------------
Running org.apache.commons.codec.digest.B64Test
Tests run: 2, Failures: 0, Errors: 0, Skipped: 0, Time elapsed: 0.025 sec - in org.apache.commons.codec.digest.B64Test
Running org.apache.commons.codec.digest.DigestUtilsTest
Tests run: 17, Failures: 0, Errors: 0, Skipped: 0, Time elapsed: 0.683 sec - in org.apache.commons.codec.digest.DigestUtilsTest
Running org.apache.commons.codec.digest.Sha512CryptTest
Tests run: 8, Failures: 0, Errors: 0, Skipped: 0, Time elapsed: 0.476 sec - in org.apache.commons.codec.digest.Sha512CryptTest
Running org.apache.commons.codec.digest.Apr1CryptTest
Tests run: 8, Failures: 0, Errors: 7, Skipped: 0, Time elapsed: 0.024 sec <<< FAILURE! - in org.apache.commons.codec.digest.Apr1CryptTest
testApr1CryptBytes(org.apache.commons.codec.digest.Apr1CryptTest)  Time elapsed: 0.012 sec  <<< ERROR!
java.lang.IllegalArgumentException: Invalid salt value: $apr1$ubPSjHzK
	at org.apache.commons.codec.digest.Md5Crypt.md5Crypt(Md5Crypt.java:30)
	at org.apache.commons.codec.digest.Md5Crypt.apr1Crypt(Md5Crypt.java:20)
	at org.apache.commons.codec.digest.Md5Crypt.apr1Crypt(Md5Crypt.java:18)
	at org.apache.commons.codec.digest.Apr1CryptTest.testApr1CryptBytes(Apr1CryptTest.java:47)

testApr1CryptWithEmptySalt(org.apache.commons.codec.digest.Apr1CryptTest)  Time elapsed: 0.001 sec  <<< ERROR!
java.lang.Exception: Unexpected exception, expected<java.lang.IllegalArgumentException> but was<java.lang.IllegalStateException>
	at java.util.regex.Matcher.group(Matcher.java:485)
	at org.apache.commons.codec.digest.Md5Crypt.md5Crypt(Md5Crypt.java:31)
	at org.apache.commons.codec.digest.Md5Crypt.apr1Crypt(Md5Crypt.java:20)
	at org.apache.commons.codec.digest.Apr1CryptTest.testApr1CryptWithEmptySalt(Apr1CryptTest.java:79)

testApr1CryptWithoutSalt(org.apache.commons.codec.digest.Apr1CryptTest)  Time elapsed: 0.001 sec  <<< ERROR!
java.lang.IllegalArgumentException: Invalid salt value: $apr1$Q5WsYunJ
	at org.apache.commons.codec.digest.Md5Crypt.md5Crypt(Md5Crypt.java:30)
	at org.apache.commons.codec.digest.Md5Crypt.apr1Crypt(Md5Crypt.java:20)
	at org.apache.commons.codec.digest.Md5Crypt.apr1Crypt(Md5Crypt.java:18)
	at org.apache.commons.codec.digest.Md5Crypt.apr1Crypt(Md5Crypt.java:21)
	at org.apache.commons.codec.digest.Apr1CryptTest.testApr1CryptWithoutSalt(Apr1CryptTest.java:85)

testApr1LongSalt(org.apache.commons.codec.digest.Apr1CryptTest)  Time elapsed: 0.001 sec  <<< ERROR!
java.lang.IllegalArgumentException: Invalid salt value: $apr1$12345678901234567890
	at org.apache.commons.codec.digest.Md5Crypt.md5Crypt(Md5Crypt.java:30)
	at org.apache.commons.codec.digest.Md5Crypt.apr1Crypt(Md5Crypt.java:20)
	at org.apache.commons.codec.digest.Md5Crypt.apr1Crypt(Md5Crypt.java:22)
	at org.apache.commons.codec.digest.Apr1CryptTest.testApr1LongSalt(Apr1CryptTest.java:69)

testApr1CryptExplicitCall(org.apache.commons.codec.digest.Apr1CryptTest)  Time elapsed: 0.001 sec  <<< ERROR!
java.lang.IllegalArgumentException: Invalid salt value: $apr1$1234
	at org.apache.commons.codec.digest.Md5Crypt.md5Crypt(Md5Crypt.java:30)
	at org.apache.commons.codec.digest.Md5Crypt.apr1Crypt(Md5Crypt.java:20)
	at org.apache.commons.codec.digest.Md5Crypt.apr1Crypt(Md5Crypt.java:22)
	at org.apache.commons.codec.digest.Apr1CryptTest.testApr1CryptExplicitCall(Apr1CryptTest.java:61)

testApr1CryptWithInvalidSalt(org.apache.commons.codec.digest.Apr1CryptTest)  Time elapsed: 0.001 sec  <<< ERROR!
java.lang.Exception: Unexpected exception, expected<java.lang.IllegalArgumentException> but was<java.lang.IllegalStateException>
	at java.util.regex.Matcher.group(Matcher.java:485)
	at org.apache.commons.codec.digest.Md5Crypt.md5Crypt(Md5Crypt.java:31)
	at org.apache.commons.codec.digest.Md5Crypt.apr1Crypt(Md5Crypt.java:20)
	at org.apache.commons.codec.digest.Apr1CryptTest.testApr1CryptWithInvalidSalt(Apr1CryptTest.java:93)

testApr1CryptStrings(org.apache.commons.codec.digest.Apr1CryptTest)  Time elapsed: 0.001 sec  <<< ERROR!
java.lang.IllegalArgumentException: Invalid salt value: $apr1$TqI9WECO
	at org.apache.commons.codec.digest.Md5Crypt.md5Crypt(Md5Crypt.java:30)
	at org.apache.commons.codec.digest.Md5Crypt.apr1Crypt(Md5Crypt.java:20)
	at org.apache.commons.codec.digest.Md5Crypt.apr1Crypt(Md5Crypt.java:22)
	at org.apache.commons.codec.digest.Apr1CryptTest.testApr1CryptStrings(Apr1CryptTest.java:31)

Running org.apache.commons.codec.digest.HmacUtilsTest
Tests run: 24, Failures: 0, Errors: 0, Skipped: 0, Time elapsed: 0.026 sec - in org.apache.commons.codec.digest.HmacUtilsTest
Running org.apache.commons.codec.digest.Sha2CryptTest
Tests run: 1, Failures: 0, Errors: 0, Skipped: 0, Time elapsed: 0 sec - in org.apache.commons.codec.digest.Sha2CryptTest
Running org.apache.commons.codec.digest.CryptTest
Tests run: 4, Failures: 0, Errors: 0, Skipped: 0, Time elapsed: 0.121 sec - in org.apache.commons.codec.digest.CryptTest
Running org.apache.commons.codec.digest.Sha256CryptTest
Tests run: 7, Failures: 0, Errors: 0, Skipped: 0, Time elapsed: 0.098 sec - in org.apache.commons.codec.digest.Sha256CryptTest
Running org.apache.commons.codec.digest.Md5CryptTest
Tests run: 7, Failures: 0, Errors: 5, Skipped: 0, Time elapsed: 0.002 sec <<< FAILURE! - in org.apache.commons.codec.digest.Md5CryptTest
testMd5CryptBytes(org.apache.commons.codec.digest.Md5CryptTest)  Time elapsed: 0 sec  <<< ERROR!
java.lang.IllegalArgumentException: Invalid salt value: $1$foo
	at org.apache.commons.codec.digest.Md5Crypt.md5Crypt(Md5Crypt.java:30)
	at org.apache.commons.codec.digest.Md5Crypt.md5Crypt(Md5Crypt.java:24)
	at org.apache.commons.codec.digest.Crypt.crypt(Crypt.java:73)
	at org.apache.commons.codec.digest.Md5CryptTest.testMd5CryptBytes(Md5CryptTest.java:49)

testMd5CryptLongInput(org.apache.commons.codec.digest.Md5CryptTest)  Time elapsed: 0 sec  <<< ERROR!
java.lang.IllegalArgumentException: Invalid salt value: $1$1234
	at org.apache.commons.codec.digest.Md5Crypt.md5Crypt(Md5Crypt.java:30)
	at org.apache.commons.codec.digest.Md5Crypt.md5Crypt(Md5Crypt.java:24)
	at org.apache.commons.codec.digest.Crypt.crypt(Crypt.java:73)
	at org.apache.commons.codec.digest.Crypt.crypt(Crypt.java:149)
	at org.apache.commons.codec.digest.Md5CryptTest.testMd5CryptLongInput(Md5CryptTest.java:64)

testMd5CryptWithEmptySalt(org.apache.commons.codec.digest.Md5CryptTest)  Time elapsed: 0.001 sec  <<< ERROR!
java.lang.Exception: Unexpected exception, expected<java.lang.IllegalArgumentException> but was<java.lang.IllegalStateException>
	at java.util.regex.Matcher.group(Matcher.java:485)
	at org.apache.commons.codec.digest.Md5Crypt.md5Crypt(Md5Crypt.java:31)
	at org.apache.commons.codec.digest.Md5Crypt.md5Crypt(Md5Crypt.java:24)
	at org.apache.commons.codec.digest.Md5CryptTest.testMd5CryptWithEmptySalt(Md5CryptTest.java:74)

testMd5CryptExplicitCall(org.apache.commons.codec.digest.Md5CryptTest)  Time elapsed: 0 sec  <<< ERROR!
java.lang.IllegalArgumentException: Invalid salt value: $1$8J9YZs8L
	at org.apache.commons.codec.digest.Md5Crypt.md5Crypt(Md5Crypt.java:30)
	at org.apache.commons.codec.digest.Md5Crypt.md5Crypt(Md5Crypt.java:24)
	at org.apache.commons.codec.digest.Md5Crypt.md5Crypt(Md5Crypt.java:23)
	at org.apache.commons.codec.digest.Md5CryptTest.testMd5CryptExplicitCall(Md5CryptTest.java:58)

testMd5CryptStrings(org.apache.commons.codec.digest.Md5CryptTest)  Time elapsed: 0.001 sec  <<< ERROR!
java.lang.IllegalArgumentException: Invalid salt value: $1$foo
	at org.apache.commons.codec.digest.Md5Crypt.md5Crypt(Md5Crypt.java:30)
	at org.apache.commons.codec.digest.Md5Crypt.md5Crypt(Md5Crypt.java:24)
	at org.apache.commons.codec.digest.Crypt.crypt(Crypt.java:73)
	at org.apache.commons.codec.digest.Crypt.crypt(Crypt.java:149)
	at org.apache.commons.codec.digest.Md5CryptTest.testMd5CryptStrings(Md5CryptTest.java:36)

Running org.apache.commons.codec.digest.UnixCryptTest
Tests run: 9, Failures: 0, Errors: 0, Skipped: 0, Time elapsed: 0.006 sec - in org.apache.commons.codec.digest.UnixCryptTest
Running org.apache.commons.codec.CharsetsTest
Tests run: 7, Failures: 0, Errors: 0, Skipped: 0, Time elapsed: 0.001 sec - in org.apache.commons.codec.CharsetsTest
Running org.apache.commons.codec.binary.Base32Test
Tests run: 8, Failures: 0, Errors: 0, Skipped: 0, Time elapsed: 0.011 sec - in org.apache.commons.codec.binary.Base32Test
Running org.apache.commons.codec.binary.Base64OutputStreamTest
Tests run: 7, Failures: 0, Errors: 0, Skipped: 0, Time elapsed: 0.212 sec - in org.apache.commons.codec.binary.Base64OutputStreamTest
Running org.apache.commons.codec.binary.Base64Codec13Test
Tests run: 8, Failures: 0, Errors: 0, Skipped: 0, Time elapsed: 0.01 sec - in org.apache.commons.codec.binary.Base64Codec13Test
Running org.apache.commons.codec.binary.Base64InputStreamTest
Tests run: 19, Failures: 0, Errors: 0, Skipped: 0, Time elapsed: 0.125 sec - in org.apache.commons.codec.binary.Base64InputStreamTest
Running org.apache.commons.codec.binary.Base32InputStreamTest
Tests run: 16, Failures: 0, Errors: 0, Skipped: 0, Time elapsed: 0.139 sec - in org.apache.commons.codec.binary.Base32InputStreamTest
Running org.apache.commons.codec.binary.Base32OutputStreamTest
Tests run: 6, Failures: 0, Errors: 0, Skipped: 0, Time elapsed: 0.083 sec - in org.apache.commons.codec.binary.Base32OutputStreamTest
Running org.apache.commons.codec.binary.BinaryCodecTest
Tests run: 13, Failures: 0, Errors: 0, Skipped: 0, Time elapsed: 0.009 sec - in org.apache.commons.codec.binary.BinaryCodecTest
Running org.apache.commons.codec.binary.BaseNCodecTest
Tests run: 7, Failures: 0, Errors: 0, Skipped: 0, Time elapsed: 0.003 sec - in org.apache.commons.codec.binary.BaseNCodecTest
Running org.apache.commons.codec.binary.StringUtilsTest
Tests run: 17, Failures: 0, Errors: 0, Skipped: 0, Time elapsed: 0.026 sec - in org.apache.commons.codec.binary.StringUtilsTest
Running org.apache.commons.codec.binary.Base64Test
Tests run: 53, Failures: 0, Errors: 0, Skipped: 1, Time elapsed: 0.047 sec - in org.apache.commons.codec.binary.Base64Test
Running org.apache.commons.codec.binary.HexTest
Tests run: 19, Failures: 0, Errors: 0, Skipped: 0, Time elapsed: 0.174 sec - in org.apache.commons.codec.binary.HexTest
Running org.apache.commons.codec.DecoderExceptionTest
Tests run: 4, Failures: 0, Errors: 0, Skipped: 0, Time elapsed: 0 sec - in org.apache.commons.codec.DecoderExceptionTest
Running org.apache.commons.codec.EncoderExceptionTest
Tests run: 4, Failures: 0, Errors: 0, Skipped: 0, Time elapsed: 0.001 sec - in org.apache.commons.codec.EncoderExceptionTest
Running org.apache.commons.codec.net.BCodecTest
Tests run: 9, Failures: 0, Errors: 0, Skipped: 0, Time elapsed: 0.006 sec - in org.apache.commons.codec.net.BCodecTest
Running org.apache.commons.codec.net.QCodecTest
Tests run: 12, Failures: 0, Errors: 0, Skipped: 0, Time elapsed: 0.008 sec - in org.apache.commons.codec.net.QCodecTest
Running org.apache.commons.codec.net.UtilsTest
Tests run: 1, Failures: 0, Errors: 0, Skipped: 0, Time elapsed: 0 sec - in org.apache.commons.codec.net.UtilsTest
Running org.apache.commons.codec.net.RFC1522CodecTest
Tests run: 2, Failures: 0, Errors: 0, Skipped: 0, Time elapsed: 0 sec - in org.apache.commons.codec.net.RFC1522CodecTest
Running org.apache.commons.codec.net.URLCodecTest
Tests run: 16, Failures: 0, Errors: 0, Skipped: 0, Time elapsed: 0.007 sec - in org.apache.commons.codec.net.URLCodecTest
Running org.apache.commons.codec.net.QuotedPrintableCodecTest
Tests run: 21, Failures: 0, Errors: 0, Skipped: 0, Time elapsed: 0.011 sec - in org.apache.commons.codec.net.QuotedPrintableCodecTest
Running org.apache.commons.codec.StringEncoderComparatorTest
Tests run: 3, Failures: 0, Errors: 0, Skipped: 0, Time elapsed: 0.005 sec - in org.apache.commons.codec.StringEncoderComparatorTest
Running org.apache.commons.codec.language.Caverphone1Test
Tests run: 9, Failures: 0, Errors: 0, Skipped: 0, Time elapsed: 0.03 sec - in org.apache.commons.codec.language.Caverphone1Test
Running org.apache.commons.codec.language.NysiisTest
Tests run: 23, Failures: 0, Errors: 0, Skipped: 0, Time elapsed: 0.017 sec - in org.apache.commons.codec.language.NysiisTest
Running org.apache.commons.codec.language.Caverphone2Test
Tests run: 13, Failures: 0, Errors: 0, Skipped: 0, Time elapsed: 0.133 sec - in org.apache.commons.codec.language.Caverphone2Test
Running org.apache.commons.codec.language.DaitchMokotoffSoundexTest
Tests run: 13, Failures: 0, Errors: 0, Skipped: 0, Time elapsed: 0.056 sec - in org.apache.commons.codec.language.DaitchMokotoffSoundexTest
Running org.apache.commons.codec.language.bm.BeiderMorseEncoderTest
Tests run: 22, Failures: 0, Errors: 0, Skipped: 0, Time elapsed: 2.985 sec - in org.apache.commons.codec.language.bm.BeiderMorseEncoderTest
Running org.apache.commons.codec.language.bm.PhoneticEngineTest
Tests run: 8, Failures: 0, Errors: 0, Skipped: 0, Time elapsed: 0.019 sec - in org.apache.commons.codec.language.bm.PhoneticEngineTest
Running org.apache.commons.codec.language.bm.PhoneticEngineRegressionTest
Tests run: 4, Failures: 0, Errors: 0, Skipped: 0, Time elapsed: 0.015 sec - in org.apache.commons.codec.language.bm.PhoneticEngineRegressionTest
Running org.apache.commons.codec.language.bm.RuleTest
Tests run: 3, Failures: 0, Errors: 0, Skipped: 0, Time elapsed: 0.002 sec - in org.apache.commons.codec.language.bm.RuleTest
Running org.apache.commons.codec.language.bm.LanguageGuessingTest
Tests run: 18, Failures: 0, Errors: 0, Skipped: 0, Time elapsed: 0.012 sec - in org.apache.commons.codec.language.bm.LanguageGuessingTest
Running org.apache.commons.codec.language.DoubleMetaphoneTest
Tests run: 16, Failures: 0, Errors: 0, Skipped: 0, Time elapsed: 0.057 sec - in org.apache.commons.codec.language.DoubleMetaphoneTest
Running org.apache.commons.codec.language.SoundexTest
Tests run: 28, Failures: 0, Errors: 0, Skipped: 0, Time elapsed: 0.014 sec - in org.apache.commons.codec.language.SoundexTest
Running org.apache.commons.codec.language.RefinedSoundexTest
Tests run: 10, Failures: 0, Errors: 0, Skipped: 0, Time elapsed: 0.003 sec - in org.apache.commons.codec.language.RefinedSoundexTest
Running org.apache.commons.codec.language.MatchRatingApproachEncoderTest
Tests run: 96, Failures: 0, Errors: 0, Skipped: 0, Time elapsed: 0.034 sec - in org.apache.commons.codec.language.MatchRatingApproachEncoderTest
Running org.apache.commons.codec.language.ColognePhoneticTest
Tests run: 13, Failures: 0, Errors: 0, Skipped: 0, Time elapsed: 0.004 sec - in org.apache.commons.codec.language.ColognePhoneticTest
Running org.apache.commons.codec.language.DoubleMetaphone2Test
Tests run: 6, Failures: 0, Errors: 0, Skipped: 0, Time elapsed: 0.039 sec - in org.apache.commons.codec.language.DoubleMetaphone2Test
Running org.apache.commons.codec.language.MetaphoneTest
Tests run: 34, Failures: 0, Errors: 0, Skipped: 0, Time elapsed: 0.102 sec - in org.apache.commons.codec.language.MetaphoneTest
Running org.apache.commons.codec.CharEncodingTest
Tests run: 7, Failures: 0, Errors: 0, Skipped: 0, Time elapsed: 0 sec - in org.apache.commons.codec.CharEncodingTest

Results :

Tests in error: 
  Apr1CryptTest.testApr1CryptBytes:47 » IllegalArgument Invalid salt value: $apr...
  Apr1CryptTest.testApr1CryptWithEmptySalt »  Unexpected exception, expected<jav...
  Apr1CryptTest.testApr1CryptWithoutSalt:85 » IllegalArgument Invalid salt value...
  Apr1CryptTest.testApr1LongSalt:69 » IllegalArgument Invalid salt value: $apr1$...
  Apr1CryptTest.testApr1CryptExplicitCall:61 » IllegalArgument Invalid salt valu...
  Apr1CryptTest.testApr1CryptWithInvalidSalt »  Unexpected exception, expected<j...
  Apr1CryptTest.testApr1CryptStrings:31 » IllegalArgument Invalid salt value: $a...
  Md5CryptTest.testMd5CryptBytes:49 » IllegalArgument Invalid salt value: $1$foo
  Md5CryptTest.testMd5CryptLongInput:64 » IllegalArgument Invalid salt value: $1...
  Md5CryptTest.testMd5CryptWithEmptySalt »  Unexpected exception, expected<java....
  Md5CryptTest.testMd5CryptExplicitCall:58 » IllegalArgument Invalid salt value:...
  Md5CryptTest.testMd5CryptStrings:36 » IllegalArgument Invalid salt value: $1$f...

Tests run: 662, Failures: 0, Errors: 12, Skipped: 1

[INFO] ------------------------------------------------------------------------
[INFO] BUILD FAILURE
[INFO] ------------------------------------------------------------------------
[INFO] Total time: 13.508s
[INFO] Finished at: Sun Aug 02 08:17:16 BST 2015
[INFO] Final Memory: 20M/287M
[INFO] ------------------------------------------------------------------------
[ERROR] Failed to execute goal org.apache.maven.plugins:maven-surefire-plugin:2.17:test (default-test) on project commons-codec: There are test failures.
[ERROR] 
[ERROR] Please refer to /home/perham/Study/LittleDarwin/Cases/commons-codec-1.10-src/target/surefire-reports for the individual test results.
[ERROR] -> [Help 1]
[ERROR] 
[ERROR] To see the full stack trace of the errors, re-run Maven with the -e switch.
[ERROR] Re-run Maven using the -X switch to enable full debug logging.
[ERROR] 
[ERROR] For more information about the errors and possible solutions, please read the following articles:
[ERROR] [Help 1] http://cwiki.apache.org/confluence/display/MAVEN/MojoFailureException
