[INFO] Scanning for projects...
[INFO]                                                                         
[INFO] ------------------------------------------------------------------------
[INFO] Building Apache Commons Codec 1.10
[INFO] ------------------------------------------------------------------------
[INFO] 
[INFO] --- maven-enforcer-plugin:1.3.1:enforce (enforce-maven-3) @ commons-codec ---
[INFO] 
[INFO] --- maven-antrun-plugin:1.7:run (javadoc.resources) @ commons-codec ---
[INFO] Executing tasks

main:
[INFO] Executed tasks
[INFO] 
[INFO] --- maven-remote-resources-plugin:1.5:process (default) @ commons-codec ---
[INFO] 
[INFO] --- buildnumber-maven-plugin:1.3:create (default) @ commons-codec ---
[INFO] Executing: /bin/sh -c cd /home/perham/Study/LittleDarwin/Cases/commons-codec-1.10-src && svn --non-interactive info
[INFO] Working directory: /home/perham/Study/LittleDarwin/Cases/commons-codec-1.10-src
[INFO] Storing buildNumber: ?????? at timestamp: 1438499339643
[INFO] Executing: /bin/sh -c cd /home/perham/Study/LittleDarwin/Cases/commons-codec-1.10-src && svn --non-interactive info
[INFO] Working directory: /home/perham/Study/LittleDarwin/Cases/commons-codec-1.10-src
[INFO] Storing buildScmBranch: UNKNOWN_BRANCH
[INFO] 
[INFO] --- maven-resources-plugin:2.7:resources (default-resources) @ commons-codec ---
[INFO] Using 'UTF-8' encoding to copy filtered resources.
[INFO] Copying 128 resources
[INFO] Copying 2 resources to META-INF
[INFO] 
[INFO] --- maven-compiler-plugin:3.2:compile (default-compile) @ commons-codec ---
[INFO] Changes detected - recompiling the module!
[INFO] Compiling 60 source files to /home/perham/Study/LittleDarwin/Cases/commons-codec-1.10-src/target/classes
[INFO] /home/perham/Study/LittleDarwin/Cases/commons-codec-1.10-src/src/main/java/org/apache/commons/codec/digest/Sha2Crypt.java: Some input files use or override a deprecated API.
[INFO] /home/perham/Study/LittleDarwin/Cases/commons-codec-1.10-src/src/main/java/org/apache/commons/codec/digest/Sha2Crypt.java: Recompile with -Xlint:deprecation for details.
[INFO] 
[INFO] --- maven-bundle-plugin:2.5.3:manifest (bundle-manifest) @ commons-codec ---
[INFO] 
[INFO] --- maven-resources-plugin:2.7:testResources (default-testResources) @ commons-codec ---
[INFO] Using 'UTF-8' encoding to copy filtered resources.
[INFO] skip non existing resourceDirectory /home/perham/Study/LittleDarwin/Cases/commons-codec-1.10-src/src/test/resources
[INFO] Copying 2 resources to META-INF
[INFO] 
[INFO] --- maven-compiler-plugin:3.2:testCompile (default-testCompile) @ commons-codec ---
[INFO] Nothing to compile - all classes are up to date
[INFO] 
[INFO] --- maven-surefire-plugin:2.17:test (default-test) @ commons-codec ---
[INFO] Surefire report directory: /home/perham/Study/LittleDarwin/Cases/commons-codec-1.10-src/target/surefire-reports

-------------------------------------------------------
 T E S T S
-------------------------------------------------------
Running org.apache.commons.codec.digest.B64Test
Tests run: 2, Failures: 0, Errors: 0, Skipped: 0, Time elapsed: 0.026 sec - in org.apache.commons.codec.digest.B64Test
Running org.apache.commons.codec.digest.DigestUtilsTest
Tests run: 17, Failures: 0, Errors: 0, Skipped: 0, Time elapsed: 0.653 sec - in org.apache.commons.codec.digest.DigestUtilsTest
Running org.apache.commons.codec.digest.Sha512CryptTest
Tests run: 8, Failures: 2, Errors: 0, Skipped: 0, Time elapsed: 0.409 sec <<< FAILURE! - in org.apache.commons.codec.digest.Sha512CryptTest
testSha512CryptBytes(org.apache.commons.codec.digest.Sha512CryptTest)  Time elapsed: 0.043 sec  <<< FAILURE!
org.junit.ComparisonFailure: expected:<$6$[foo$Nywkte7LPWjaJhWjNeGJN.dFdY3pN1wYlGifyRLYOVlGS9EMSiZaDDe/BGSOYQ327q9.32I4UqQ5odsqvsBLX]/> but was:<$6$[Wk.TIShU$jZ.A8JlF4sLLIFZyJaPCoVz37CNqUuCrnbimyKUZx6D8XF5DSjQLalY4hkDPHgqLV2try2h74ox0wRHdb7.H/]/>
	at org.junit.Assert.assertEquals(Assert.java:115)
	at org.junit.Assert.assertEquals(Assert.java:144)
	at org.apache.commons.codec.digest.Sha512CryptTest.testSha512CryptBytes(Sha512CryptTest.java:46)

testSha512CryptStrings(org.apache.commons.codec.digest.Sha512CryptTest)  Time elapsed: 0.018 sec  <<< FAILURE!
org.junit.ComparisonFailure: expected:<$6$[foo$Nywkte7LPWjaJhWjNeGJN.dFdY3pN1wYlGifyRLYOVlGS9EMSiZaDDe/BGSOYQ327q9.32I4UqQ5odsqvsBL]X/> but was:<$6$[ik.0YyYl$L.s/L4myx/lFOGjbDdK2ePKikzQ/YX3Ua/OEvcH42eejqBPQ43vshaM8sKLq66jYMllwsoa5uSBfgxu2Y.iW]X/>
	at org.junit.Assert.assertEquals(Assert.java:115)
	at org.junit.Assert.assertEquals(Assert.java:144)
	at org.apache.commons.codec.digest.Sha512CryptTest.testSha512CryptStrings(Sha512CryptTest.java:33)

Running org.apache.commons.codec.digest.Apr1CryptTest
Tests run: 8, Failures: 0, Errors: 0, Skipped: 0, Time elapsed: 0.077 sec - in org.apache.commons.codec.digest.Apr1CryptTest
Running org.apache.commons.codec.digest.HmacUtilsTest
Tests run: 24, Failures: 0, Errors: 0, Skipped: 0, Time elapsed: 0.034 sec - in org.apache.commons.codec.digest.HmacUtilsTest
Running org.apache.commons.codec.digest.Sha2CryptTest
Tests run: 1, Failures: 0, Errors: 0, Skipped: 0, Time elapsed: 0 sec - in org.apache.commons.codec.digest.Sha2CryptTest
Running org.apache.commons.codec.digest.CryptTest
Tests run: 4, Failures: 1, Errors: 2, Skipped: 0, Time elapsed: 0.028 sec <<< FAILURE! - in org.apache.commons.codec.digest.CryptTest
testDefaultCryptVariant(org.apache.commons.codec.digest.CryptTest)  Time elapsed: 0.001 sec  <<< ERROR!
java.lang.NullPointerException: null
	at org.apache.commons.codec.digest.Crypt.crypt(Crypt.java:12)
	at org.apache.commons.codec.digest.Crypt.crypt(Crypt.java:17)
	at org.apache.commons.codec.digest.Crypt.crypt(Crypt.java:16)
	at org.apache.commons.codec.digest.CryptTest.testDefaultCryptVariant(CryptTest.java:35)

testCryptWithEmptySalt(org.apache.commons.codec.digest.CryptTest)  Time elapsed: 0.027 sec  <<< FAILURE!
java.lang.AssertionError: Expected exception: java.lang.IllegalArgumentException
	at org.junit.internal.runners.statements.ExpectException.evaluate(ExpectException.java:32)
	at org.junit.runners.ParentRunner.runLeaf(ParentRunner.java:271)
	at org.junit.runners.BlockJUnit4ClassRunner.runChild(BlockJUnit4ClassRunner.java:70)
	at org.junit.runners.BlockJUnit4ClassRunner.runChild(BlockJUnit4ClassRunner.java:50)
	at org.junit.runners.ParentRunner$3.run(ParentRunner.java:238)
	at org.junit.runners.ParentRunner$1.schedule(ParentRunner.java:63)
	at org.junit.runners.ParentRunner.runChildren(ParentRunner.java:236)
	at org.junit.runners.ParentRunner.access$000(ParentRunner.java:53)
	at org.junit.runners.ParentRunner$2.evaluate(ParentRunner.java:229)
	at org.junit.runners.ParentRunner.run(ParentRunner.java:309)
	at org.apache.maven.surefire.junit4.JUnit4Provider.execute(JUnit4Provider.java:264)
	at org.apache.maven.surefire.junit4.JUnit4Provider.executeTestSet(JUnit4Provider.java:153)
	at org.apache.maven.surefire.junit4.JUnit4Provider.invoke(JUnit4Provider.java:124)
	at org.apache.maven.surefire.booter.ForkedBooter.invokeProviderInSameClassLoader(ForkedBooter.java:200)
	at org.apache.maven.surefire.booter.ForkedBooter.runSuitesInProcess(ForkedBooter.java:153)
	at org.apache.maven.surefire.booter.ForkedBooter.main(ForkedBooter.java:103)

testCryptWithBytes(org.apache.commons.codec.digest.CryptTest)  Time elapsed: 0 sec  <<< ERROR!
java.lang.NullPointerException: null
	at org.apache.commons.codec.digest.Crypt.crypt(Crypt.java:12)
	at org.apache.commons.codec.digest.Crypt.crypt(Crypt.java:10)
	at org.apache.commons.codec.digest.CryptTest.testCryptWithBytes(CryptTest.java:42)

Running org.apache.commons.codec.digest.Sha256CryptTest
Tests run: 7, Failures: 2, Errors: 0, Skipped: 0, Time elapsed: 0.111 sec <<< FAILURE! - in org.apache.commons.codec.digest.Sha256CryptTest
testSha256CryptBytes(org.apache.commons.codec.digest.Sha256CryptTest)  Time elapsed: 0.021 sec  <<< FAILURE!
org.junit.ComparisonFailure: expected:<$[5$foo$Fq9CX624QIfnCAmlGiPKLlAasdacKCRxZztPoeo7o0B]> but was:<$[6$Q7MF/B7f$NMTRH7dIuhYqWNdhleMg.sOUwKcXKfxLTUNyZSxGOG06PLhadJzRlfKbM.BSvkwT4a94RxUMWshGspLBVCbHe0]>
	at org.junit.Assert.assertEquals(Assert.java:115)
	at org.junit.Assert.assertEquals(Assert.java:144)
	at org.apache.commons.codec.digest.Sha256CryptTest.testSha256CryptBytes(Sha256CryptTest.java:45)

testSha256CryptStrings(org.apache.commons.codec.digest.Sha256CryptTest)  Time elapsed: 0.007 sec  <<< FAILURE!
org.junit.ComparisonFailure: expected:<$[5$foo$Fq9CX624QIfnCAmlGiPKLlAasdacKCRxZztPoeo7o0B]> but was:<$[6$DbDhwi6y$4xJBKifOQhEa2V7rVHDwi5IpkIfWRVTu2A0mcmBTx2FBVpypR.vMExFINqXGM09DI8syGJ7df5oTkl4f2SlT0/]>
	at org.junit.Assert.assertEquals(Assert.java:115)
	at org.junit.Assert.assertEquals(Assert.java:144)
	at org.apache.commons.codec.digest.Sha256CryptTest.testSha256CryptStrings(Sha256CryptTest.java:32)

Running org.apache.commons.codec.digest.Md5CryptTest
Tests run: 7, Failures: 3, Errors: 0, Skipped: 0, Time elapsed: 0.03 sec <<< FAILURE! - in org.apache.commons.codec.digest.Md5CryptTest
testMd5CryptBytes(org.apache.commons.codec.digest.Md5CryptTest)  Time elapsed: 0.006 sec  <<< FAILURE!
org.junit.ComparisonFailure: expected:<$[1$foo$9mS5ExwgIECGE5YKlD5o91]> but was:<$[6$f4UnBIEh$CjtZ6W.QZOr.FXq3EsN3T6ss5TiNgmUq7nwozw8yu6GNEADEQhMfJAkyyYUEIRxgInjqnwVZXsxmMP1A8Ummm.]>
	at org.junit.Assert.assertEquals(Assert.java:115)
	at org.junit.Assert.assertEquals(Assert.java:144)
	at org.apache.commons.codec.digest.Md5CryptTest.testMd5CryptBytes(Md5CryptTest.java:49)

testMd5CryptLongInput(org.apache.commons.codec.digest.Md5CryptTest)  Time elapsed: 0.01 sec  <<< FAILURE!
org.junit.ComparisonFailure: expected:<$[1$1234$MoxekaNNUgfPRVqoeYjCD/]> but was:<$[6$vf9PHlaj$eU9AVxVw0I/S10o/04e.dPLB9Ix7hCbRbPjDPuGbDqGYuCoqa9oTeo/YVG/WX1ggZU7wNNQTyeE.UEJOxTWlA0]>
	at org.junit.Assert.assertEquals(Assert.java:115)
	at org.junit.Assert.assertEquals(Assert.java:144)
	at org.apache.commons.codec.digest.Md5CryptTest.testMd5CryptLongInput(Md5CryptTest.java:64)

testMd5CryptStrings(org.apache.commons.codec.digest.Md5CryptTest)  Time elapsed: 0.012 sec  <<< FAILURE!
org.junit.ComparisonFailure: expected:<$[1$foo$9mS5ExwgIECGE5YKlD5o91]> but was:<$[6$BYu.R4D/$z.z5QZLn1h1gI3t/Y9bDtNS8gzdDfRcLKR4V0iL0ldIf1eZhKFnLZhEb7nxnXWzO5xB/yL8YyHVAHCFzrNOfR/]>
	at org.junit.Assert.assertEquals(Assert.java:115)
	at org.junit.Assert.assertEquals(Assert.java:144)
	at org.apache.commons.codec.digest.Md5CryptTest.testMd5CryptStrings(Md5CryptTest.java:36)

Running org.apache.commons.codec.digest.UnixCryptTest
Tests run: 9, Failures: 2, Errors: 0, Skipped: 0, Time elapsed: 0.019 sec <<< FAILURE! - in org.apache.commons.codec.digest.UnixCryptTest
testUnixCryptStrings(org.apache.commons.codec.digest.UnixCryptTest)  Time elapsed: 0.008 sec  <<< FAILURE!
org.junit.ComparisonFailure: expected:<[xxWAum7tHdIUw]> but was:<[$6$9.Wp0SsC$nrIutkaEpMTjeyvA9eln8KtQ2RT.PulziKDdORgKSeUkjYrcCE/78mmuxPkuVRTAO1m0LLrKNgVE5zElipMEi0]>
	at org.junit.Assert.assertEquals(Assert.java:115)
	at org.junit.Assert.assertEquals(Assert.java:144)
	at org.apache.commons.codec.digest.UnixCryptTest.testUnixCryptStrings(UnixCryptTest.java:37)

testUnixCryptBytes(org.apache.commons.codec.digest.UnixCryptTest)  Time elapsed: 0.008 sec  <<< FAILURE!
org.junit.ComparisonFailure: expected:<[12UFlHxel6uMM]> but was:<[$6$oAC1Fp3Y$FwsQF1f5tyy0dHbJ3IDIBDqbKvHvq5nOUda2/npElDB/njMTKqmzv2Bb2QDtbBS25Gp9dIM4tBwa1oPw6cxdD0]>
	at org.junit.Assert.assertEquals(Assert.java:115)
	at org.junit.Assert.assertEquals(Assert.java:144)
	at org.apache.commons.codec.digest.UnixCryptTest.testUnixCryptBytes(UnixCryptTest.java:48)

Running org.apache.commons.codec.CharsetsTest
Tests run: 7, Failures: 0, Errors: 0, Skipped: 0, Time elapsed: 0.001 sec - in org.apache.commons.codec.CharsetsTest
Running org.apache.commons.codec.binary.Base32Test
Tests run: 8, Failures: 0, Errors: 0, Skipped: 0, Time elapsed: 0.001 sec - in org.apache.commons.codec.binary.Base32Test
Running org.apache.commons.codec.binary.Base64OutputStreamTest
Tests run: 7, Failures: 0, Errors: 0, Skipped: 0, Time elapsed: 0.215 sec - in org.apache.commons.codec.binary.Base64OutputStreamTest
Running org.apache.commons.codec.binary.Base64Codec13Test
Tests run: 8, Failures: 0, Errors: 0, Skipped: 0, Time elapsed: 0.01 sec - in org.apache.commons.codec.binary.Base64Codec13Test
Running org.apache.commons.codec.binary.Base64InputStreamTest
Tests run: 19, Failures: 0, Errors: 0, Skipped: 0, Time elapsed: 0.112 sec - in org.apache.commons.codec.binary.Base64InputStreamTest
Running org.apache.commons.codec.binary.Base32InputStreamTest
Tests run: 16, Failures: 0, Errors: 0, Skipped: 0, Time elapsed: 0.189 sec - in org.apache.commons.codec.binary.Base32InputStreamTest
Running org.apache.commons.codec.binary.Base32OutputStreamTest
Tests run: 6, Failures: 0, Errors: 0, Skipped: 0, Time elapsed: 0.087 sec - in org.apache.commons.codec.binary.Base32OutputStreamTest
Running org.apache.commons.codec.binary.BinaryCodecTest
Tests run: 13, Failures: 0, Errors: 0, Skipped: 0, Time elapsed: 0.009 sec - in org.apache.commons.codec.binary.BinaryCodecTest
Running org.apache.commons.codec.binary.BaseNCodecTest
Tests run: 7, Failures: 0, Errors: 0, Skipped: 0, Time elapsed: 0.002 sec - in org.apache.commons.codec.binary.BaseNCodecTest
Running org.apache.commons.codec.binary.StringUtilsTest
Tests run: 17, Failures: 0, Errors: 0, Skipped: 0, Time elapsed: 0.025 sec - in org.apache.commons.codec.binary.StringUtilsTest
Running org.apache.commons.codec.binary.Base64Test
Tests run: 53, Failures: 0, Errors: 0, Skipped: 1, Time elapsed: 0.042 sec - in org.apache.commons.codec.binary.Base64Test
Running org.apache.commons.codec.binary.HexTest
Tests run: 19, Failures: 0, Errors: 0, Skipped: 0, Time elapsed: 0.177 sec - in org.apache.commons.codec.binary.HexTest
Running org.apache.commons.codec.DecoderExceptionTest
Tests run: 4, Failures: 0, Errors: 0, Skipped: 0, Time elapsed: 0 sec - in org.apache.commons.codec.DecoderExceptionTest
Running org.apache.commons.codec.EncoderExceptionTest
Tests run: 4, Failures: 0, Errors: 0, Skipped: 0, Time elapsed: 0.001 sec - in org.apache.commons.codec.EncoderExceptionTest
Running org.apache.commons.codec.net.BCodecTest
Tests run: 9, Failures: 0, Errors: 0, Skipped: 0, Time elapsed: 0.001 sec - in org.apache.commons.codec.net.BCodecTest
Running org.apache.commons.codec.net.QCodecTest
Tests run: 12, Failures: 0, Errors: 0, Skipped: 0, Time elapsed: 0.001 sec - in org.apache.commons.codec.net.QCodecTest
Running org.apache.commons.codec.net.UtilsTest
Tests run: 1, Failures: 0, Errors: 0, Skipped: 0, Time elapsed: 0 sec - in org.apache.commons.codec.net.UtilsTest
Running org.apache.commons.codec.net.RFC1522CodecTest
Tests run: 2, Failures: 0, Errors: 0, Skipped: 0, Time elapsed: 0 sec - in org.apache.commons.codec.net.RFC1522CodecTest
Running org.apache.commons.codec.net.URLCodecTest
Tests run: 16, Failures: 0, Errors: 0, Skipped: 0, Time elapsed: 0.004 sec - in org.apache.commons.codec.net.URLCodecTest
Running org.apache.commons.codec.net.QuotedPrintableCodecTest
Tests run: 21, Failures: 0, Errors: 0, Skipped: 0, Time elapsed: 0.012 sec - in org.apache.commons.codec.net.QuotedPrintableCodecTest
Running org.apache.commons.codec.StringEncoderComparatorTest
Tests run: 3, Failures: 0, Errors: 0, Skipped: 0, Time elapsed: 0.002 sec - in org.apache.commons.codec.StringEncoderComparatorTest
Running org.apache.commons.codec.language.Caverphone1Test
Tests run: 9, Failures: 0, Errors: 0, Skipped: 0, Time elapsed: 0.029 sec - in org.apache.commons.codec.language.Caverphone1Test
Running org.apache.commons.codec.language.NysiisTest
Tests run: 23, Failures: 0, Errors: 0, Skipped: 0, Time elapsed: 0.017 sec - in org.apache.commons.codec.language.NysiisTest
Running org.apache.commons.codec.language.Caverphone2Test
Tests run: 13, Failures: 0, Errors: 0, Skipped: 0, Time elapsed: 0.127 sec - in org.apache.commons.codec.language.Caverphone2Test
Running org.apache.commons.codec.language.DaitchMokotoffSoundexTest
Tests run: 13, Failures: 0, Errors: 0, Skipped: 0, Time elapsed: 0.051 sec - in org.apache.commons.codec.language.DaitchMokotoffSoundexTest
Running org.apache.commons.codec.language.bm.BeiderMorseEncoderTest
Tests run: 22, Failures: 0, Errors: 0, Skipped: 0, Time elapsed: 3.066 sec - in org.apache.commons.codec.language.bm.BeiderMorseEncoderTest
Running org.apache.commons.codec.language.bm.PhoneticEngineTest
Tests run: 8, Failures: 0, Errors: 0, Skipped: 0, Time elapsed: 0.021 sec - in org.apache.commons.codec.language.bm.PhoneticEngineTest
Running org.apache.commons.codec.language.bm.PhoneticEngineRegressionTest
Tests run: 4, Failures: 0, Errors: 0, Skipped: 0, Time elapsed: 0.017 sec - in org.apache.commons.codec.language.bm.PhoneticEngineRegressionTest
Running org.apache.commons.codec.language.bm.RuleTest
Tests run: 3, Failures: 0, Errors: 0, Skipped: 0, Time elapsed: 0.002 sec - in org.apache.commons.codec.language.bm.RuleTest
Running org.apache.commons.codec.language.bm.LanguageGuessingTest
Tests run: 18, Failures: 0, Errors: 0, Skipped: 0, Time elapsed: 0.011 sec - in org.apache.commons.codec.language.bm.LanguageGuessingTest
Running org.apache.commons.codec.language.DoubleMetaphoneTest
Tests run: 16, Failures: 0, Errors: 0, Skipped: 0, Time elapsed: 0.057 sec - in org.apache.commons.codec.language.DoubleMetaphoneTest
Running org.apache.commons.codec.language.SoundexTest
Tests run: 28, Failures: 0, Errors: 0, Skipped: 0, Time elapsed: 0.013 sec - in org.apache.commons.codec.language.SoundexTest
Running org.apache.commons.codec.language.RefinedSoundexTest
Tests run: 10, Failures: 0, Errors: 0, Skipped: 0, Time elapsed: 0.003 sec - in org.apache.commons.codec.language.RefinedSoundexTest
Running org.apache.commons.codec.language.MatchRatingApproachEncoderTest
Tests run: 96, Failures: 0, Errors: 0, Skipped: 0, Time elapsed: 0.036 sec - in org.apache.commons.codec.language.MatchRatingApproachEncoderTest
Running org.apache.commons.codec.language.ColognePhoneticTest
Tests run: 13, Failures: 0, Errors: 0, Skipped: 0, Time elapsed: 0.001 sec - in org.apache.commons.codec.language.ColognePhoneticTest
Running org.apache.commons.codec.language.DoubleMetaphone2Test
Tests run: 6, Failures: 0, Errors: 0, Skipped: 0, Time elapsed: 0.035 sec - in org.apache.commons.codec.language.DoubleMetaphone2Test
Running org.apache.commons.codec.language.MetaphoneTest
Tests run: 34, Failures: 0, Errors: 0, Skipped: 0, Time elapsed: 0.101 sec - in org.apache.commons.codec.language.MetaphoneTest
Running org.apache.commons.codec.CharEncodingTest
Tests run: 7, Failures: 0, Errors: 0, Skipped: 0, Time elapsed: 0 sec - in org.apache.commons.codec.CharEncodingTest

Results :

Failed tests: 
  Sha512CryptTest.testSha512CryptBytes:46 expected:<$6$[foo$Nywkte7LPWjaJhWjNeGJN.dFdY3pN1wYlGifyRLYOVlGS9EMSiZaDDe/BGSOYQ327q9.32I4UqQ5odsqvsBLX]/> but was:<$6$[Wk.TIShU$jZ.A8JlF4sLLIFZyJaPCoVz37CNqUuCrnbimyKUZx6D8XF5DSjQLalY4hkDPHgqLV2try2h74ox0wRHdb7.H/]/>
  Sha512CryptTest.testSha512CryptStrings:33 expected:<$6$[foo$Nywkte7LPWjaJhWjNeGJN.dFdY3pN1wYlGifyRLYOVlGS9EMSiZaDDe/BGSOYQ327q9.32I4UqQ5odsqvsBL]X/> but was:<$6$[ik.0YyYl$L.s/L4myx/lFOGjbDdK2ePKikzQ/YX3Ua/OEvcH42eejqBPQ43vshaM8sKLq66jYMllwsoa5uSBfgxu2Y.iW]X/>
  CryptTest.testCryptWithEmptySalt Expected exception: java.lang.IllegalArgumentException
  Sha256CryptTest.testSha256CryptBytes:45 expected:<$[5$foo$Fq9CX624QIfnCAmlGiPKLlAasdacKCRxZztPoeo7o0B]> but was:<$[6$Q7MF/B7f$NMTRH7dIuhYqWNdhleMg.sOUwKcXKfxLTUNyZSxGOG06PLhadJzRlfKbM.BSvkwT4a94RxUMWshGspLBVCbHe0]>
  Sha256CryptTest.testSha256CryptStrings:32 expected:<$[5$foo$Fq9CX624QIfnCAmlGiPKLlAasdacKCRxZztPoeo7o0B]> but was:<$[6$DbDhwi6y$4xJBKifOQhEa2V7rVHDwi5IpkIfWRVTu2A0mcmBTx2FBVpypR.vMExFINqXGM09DI8syGJ7df5oTkl4f2SlT0/]>
  Md5CryptTest.testMd5CryptBytes:49 expected:<$[1$foo$9mS5ExwgIECGE5YKlD5o91]> but was:<$[6$f4UnBIEh$CjtZ6W.QZOr.FXq3EsN3T6ss5TiNgmUq7nwozw8yu6GNEADEQhMfJAkyyYUEIRxgInjqnwVZXsxmMP1A8Ummm.]>
  Md5CryptTest.testMd5CryptLongInput:64 expected:<$[1$1234$MoxekaNNUgfPRVqoeYjCD/]> but was:<$[6$vf9PHlaj$eU9AVxVw0I/S10o/04e.dPLB9Ix7hCbRbPjDPuGbDqGYuCoqa9oTeo/YVG/WX1ggZU7wNNQTyeE.UEJOxTWlA0]>
  Md5CryptTest.testMd5CryptStrings:36 expected:<$[1$foo$9mS5ExwgIECGE5YKlD5o91]> but was:<$[6$BYu.R4D/$z.z5QZLn1h1gI3t/Y9bDtNS8gzdDfRcLKR4V0iL0ldIf1eZhKFnLZhEb7nxnXWzO5xB/yL8YyHVAHCFzrNOfR/]>
  UnixCryptTest.testUnixCryptStrings:37 expected:<[xxWAum7tHdIUw]> but was:<[$6$9.Wp0SsC$nrIutkaEpMTjeyvA9eln8KtQ2RT.PulziKDdORgKSeUkjYrcCE/78mmuxPkuVRTAO1m0LLrKNgVE5zElipMEi0]>
  UnixCryptTest.testUnixCryptBytes:48 expected:<[12UFlHxel6uMM]> but was:<[$6$oAC1Fp3Y$FwsQF1f5tyy0dHbJ3IDIBDqbKvHvq5nOUda2/npElDB/njMTKqmzv2Bb2QDtbBS25Gp9dIM4tBwa1oPw6cxdD0]>

Tests in error: 
  CryptTest.testDefaultCryptVariant:35 » NullPointer
  CryptTest.testCryptWithBytes:42 » NullPointer

Tests run: 662, Failures: 10, Errors: 2, Skipped: 1

[INFO] ------------------------------------------------------------------------
[INFO] BUILD FAILURE
[INFO] ------------------------------------------------------------------------
[INFO] Total time: 13.719s
[INFO] Finished at: Sun Aug 02 08:09:10 BST 2015
[INFO] Final Memory: 20M/344M
[INFO] ------------------------------------------------------------------------
[ERROR] Failed to execute goal org.apache.maven.plugins:maven-surefire-plugin:2.17:test (default-test) on project commons-codec: There are test failures.
[ERROR] 
[ERROR] Please refer to /home/perham/Study/LittleDarwin/Cases/commons-codec-1.10-src/target/surefire-reports for the individual test results.
[ERROR] -> [Help 1]
[ERROR] 
[ERROR] To see the full stack trace of the errors, re-run Maven with the -e switch.
[ERROR] Re-run Maven using the -X switch to enable full debug logging.
[ERROR] 
[ERROR] For more information about the errors and possible solutions, please read the following articles:
[ERROR] [Help 1] http://cwiki.apache.org/confluence/display/MAVEN/MojoFailureException
