[INFO] Scanning for projects...
[INFO]                                                                         
[INFO] ------------------------------------------------------------------------
[INFO] Building Apache Commons Codec 1.10
[INFO] ------------------------------------------------------------------------
[INFO] 
[INFO] --- maven-enforcer-plugin:1.3.1:enforce (enforce-maven-3) @ commons-codec ---
[INFO] 
[INFO] --- maven-antrun-plugin:1.7:run (javadoc.resources) @ commons-codec ---
[INFO] Executing tasks

main:
[INFO] Executed tasks
[INFO] 
[INFO] --- maven-remote-resources-plugin:1.5:process (default) @ commons-codec ---
[INFO] 
[INFO] --- buildnumber-maven-plugin:1.3:create (default) @ commons-codec ---
[INFO] Executing: /bin/sh -c cd /home/perham/Study/LittleDarwin/Cases/commons-codec-1.10-src && svn --non-interactive info
[INFO] Working directory: /home/perham/Study/LittleDarwin/Cases/commons-codec-1.10-src
[INFO] Storing buildNumber: ?????? at timestamp: 1438499213710
[INFO] Executing: /bin/sh -c cd /home/perham/Study/LittleDarwin/Cases/commons-codec-1.10-src && svn --non-interactive info
[INFO] Working directory: /home/perham/Study/LittleDarwin/Cases/commons-codec-1.10-src
[INFO] Storing buildScmBranch: UNKNOWN_BRANCH
[INFO] 
[INFO] --- maven-resources-plugin:2.7:resources (default-resources) @ commons-codec ---
[INFO] Using 'UTF-8' encoding to copy filtered resources.
[INFO] Copying 128 resources
[INFO] Copying 2 resources to META-INF
[INFO] 
[INFO] --- maven-compiler-plugin:3.2:compile (default-compile) @ commons-codec ---
[INFO] Changes detected - recompiling the module!
[INFO] Compiling 60 source files to /home/perham/Study/LittleDarwin/Cases/commons-codec-1.10-src/target/classes
[INFO] /home/perham/Study/LittleDarwin/Cases/commons-codec-1.10-src/src/main/java/org/apache/commons/codec/digest/Sha2Crypt.java: Some input files use or override a deprecated API.
[INFO] /home/perham/Study/LittleDarwin/Cases/commons-codec-1.10-src/src/main/java/org/apache/commons/codec/digest/Sha2Crypt.java: Recompile with -Xlint:deprecation for details.
[INFO] 
[INFO] --- maven-bundle-plugin:2.5.3:manifest (bundle-manifest) @ commons-codec ---
[INFO] 
[INFO] --- maven-resources-plugin:2.7:testResources (default-testResources) @ commons-codec ---
[INFO] Using 'UTF-8' encoding to copy filtered resources.
[INFO] skip non existing resourceDirectory /home/perham/Study/LittleDarwin/Cases/commons-codec-1.10-src/src/test/resources
[INFO] Copying 2 resources to META-INF
[INFO] 
[INFO] --- maven-compiler-plugin:3.2:testCompile (default-testCompile) @ commons-codec ---
[INFO] Nothing to compile - all classes are up to date
[INFO] 
[INFO] --- maven-surefire-plugin:2.17:test (default-test) @ commons-codec ---
[INFO] Surefire report directory: /home/perham/Study/LittleDarwin/Cases/commons-codec-1.10-src/target/surefire-reports

-------------------------------------------------------
 T E S T S
-------------------------------------------------------
Running org.apache.commons.codec.digest.B64Test
Tests run: 2, Failures: 1, Errors: 0, Skipped: 0, Time elapsed: 0.034 sec <<< FAILURE! - in org.apache.commons.codec.digest.B64Test
testB64from24bit(org.apache.commons.codec.digest.B64Test)  Time elapsed: 0.005 sec  <<< FAILURE!
org.junit.ComparisonFailure: expected:<[./spo/]> but was:<[zzzzzz]>
	at org.junit.Assert.assertEquals(Assert.java:115)
	at org.junit.Assert.assertEquals(Assert.java:144)
	at org.apache.commons.codec.digest.B64Test.testB64from24bit(B64Test.java:37)

Running org.apache.commons.codec.digest.DigestUtilsTest
Tests run: 17, Failures: 0, Errors: 0, Skipped: 0, Time elapsed: 0.664 sec - in org.apache.commons.codec.digest.DigestUtilsTest
Running org.apache.commons.codec.digest.Sha512CryptTest
Tests run: 8, Failures: 4, Errors: 0, Skipped: 0, Time elapsed: 0.339 sec <<< FAILURE! - in org.apache.commons.codec.digest.Sha512CryptTest
testSha2CryptRounds(org.apache.commons.codec.digest.Sha512CryptTest)  Time elapsed: 0.024 sec  <<< FAILURE!
org.junit.ComparisonFailure: expected:<$5$rounds=1000$abcd$[b8MCU4GEeZIekOy5ahQ8EWfT330hvYGVeDYkBxXBva.]> but was:<$5$rounds=1000$abcd$[zzzzzzzzzzzzzzzzzzzzzzzzzzzzzzzzzzzzzzzzzzz]>
	at org.junit.Assert.assertEquals(Assert.java:115)
	at org.junit.Assert.assertEquals(Assert.java:144)
	at org.apache.commons.codec.digest.Sha512CryptTest.testSha2CryptRounds(Sha512CryptTest.java:73)

testSha256LargetThanBlocksize(org.apache.commons.codec.digest.Sha512CryptTest)  Time elapsed: 0.121 sec  <<< FAILURE!
org.junit.ComparisonFailure: expected:<$6$abc$[oP/h8PRhCKIA66KSTjGwNsQMSLLZnuFOTjOhrqNrDkKgjTlpePSqibB0qtmDapMbP/zN1cUEYSeHFrpgqZ.GG1]> but was:<$6$abc$[zzzzzzzzzzzzzzzzzzzzzzzzzzzzzzzzzzzzzzzzzzzzzzzzzzzzzzzzzzzzzzzzzzzzzzzzzzzzzzzzzzzzzz]>
	at org.junit.Assert.assertEquals(Assert.java:115)
	at org.junit.Assert.assertEquals(Assert.java:144)
	at org.apache.commons.codec.digest.Sha512CryptTest.testSha256LargetThanBlocksize(Sha512CryptTest.java:92)

testSha512CryptBytes(org.apache.commons.codec.digest.Sha512CryptTest)  Time elapsed: 0.085 sec  <<< FAILURE!
org.junit.ComparisonFailure: expected:<$6$foo$[Nywkte7LPWjaJhWjNeGJN.dFdY3pN1wYlGifyRLYOVlGS9EMSiZaDDe/BGSOYQ327q9.32I4UqQ5odsqvsBLX/]> but was:<$6$foo$[zzzzzzzzzzzzzzzzzzzzzzzzzzzzzzzzzzzzzzzzzzzzzzzzzzzzzzzzzzzzzzzzzzzzzzzzzzzzzzzzzzzzzz]>
	at org.junit.Assert.assertEquals(Assert.java:115)
	at org.junit.Assert.assertEquals(Assert.java:144)
	at org.apache.commons.codec.digest.Sha512CryptTest.testSha512CryptBytes(Sha512CryptTest.java:46)

testSha512CryptStrings(org.apache.commons.codec.digest.Sha512CryptTest)  Time elapsed: 0.048 sec  <<< FAILURE!
org.junit.ComparisonFailure: expected:<$6$foo$[Nywkte7LPWjaJhWjNeGJN.dFdY3pN1wYlGifyRLYOVlGS9EMSiZaDDe/BGSOYQ327q9.32I4UqQ5odsqvsBLX/]> but was:<$6$foo$[zzzzzzzzzzzzzzzzzzzzzzzzzzzzzzzzzzzzzzzzzzzzzzzzzzzzzzzzzzzzzzzzzzzzzzzzzzzzzzzzzzzzzz]>
	at org.junit.Assert.assertEquals(Assert.java:115)
	at org.junit.Assert.assertEquals(Assert.java:144)
	at org.apache.commons.codec.digest.Sha512CryptTest.testSha512CryptStrings(Sha512CryptTest.java:33)

Running org.apache.commons.codec.digest.Apr1CryptTest
Tests run: 8, Failures: 4, Errors: 0, Skipped: 0, Time elapsed: 0.059 sec <<< FAILURE! - in org.apache.commons.codec.digest.Apr1CryptTest
testApr1CryptBytes(org.apache.commons.codec.digest.Apr1CryptTest)  Time elapsed: 0.017 sec  <<< FAILURE!
org.junit.ComparisonFailure: expected:<$apr1$foo$[P27KyD1htb4EllIPEYhqi0]> but was:<$apr1$foo$[zzzzzzzzzzzzzzzzzzzzzz]>
	at org.junit.Assert.assertEquals(Assert.java:115)
	at org.junit.Assert.assertEquals(Assert.java:144)
	at org.apache.commons.codec.digest.Apr1CryptTest.testApr1CryptBytes(Apr1CryptTest.java:51)

testApr1LongSalt(org.apache.commons.codec.digest.Apr1CryptTest)  Time elapsed: 0.008 sec  <<< FAILURE!
org.junit.ComparisonFailure: expected:<$apr1$12345678$[0lqb/6VUFP8JY/s/jTrIk0]> but was:<$apr1$12345678$[zzzzzzzzzzzzzzzzzzzzzz]>
	at org.junit.Assert.assertEquals(Assert.java:115)
	at org.junit.Assert.assertEquals(Assert.java:144)
	at org.apache.commons.codec.digest.Apr1CryptTest.testApr1LongSalt(Apr1CryptTest.java:69)

testApr1CryptExplicitCall(org.apache.commons.codec.digest.Apr1CryptTest)  Time elapsed: 0.008 sec  <<< FAILURE!
org.junit.ComparisonFailure: expected:<$apr1$1234$[mAlH7FRST6FiRZ.kcYL.j1]> but was:<$apr1$1234$[zzzzzzzzzzzzzzzzzzzzzz]>
	at org.junit.Assert.assertEquals(Assert.java:115)
	at org.junit.Assert.assertEquals(Assert.java:144)
	at org.apache.commons.codec.digest.Apr1CryptTest.testApr1CryptExplicitCall(Apr1CryptTest.java:61)

testApr1CryptStrings(org.apache.commons.codec.digest.Apr1CryptTest)  Time elapsed: 0.008 sec  <<< FAILURE!
org.junit.ComparisonFailure: expected:<$apr1$TqI9WECO$[LHZB2DqRlk9nObiB6vJG9.]> but was:<$apr1$TqI9WECO$[zzzzzzzzzzzzzzzzzzzzzz]>
	at org.junit.Assert.assertEquals(Assert.java:115)
	at org.junit.Assert.assertEquals(Assert.java:144)
	at org.apache.commons.codec.digest.Apr1CryptTest.testApr1CryptStrings(Apr1CryptTest.java:31)

Running org.apache.commons.codec.digest.HmacUtilsTest
Tests run: 24, Failures: 0, Errors: 0, Skipped: 0, Time elapsed: 0.038 sec - in org.apache.commons.codec.digest.HmacUtilsTest
Running org.apache.commons.codec.digest.Sha2CryptTest
Tests run: 1, Failures: 0, Errors: 0, Skipped: 0, Time elapsed: 0 sec - in org.apache.commons.codec.digest.Sha2CryptTest
Running org.apache.commons.codec.digest.CryptTest
Tests run: 4, Failures: 0, Errors: 0, Skipped: 0, Time elapsed: 0.128 sec - in org.apache.commons.codec.digest.CryptTest
Running org.apache.commons.codec.digest.Sha256CryptTest
Tests run: 7, Failures: 4, Errors: 0, Skipped: 0, Time elapsed: 0.104 sec <<< FAILURE! - in org.apache.commons.codec.digest.Sha256CryptTest
testSha256CryptBytes(org.apache.commons.codec.digest.Sha256CryptTest)  Time elapsed: 0.035 sec  <<< FAILURE!
org.junit.ComparisonFailure: expected:<$5$foo$[Fq9CX624QIfnCAmlGiPKLlAasdacKCRxZztPoeo7o0B]> but was:<$5$foo$[zzzzzzzzzzzzzzzzzzzzzzzzzzzzzzzzzzzzzzzzzzz]>
	at org.junit.Assert.assertEquals(Assert.java:115)
	at org.junit.Assert.assertEquals(Assert.java:144)
	at org.apache.commons.codec.digest.Sha256CryptTest.testSha256CryptBytes(Sha256CryptTest.java:45)

testSha2CryptRounds(org.apache.commons.codec.digest.Sha256CryptTest)  Time elapsed: 0.007 sec  <<< FAILURE!
org.junit.ComparisonFailure: expected:<$5$rounds=1000$abcd$[b8MCU4GEeZIekOy5ahQ8EWfT330hvYGVeDYkBxXBva.]> but was:<$5$rounds=1000$abcd$[zzzzzzzzzzzzzzzzzzzzzzzzzzzzzzzzzzzzzzzzzzz]>
	at org.junit.Assert.assertEquals(Assert.java:115)
	at org.junit.Assert.assertEquals(Assert.java:144)
	at org.apache.commons.codec.digest.Sha256CryptTest.testSha2CryptRounds(Sha256CryptTest.java:55)

testSha256LargetThanBlocksize(org.apache.commons.codec.digest.Sha256CryptTest)  Time elapsed: 0.031 sec  <<< FAILURE!
org.junit.ComparisonFailure: expected:<$5$abc$[HbF3RRc15OwNKB/RZZ5F.1I6zsLcKXHQoSdB9Owx/Q8]> but was:<$5$abc$[zzzzzzzzzzzzzzzzzzzzzzzzzzzzzzzzzzzzzzzzzzz]>
	at org.junit.Assert.assertEquals(Assert.java:115)
	at org.junit.Assert.assertEquals(Assert.java:144)
	at org.apache.commons.codec.digest.Sha256CryptTest.testSha256LargetThanBlocksize(Sha256CryptTest.java:80)

testSha256CryptStrings(org.apache.commons.codec.digest.Sha256CryptTest)  Time elapsed: 0.008 sec  <<< FAILURE!
org.junit.ComparisonFailure: expected:<$5$foo$[Fq9CX624QIfnCAmlGiPKLlAasdacKCRxZztPoeo7o0B]> but was:<$5$foo$[zzzzzzzzzzzzzzzzzzzzzzzzzzzzzzzzzzzzzzzzzzz]>
	at org.junit.Assert.assertEquals(Assert.java:115)
	at org.junit.Assert.assertEquals(Assert.java:144)
	at org.apache.commons.codec.digest.Sha256CryptTest.testSha256CryptStrings(Sha256CryptTest.java:32)

Running org.apache.commons.codec.digest.Md5CryptTest
Tests run: 7, Failures: 3, Errors: 0, Skipped: 0, Time elapsed: 0.014 sec <<< FAILURE! - in org.apache.commons.codec.digest.Md5CryptTest
testMd5CryptBytes(org.apache.commons.codec.digest.Md5CryptTest)  Time elapsed: 0.001 sec  <<< FAILURE!
org.junit.ComparisonFailure: expected:<$1$foo$[9mS5ExwgIECGE5YKlD5o91]> but was:<$1$foo$[zzzzzzzzzzzzzzzzzzzzzz]>
	at org.junit.Assert.assertEquals(Assert.java:115)
	at org.junit.Assert.assertEquals(Assert.java:144)
	at org.apache.commons.codec.digest.Md5CryptTest.testMd5CryptBytes(Md5CryptTest.java:49)

testMd5CryptLongInput(org.apache.commons.codec.digest.Md5CryptTest)  Time elapsed: 0.003 sec  <<< FAILURE!
org.junit.ComparisonFailure: expected:<$1$1234$[MoxekaNNUgfPRVqoeYjCD/]> but was:<$1$1234$[zzzzzzzzzzzzzzzzzzzzzz]>
	at org.junit.Assert.assertEquals(Assert.java:115)
	at org.junit.Assert.assertEquals(Assert.java:144)
	at org.apache.commons.codec.digest.Md5CryptTest.testMd5CryptLongInput(Md5CryptTest.java:64)

testMd5CryptStrings(org.apache.commons.codec.digest.Md5CryptTest)  Time elapsed: 0.003 sec  <<< FAILURE!
org.junit.ComparisonFailure: expected:<$1$foo$[9mS5ExwgIECGE5YKlD5o91]> but was:<$1$foo$[zzzzzzzzzzzzzzzzzzzzzz]>
	at org.junit.Assert.assertEquals(Assert.java:115)
	at org.junit.Assert.assertEquals(Assert.java:144)
	at org.apache.commons.codec.digest.Md5CryptTest.testMd5CryptStrings(Md5CryptTest.java:36)

Running org.apache.commons.codec.digest.UnixCryptTest
Tests run: 9, Failures: 0, Errors: 0, Skipped: 0, Time elapsed: 0.011 sec - in org.apache.commons.codec.digest.UnixCryptTest
Running org.apache.commons.codec.CharsetsTest
Tests run: 7, Failures: 0, Errors: 0, Skipped: 0, Time elapsed: 0.017 sec - in org.apache.commons.codec.CharsetsTest
Running org.apache.commons.codec.binary.Base32Test
Tests run: 8, Failures: 0, Errors: 0, Skipped: 0, Time elapsed: 0.009 sec - in org.apache.commons.codec.binary.Base32Test
Running org.apache.commons.codec.binary.Base64OutputStreamTest
Tests run: 7, Failures: 0, Errors: 0, Skipped: 0, Time elapsed: 0.215 sec - in org.apache.commons.codec.binary.Base64OutputStreamTest
Running org.apache.commons.codec.binary.Base64Codec13Test
Tests run: 8, Failures: 0, Errors: 0, Skipped: 0, Time elapsed: 0.011 sec - in org.apache.commons.codec.binary.Base64Codec13Test
Running org.apache.commons.codec.binary.Base64InputStreamTest
Tests run: 19, Failures: 0, Errors: 0, Skipped: 0, Time elapsed: 0.102 sec - in org.apache.commons.codec.binary.Base64InputStreamTest
Running org.apache.commons.codec.binary.Base32InputStreamTest
Tests run: 16, Failures: 0, Errors: 0, Skipped: 0, Time elapsed: 0.128 sec - in org.apache.commons.codec.binary.Base32InputStreamTest
Running org.apache.commons.codec.binary.Base32OutputStreamTest
Tests run: 6, Failures: 0, Errors: 0, Skipped: 0, Time elapsed: 0.087 sec - in org.apache.commons.codec.binary.Base32OutputStreamTest
Running org.apache.commons.codec.binary.BinaryCodecTest
Tests run: 13, Failures: 0, Errors: 0, Skipped: 0, Time elapsed: 0.01 sec - in org.apache.commons.codec.binary.BinaryCodecTest
Running org.apache.commons.codec.binary.BaseNCodecTest
Tests run: 7, Failures: 0, Errors: 0, Skipped: 0, Time elapsed: 0.003 sec - in org.apache.commons.codec.binary.BaseNCodecTest
Running org.apache.commons.codec.binary.StringUtilsTest
Tests run: 17, Failures: 0, Errors: 0, Skipped: 0, Time elapsed: 0.025 sec - in org.apache.commons.codec.binary.StringUtilsTest
Running org.apache.commons.codec.binary.Base64Test
Tests run: 53, Failures: 0, Errors: 0, Skipped: 1, Time elapsed: 0.04 sec - in org.apache.commons.codec.binary.Base64Test
Running org.apache.commons.codec.binary.HexTest
Tests run: 19, Failures: 0, Errors: 0, Skipped: 0, Time elapsed: 0.171 sec - in org.apache.commons.codec.binary.HexTest
Running org.apache.commons.codec.DecoderExceptionTest
Tests run: 4, Failures: 0, Errors: 0, Skipped: 0, Time elapsed: 0.001 sec - in org.apache.commons.codec.DecoderExceptionTest
Running org.apache.commons.codec.EncoderExceptionTest
Tests run: 4, Failures: 0, Errors: 0, Skipped: 0, Time elapsed: 0 sec - in org.apache.commons.codec.EncoderExceptionTest
Running org.apache.commons.codec.net.BCodecTest
Tests run: 9, Failures: 0, Errors: 0, Skipped: 0, Time elapsed: 0.006 sec - in org.apache.commons.codec.net.BCodecTest
Running org.apache.commons.codec.net.QCodecTest
Tests run: 12, Failures: 0, Errors: 0, Skipped: 0, Time elapsed: 0.006 sec - in org.apache.commons.codec.net.QCodecTest
Running org.apache.commons.codec.net.UtilsTest
Tests run: 1, Failures: 0, Errors: 0, Skipped: 0, Time elapsed: 0 sec - in org.apache.commons.codec.net.UtilsTest
Running org.apache.commons.codec.net.RFC1522CodecTest
Tests run: 2, Failures: 0, Errors: 0, Skipped: 0, Time elapsed: 0 sec - in org.apache.commons.codec.net.RFC1522CodecTest
Running org.apache.commons.codec.net.URLCodecTest
Tests run: 16, Failures: 0, Errors: 0, Skipped: 0, Time elapsed: 0.008 sec - in org.apache.commons.codec.net.URLCodecTest
Running org.apache.commons.codec.net.QuotedPrintableCodecTest
Tests run: 21, Failures: 0, Errors: 0, Skipped: 0, Time elapsed: 0.009 sec - in org.apache.commons.codec.net.QuotedPrintableCodecTest
Running org.apache.commons.codec.StringEncoderComparatorTest
Tests run: 3, Failures: 0, Errors: 0, Skipped: 0, Time elapsed: 0.003 sec - in org.apache.commons.codec.StringEncoderComparatorTest
Running org.apache.commons.codec.language.Caverphone1Test
Tests run: 9, Failures: 0, Errors: 0, Skipped: 0, Time elapsed: 0.029 sec - in org.apache.commons.codec.language.Caverphone1Test
Running org.apache.commons.codec.language.NysiisTest
Tests run: 23, Failures: 0, Errors: 0, Skipped: 0, Time elapsed: 0.013 sec - in org.apache.commons.codec.language.NysiisTest
Running org.apache.commons.codec.language.Caverphone2Test
Tests run: 13, Failures: 0, Errors: 0, Skipped: 0, Time elapsed: 0.13 sec - in org.apache.commons.codec.language.Caverphone2Test
Running org.apache.commons.codec.language.DaitchMokotoffSoundexTest
Tests run: 13, Failures: 0, Errors: 0, Skipped: 0, Time elapsed: 0.049 sec - in org.apache.commons.codec.language.DaitchMokotoffSoundexTest
Running org.apache.commons.codec.language.bm.BeiderMorseEncoderTest
Tests run: 22, Failures: 0, Errors: 0, Skipped: 0, Time elapsed: 3.082 sec - in org.apache.commons.codec.language.bm.BeiderMorseEncoderTest
Running org.apache.commons.codec.language.bm.PhoneticEngineTest
Tests run: 8, Failures: 0, Errors: 0, Skipped: 0, Time elapsed: 0.017 sec - in org.apache.commons.codec.language.bm.PhoneticEngineTest
Running org.apache.commons.codec.language.bm.PhoneticEngineRegressionTest
Tests run: 4, Failures: 0, Errors: 0, Skipped: 0, Time elapsed: 0.015 sec - in org.apache.commons.codec.language.bm.PhoneticEngineRegressionTest
Running org.apache.commons.codec.language.bm.RuleTest
Tests run: 3, Failures: 0, Errors: 0, Skipped: 0, Time elapsed: 0.002 sec - in org.apache.commons.codec.language.bm.RuleTest
Running org.apache.commons.codec.language.bm.LanguageGuessingTest
Tests run: 18, Failures: 0, Errors: 0, Skipped: 0, Time elapsed: 0.012 sec - in org.apache.commons.codec.language.bm.LanguageGuessingTest
Running org.apache.commons.codec.language.DoubleMetaphoneTest
Tests run: 16, Failures: 0, Errors: 0, Skipped: 0, Time elapsed: 0.057 sec - in org.apache.commons.codec.language.DoubleMetaphoneTest
Running org.apache.commons.codec.language.SoundexTest
Tests run: 28, Failures: 0, Errors: 0, Skipped: 0, Time elapsed: 0.014 sec - in org.apache.commons.codec.language.SoundexTest
Running org.apache.commons.codec.language.RefinedSoundexTest
Tests run: 10, Failures: 0, Errors: 0, Skipped: 0, Time elapsed: 0.003 sec - in org.apache.commons.codec.language.RefinedSoundexTest
Running org.apache.commons.codec.language.MatchRatingApproachEncoderTest
Tests run: 96, Failures: 0, Errors: 0, Skipped: 0, Time elapsed: 0.036 sec - in org.apache.commons.codec.language.MatchRatingApproachEncoderTest
Running org.apache.commons.codec.language.ColognePhoneticTest
Tests run: 13, Failures: 0, Errors: 0, Skipped: 0, Time elapsed: 0.005 sec - in org.apache.commons.codec.language.ColognePhoneticTest
Running org.apache.commons.codec.language.DoubleMetaphone2Test
Tests run: 6, Failures: 0, Errors: 0, Skipped: 0, Time elapsed: 0.039 sec - in org.apache.commons.codec.language.DoubleMetaphone2Test
Running org.apache.commons.codec.language.MetaphoneTest
Tests run: 34, Failures: 0, Errors: 0, Skipped: 0, Time elapsed: 0.106 sec - in org.apache.commons.codec.language.MetaphoneTest
Running org.apache.commons.codec.CharEncodingTest
Tests run: 7, Failures: 0, Errors: 0, Skipped: 0, Time elapsed: 0 sec - in org.apache.commons.codec.CharEncodingTest

Results :

Failed tests: 
  B64Test.testB64from24bit:37 expected:<[./spo/]> but was:<[zzzzzz]>
  Sha512CryptTest.testSha2CryptRounds:73 expected:<$5$rounds=1000$abcd$[b8MCU4GEeZIekOy5ahQ8EWfT330hvYGVeDYkBxXBva.]> but was:<$5$rounds=1000$abcd$[zzzzzzzzzzzzzzzzzzzzzzzzzzzzzzzzzzzzzzzzzzz]>
  Sha512CryptTest.testSha256LargetThanBlocksize:92 expected:<$6$abc$[oP/h8PRhCKIA66KSTjGwNsQMSLLZnuFOTjOhrqNrDkKgjTlpePSqibB0qtmDapMbP/zN1cUEYSeHFrpgqZ.GG1]> but was:<$6$abc$[zzzzzzzzzzzzzzzzzzzzzzzzzzzzzzzzzzzzzzzzzzzzzzzzzzzzzzzzzzzzzzzzzzzzzzzzzzzzzzzzzzzzzz]>
  Sha512CryptTest.testSha512CryptBytes:46 expected:<$6$foo$[Nywkte7LPWjaJhWjNeGJN.dFdY3pN1wYlGifyRLYOVlGS9EMSiZaDDe/BGSOYQ327q9.32I4UqQ5odsqvsBLX/]> but was:<$6$foo$[zzzzzzzzzzzzzzzzzzzzzzzzzzzzzzzzzzzzzzzzzzzzzzzzzzzzzzzzzzzzzzzzzzzzzzzzzzzzzzzzzzzzzz]>
  Sha512CryptTest.testSha512CryptStrings:33 expected:<$6$foo$[Nywkte7LPWjaJhWjNeGJN.dFdY3pN1wYlGifyRLYOVlGS9EMSiZaDDe/BGSOYQ327q9.32I4UqQ5odsqvsBLX/]> but was:<$6$foo$[zzzzzzzzzzzzzzzzzzzzzzzzzzzzzzzzzzzzzzzzzzzzzzzzzzzzzzzzzzzzzzzzzzzzzzzzzzzzzzzzzzzzzz]>
  Apr1CryptTest.testApr1CryptBytes:51 expected:<$apr1$foo$[P27KyD1htb4EllIPEYhqi0]> but was:<$apr1$foo$[zzzzzzzzzzzzzzzzzzzzzz]>
  Apr1CryptTest.testApr1LongSalt:69 expected:<$apr1$12345678$[0lqb/6VUFP8JY/s/jTrIk0]> but was:<$apr1$12345678$[zzzzzzzzzzzzzzzzzzzzzz]>
  Apr1CryptTest.testApr1CryptExplicitCall:61 expected:<$apr1$1234$[mAlH7FRST6FiRZ.kcYL.j1]> but was:<$apr1$1234$[zzzzzzzzzzzzzzzzzzzzzz]>
  Apr1CryptTest.testApr1CryptStrings:31 expected:<$apr1$TqI9WECO$[LHZB2DqRlk9nObiB6vJG9.]> but was:<$apr1$TqI9WECO$[zzzzzzzzzzzzzzzzzzzzzz]>
  Sha256CryptTest.testSha256CryptBytes:45 expected:<$5$foo$[Fq9CX624QIfnCAmlGiPKLlAasdacKCRxZztPoeo7o0B]> but was:<$5$foo$[zzzzzzzzzzzzzzzzzzzzzzzzzzzzzzzzzzzzzzzzzzz]>
  Sha256CryptTest.testSha2CryptRounds:55 expected:<$5$rounds=1000$abcd$[b8MCU4GEeZIekOy5ahQ8EWfT330hvYGVeDYkBxXBva.]> but was:<$5$rounds=1000$abcd$[zzzzzzzzzzzzzzzzzzzzzzzzzzzzzzzzzzzzzzzzzzz]>
  Sha256CryptTest.testSha256LargetThanBlocksize:80 expected:<$5$abc$[HbF3RRc15OwNKB/RZZ5F.1I6zsLcKXHQoSdB9Owx/Q8]> but was:<$5$abc$[zzzzzzzzzzzzzzzzzzzzzzzzzzzzzzzzzzzzzzzzzzz]>
  Sha256CryptTest.testSha256CryptStrings:32 expected:<$5$foo$[Fq9CX624QIfnCAmlGiPKLlAasdacKCRxZztPoeo7o0B]> but was:<$5$foo$[zzzzzzzzzzzzzzzzzzzzzzzzzzzzzzzzzzzzzzzzzzz]>
  Md5CryptTest.testMd5CryptBytes:49 expected:<$1$foo$[9mS5ExwgIECGE5YKlD5o91]> but was:<$1$foo$[zzzzzzzzzzzzzzzzzzzzzz]>
  Md5CryptTest.testMd5CryptLongInput:64 expected:<$1$1234$[MoxekaNNUgfPRVqoeYjCD/]> but was:<$1$1234$[zzzzzzzzzzzzzzzzzzzzzz]>
  Md5CryptTest.testMd5CryptStrings:36 expected:<$1$foo$[9mS5ExwgIECGE5YKlD5o91]> but was:<$1$foo$[zzzzzzzzzzzzzzzzzzzzzz]>

Tests run: 662, Failures: 16, Errors: 0, Skipped: 1

[INFO] ------------------------------------------------------------------------
[INFO] BUILD FAILURE
[INFO] ------------------------------------------------------------------------
[INFO] Total time: 13.658s
[INFO] Finished at: Sun Aug 02 08:07:04 BST 2015
[INFO] Final Memory: 20M/287M
[INFO] ------------------------------------------------------------------------
[ERROR] Failed to execute goal org.apache.maven.plugins:maven-surefire-plugin:2.17:test (default-test) on project commons-codec: There are test failures.
[ERROR] 
[ERROR] Please refer to /home/perham/Study/LittleDarwin/Cases/commons-codec-1.10-src/target/surefire-reports for the individual test results.
[ERROR] -> [Help 1]
[ERROR] 
[ERROR] To see the full stack trace of the errors, re-run Maven with the -e switch.
[ERROR] Re-run Maven using the -X switch to enable full debug logging.
[ERROR] 
[ERROR] For more information about the errors and possible solutions, please read the following articles:
[ERROR] [Help 1] http://cwiki.apache.org/confluence/display/MAVEN/MojoFailureException
