[INFO] Scanning for projects...
[INFO]                                                                         
[INFO] ------------------------------------------------------------------------
[INFO] Building Apache Commons Codec 1.10
[INFO] ------------------------------------------------------------------------
[INFO] 
[INFO] --- maven-enforcer-plugin:1.3.1:enforce (enforce-maven-3) @ commons-codec ---
[INFO] 
[INFO] --- maven-antrun-plugin:1.7:run (javadoc.resources) @ commons-codec ---
[INFO] Executing tasks

main:
[INFO] Executed tasks
[INFO] 
[INFO] --- maven-remote-resources-plugin:1.5:process (default) @ commons-codec ---
[INFO] 
[INFO] --- buildnumber-maven-plugin:1.3:create (default) @ commons-codec ---
[INFO] Executing: /bin/sh -c cd /home/perham/Study/LittleDarwin/Cases/commons-codec-1.10-src && svn --non-interactive info
[INFO] Working directory: /home/perham/Study/LittleDarwin/Cases/commons-codec-1.10-src
[INFO] Storing buildNumber: ?????? at timestamp: 1438499293257
[INFO] Executing: /bin/sh -c cd /home/perham/Study/LittleDarwin/Cases/commons-codec-1.10-src && svn --non-interactive info
[INFO] Working directory: /home/perham/Study/LittleDarwin/Cases/commons-codec-1.10-src
[INFO] Storing buildScmBranch: UNKNOWN_BRANCH
[INFO] 
[INFO] --- maven-resources-plugin:2.7:resources (default-resources) @ commons-codec ---
[INFO] Using 'UTF-8' encoding to copy filtered resources.
[INFO] Copying 128 resources
[INFO] Copying 2 resources to META-INF
[INFO] 
[INFO] --- maven-compiler-plugin:3.2:compile (default-compile) @ commons-codec ---
[INFO] Changes detected - recompiling the module!
[INFO] Compiling 60 source files to /home/perham/Study/LittleDarwin/Cases/commons-codec-1.10-src/target/classes
[INFO] /home/perham/Study/LittleDarwin/Cases/commons-codec-1.10-src/src/main/java/org/apache/commons/codec/digest/Sha2Crypt.java: Some input files use or override a deprecated API.
[INFO] /home/perham/Study/LittleDarwin/Cases/commons-codec-1.10-src/src/main/java/org/apache/commons/codec/digest/Sha2Crypt.java: Recompile with -Xlint:deprecation for details.
[INFO] 
[INFO] --- maven-bundle-plugin:2.5.3:manifest (bundle-manifest) @ commons-codec ---
[INFO] 
[INFO] --- maven-resources-plugin:2.7:testResources (default-testResources) @ commons-codec ---
[INFO] Using 'UTF-8' encoding to copy filtered resources.
[INFO] skip non existing resourceDirectory /home/perham/Study/LittleDarwin/Cases/commons-codec-1.10-src/src/test/resources
[INFO] Copying 2 resources to META-INF
[INFO] 
[INFO] --- maven-compiler-plugin:3.2:testCompile (default-testCompile) @ commons-codec ---
[INFO] Nothing to compile - all classes are up to date
[INFO] 
[INFO] --- maven-surefire-plugin:2.17:test (default-test) @ commons-codec ---
[INFO] Surefire report directory: /home/perham/Study/LittleDarwin/Cases/commons-codec-1.10-src/target/surefire-reports

-------------------------------------------------------
 T E S T S
-------------------------------------------------------
Running org.apache.commons.codec.digest.B64Test
Tests run: 2, Failures: 0, Errors: 0, Skipped: 0, Time elapsed: 0.028 sec - in org.apache.commons.codec.digest.B64Test
Running org.apache.commons.codec.digest.DigestUtilsTest
Tests run: 17, Failures: 0, Errors: 0, Skipped: 0, Time elapsed: 0.673 sec - in org.apache.commons.codec.digest.DigestUtilsTest
Running org.apache.commons.codec.digest.Sha512CryptTest
Tests run: 8, Failures: 0, Errors: 1, Skipped: 0, Time elapsed: 0.501 sec <<< FAILURE! - in org.apache.commons.codec.digest.Sha512CryptTest
testSha512CryptExplicitCall(org.apache.commons.codec.digest.Sha512CryptTest)  Time elapsed: 0.014 sec  <<< ERROR!
java.lang.IllegalArgumentException: Invalid salt value: $6$
	at org.apache.commons.codec.digest.Sha2Crypt.sha2Crypt(Sha2Crypt.java:147)
	at org.apache.commons.codec.digest.Sha2Crypt.sha512Crypt(Sha2Crypt.java:543)
	at org.apache.commons.codec.digest.Sha2Crypt.sha512Crypt(Sha2Crypt.java:521)
	at org.apache.commons.codec.digest.Sha512CryptTest.testSha512CryptExplicitCall(Sha512CryptTest.java:55)

Running org.apache.commons.codec.digest.Apr1CryptTest
Tests run: 8, Failures: 0, Errors: 3, Skipped: 0, Time elapsed: 0.057 sec <<< FAILURE! - in org.apache.commons.codec.digest.Apr1CryptTest
testApr1CryptBytes(org.apache.commons.codec.digest.Apr1CryptTest)  Time elapsed: 0 sec  <<< ERROR!
java.lang.IllegalArgumentException: Invalid salt value: $apr1$
	at org.apache.commons.codec.digest.Md5Crypt.md5Crypt(Md5Crypt.java:190)
	at org.apache.commons.codec.digest.Md5Crypt.apr1Crypt(Md5Crypt.java:92)
	at org.apache.commons.codec.digest.Md5Crypt.apr1Crypt(Md5Crypt.java:72)
	at org.apache.commons.codec.digest.Apr1CryptTest.testApr1CryptBytes(Apr1CryptTest.java:47)

testApr1CryptWithoutSalt(org.apache.commons.codec.digest.Apr1CryptTest)  Time elapsed: 0 sec  <<< ERROR!
java.lang.IllegalArgumentException: Invalid salt value: $apr1$
	at org.apache.commons.codec.digest.Md5Crypt.md5Crypt(Md5Crypt.java:190)
	at org.apache.commons.codec.digest.Md5Crypt.apr1Crypt(Md5Crypt.java:92)
	at org.apache.commons.codec.digest.Md5Crypt.apr1Crypt(Md5Crypt.java:72)
	at org.apache.commons.codec.digest.Md5Crypt.apr1Crypt(Md5Crypt.java:105)
	at org.apache.commons.codec.digest.Apr1CryptTest.testApr1CryptWithoutSalt(Apr1CryptTest.java:85)

testApr1CryptExplicitCall(org.apache.commons.codec.digest.Apr1CryptTest)  Time elapsed: 0.009 sec  <<< ERROR!
java.lang.IllegalArgumentException: Invalid salt value: $apr1$
	at org.apache.commons.codec.digest.Md5Crypt.md5Crypt(Md5Crypt.java:190)
	at org.apache.commons.codec.digest.Md5Crypt.apr1Crypt(Md5Crypt.java:92)
	at org.apache.commons.codec.digest.Md5Crypt.apr1Crypt(Md5Crypt.java:72)
	at org.apache.commons.codec.digest.Apr1CryptTest.testApr1CryptExplicitCall(Apr1CryptTest.java:63)

Running org.apache.commons.codec.digest.HmacUtilsTest
Tests run: 24, Failures: 0, Errors: 0, Skipped: 0, Time elapsed: 0.038 sec - in org.apache.commons.codec.digest.HmacUtilsTest
Running org.apache.commons.codec.digest.Sha2CryptTest
Tests run: 1, Failures: 0, Errors: 0, Skipped: 0, Time elapsed: 0 sec - in org.apache.commons.codec.digest.Sha2CryptTest
Running org.apache.commons.codec.digest.CryptTest
Tests run: 4, Failures: 0, Errors: 2, Skipped: 0, Time elapsed: 0 sec <<< FAILURE! - in org.apache.commons.codec.digest.CryptTest
testDefaultCryptVariant(org.apache.commons.codec.digest.CryptTest)  Time elapsed: 0 sec  <<< ERROR!
java.lang.IllegalArgumentException: Invalid salt value: $6$
	at org.apache.commons.codec.digest.Sha2Crypt.sha2Crypt(Sha2Crypt.java:147)
	at org.apache.commons.codec.digest.Sha2Crypt.sha512Crypt(Sha2Crypt.java:543)
	at org.apache.commons.codec.digest.Sha2Crypt.sha512Crypt(Sha2Crypt.java:521)
	at org.apache.commons.codec.digest.Crypt.crypt(Crypt.java:67)
	at org.apache.commons.codec.digest.Crypt.crypt(Crypt.java:149)
	at org.apache.commons.codec.digest.Crypt.crypt(Crypt.java:92)
	at org.apache.commons.codec.digest.CryptTest.testDefaultCryptVariant(CryptTest.java:35)

testCryptWithBytes(org.apache.commons.codec.digest.CryptTest)  Time elapsed: 0 sec  <<< ERROR!
java.lang.IllegalArgumentException: Invalid salt value: $6$
	at org.apache.commons.codec.digest.Sha2Crypt.sha2Crypt(Sha2Crypt.java:147)
	at org.apache.commons.codec.digest.Sha2Crypt.sha512Crypt(Sha2Crypt.java:543)
	at org.apache.commons.codec.digest.Sha2Crypt.sha512Crypt(Sha2Crypt.java:521)
	at org.apache.commons.codec.digest.Crypt.crypt(Crypt.java:67)
	at org.apache.commons.codec.digest.Crypt.crypt(Crypt.java:46)
	at org.apache.commons.codec.digest.CryptTest.testCryptWithBytes(CryptTest.java:42)

Running org.apache.commons.codec.digest.Sha256CryptTest
Tests run: 7, Failures: 0, Errors: 1, Skipped: 0, Time elapsed: 0.146 sec <<< FAILURE! - in org.apache.commons.codec.digest.Sha256CryptTest
testSha256CryptExplicitCall(org.apache.commons.codec.digest.Sha256CryptTest)  Time elapsed: 0.001 sec  <<< ERROR!
java.lang.IllegalArgumentException: Invalid salt value: $5$
	at org.apache.commons.codec.digest.Sha2Crypt.sha2Crypt(Sha2Crypt.java:147)
	at org.apache.commons.codec.digest.Sha2Crypt.sha256Crypt(Sha2Crypt.java:105)
	at org.apache.commons.codec.digest.Sha2Crypt.sha256Crypt(Sha2Crypt.java:83)
	at org.apache.commons.codec.digest.Sha256CryptTest.testSha256CryptExplicitCall(Sha256CryptTest.java:62)

Running org.apache.commons.codec.digest.Md5CryptTest
Tests run: 7, Failures: 0, Errors: 1, Skipped: 0, Time elapsed: 0.021 sec <<< FAILURE! - in org.apache.commons.codec.digest.Md5CryptTest
testMd5CryptExplicitCall(org.apache.commons.codec.digest.Md5CryptTest)  Time elapsed: 0 sec  <<< ERROR!
java.lang.IllegalArgumentException: Invalid salt value: $1$
	at org.apache.commons.codec.digest.Md5Crypt.md5Crypt(Md5Crypt.java:190)
	at org.apache.commons.codec.digest.Md5Crypt.md5Crypt(Md5Crypt.java:161)
	at org.apache.commons.codec.digest.Md5Crypt.md5Crypt(Md5Crypt.java:141)
	at org.apache.commons.codec.digest.Md5CryptTest.testMd5CryptExplicitCall(Md5CryptTest.java:58)

Running org.apache.commons.codec.digest.UnixCryptTest
Tests run: 9, Failures: 0, Errors: 0, Skipped: 0, Time elapsed: 0.004 sec - in org.apache.commons.codec.digest.UnixCryptTest
Running org.apache.commons.codec.CharsetsTest
Tests run: 7, Failures: 0, Errors: 0, Skipped: 0, Time elapsed: 0.001 sec - in org.apache.commons.codec.CharsetsTest
Running org.apache.commons.codec.binary.Base32Test
Tests run: 8, Failures: 0, Errors: 0, Skipped: 0, Time elapsed: 0.001 sec - in org.apache.commons.codec.binary.Base32Test
Running org.apache.commons.codec.binary.Base64OutputStreamTest
Tests run: 7, Failures: 0, Errors: 0, Skipped: 0, Time elapsed: 0.188 sec - in org.apache.commons.codec.binary.Base64OutputStreamTest
Running org.apache.commons.codec.binary.Base64Codec13Test
Tests run: 8, Failures: 0, Errors: 0, Skipped: 0, Time elapsed: 0.01 sec - in org.apache.commons.codec.binary.Base64Codec13Test
Running org.apache.commons.codec.binary.Base64InputStreamTest
Tests run: 19, Failures: 0, Errors: 0, Skipped: 0, Time elapsed: 0.114 sec - in org.apache.commons.codec.binary.Base64InputStreamTest
Running org.apache.commons.codec.binary.Base32InputStreamTest
Tests run: 16, Failures: 0, Errors: 0, Skipped: 0, Time elapsed: 0.12 sec - in org.apache.commons.codec.binary.Base32InputStreamTest
Running org.apache.commons.codec.binary.Base32OutputStreamTest
Tests run: 6, Failures: 0, Errors: 0, Skipped: 0, Time elapsed: 0.079 sec - in org.apache.commons.codec.binary.Base32OutputStreamTest
Running org.apache.commons.codec.binary.BinaryCodecTest
Tests run: 13, Failures: 0, Errors: 0, Skipped: 0, Time elapsed: 0.009 sec - in org.apache.commons.codec.binary.BinaryCodecTest
Running org.apache.commons.codec.binary.BaseNCodecTest
Tests run: 7, Failures: 0, Errors: 0, Skipped: 0, Time elapsed: 0.002 sec - in org.apache.commons.codec.binary.BaseNCodecTest
Running org.apache.commons.codec.binary.StringUtilsTest
Tests run: 17, Failures: 0, Errors: 0, Skipped: 0, Time elapsed: 0.027 sec - in org.apache.commons.codec.binary.StringUtilsTest
Running org.apache.commons.codec.binary.Base64Test
Tests run: 53, Failures: 0, Errors: 0, Skipped: 1, Time elapsed: 0.047 sec - in org.apache.commons.codec.binary.Base64Test
Running org.apache.commons.codec.binary.HexTest
Tests run: 19, Failures: 0, Errors: 0, Skipped: 0, Time elapsed: 0.182 sec - in org.apache.commons.codec.binary.HexTest
Running org.apache.commons.codec.DecoderExceptionTest
Tests run: 4, Failures: 0, Errors: 0, Skipped: 0, Time elapsed: 0.001 sec - in org.apache.commons.codec.DecoderExceptionTest
Running org.apache.commons.codec.EncoderExceptionTest
Tests run: 4, Failures: 0, Errors: 0, Skipped: 0, Time elapsed: 0 sec - in org.apache.commons.codec.EncoderExceptionTest
Running org.apache.commons.codec.net.BCodecTest
Tests run: 9, Failures: 0, Errors: 0, Skipped: 0, Time elapsed: 0.006 sec - in org.apache.commons.codec.net.BCodecTest
Running org.apache.commons.codec.net.QCodecTest
Tests run: 12, Failures: 0, Errors: 0, Skipped: 0, Time elapsed: 0.002 sec - in org.apache.commons.codec.net.QCodecTest
Running org.apache.commons.codec.net.UtilsTest
Tests run: 1, Failures: 0, Errors: 0, Skipped: 0, Time elapsed: 0 sec - in org.apache.commons.codec.net.UtilsTest
Running org.apache.commons.codec.net.RFC1522CodecTest
Tests run: 2, Failures: 0, Errors: 0, Skipped: 0, Time elapsed: 0 sec - in org.apache.commons.codec.net.RFC1522CodecTest
Running org.apache.commons.codec.net.URLCodecTest
Tests run: 16, Failures: 0, Errors: 0, Skipped: 0, Time elapsed: 0.002 sec - in org.apache.commons.codec.net.URLCodecTest
Running org.apache.commons.codec.net.QuotedPrintableCodecTest
Tests run: 21, Failures: 0, Errors: 0, Skipped: 0, Time elapsed: 0.004 sec - in org.apache.commons.codec.net.QuotedPrintableCodecTest
Running org.apache.commons.codec.StringEncoderComparatorTest
Tests run: 3, Failures: 0, Errors: 0, Skipped: 0, Time elapsed: 0.004 sec - in org.apache.commons.codec.StringEncoderComparatorTest
Running org.apache.commons.codec.language.Caverphone1Test
Tests run: 9, Failures: 0, Errors: 0, Skipped: 0, Time elapsed: 0.029 sec - in org.apache.commons.codec.language.Caverphone1Test
Running org.apache.commons.codec.language.NysiisTest
Tests run: 23, Failures: 0, Errors: 0, Skipped: 0, Time elapsed: 0.02 sec - in org.apache.commons.codec.language.NysiisTest
Running org.apache.commons.codec.language.Caverphone2Test
Tests run: 13, Failures: 0, Errors: 0, Skipped: 0, Time elapsed: 0.126 sec - in org.apache.commons.codec.language.Caverphone2Test
Running org.apache.commons.codec.language.DaitchMokotoffSoundexTest
Tests run: 13, Failures: 0, Errors: 0, Skipped: 0, Time elapsed: 0.046 sec - in org.apache.commons.codec.language.DaitchMokotoffSoundexTest
Running org.apache.commons.codec.language.bm.BeiderMorseEncoderTest
Tests run: 22, Failures: 0, Errors: 0, Skipped: 0, Time elapsed: 2.942 sec - in org.apache.commons.codec.language.bm.BeiderMorseEncoderTest
Running org.apache.commons.codec.language.bm.PhoneticEngineTest
Tests run: 8, Failures: 0, Errors: 0, Skipped: 0, Time elapsed: 0.018 sec - in org.apache.commons.codec.language.bm.PhoneticEngineTest
Running org.apache.commons.codec.language.bm.PhoneticEngineRegressionTest
Tests run: 4, Failures: 0, Errors: 0, Skipped: 0, Time elapsed: 0.015 sec - in org.apache.commons.codec.language.bm.PhoneticEngineRegressionTest
Running org.apache.commons.codec.language.bm.RuleTest
Tests run: 3, Failures: 0, Errors: 0, Skipped: 0, Time elapsed: 0.002 sec - in org.apache.commons.codec.language.bm.RuleTest
Running org.apache.commons.codec.language.bm.LanguageGuessingTest
Tests run: 18, Failures: 0, Errors: 0, Skipped: 0, Time elapsed: 0.012 sec - in org.apache.commons.codec.language.bm.LanguageGuessingTest
Running org.apache.commons.codec.language.DoubleMetaphoneTest
Tests run: 16, Failures: 0, Errors: 0, Skipped: 0, Time elapsed: 0.045 sec - in org.apache.commons.codec.language.DoubleMetaphoneTest
Running org.apache.commons.codec.language.SoundexTest
Tests run: 28, Failures: 0, Errors: 0, Skipped: 0, Time elapsed: 0.009 sec - in org.apache.commons.codec.language.SoundexTest
Running org.apache.commons.codec.language.RefinedSoundexTest
Tests run: 10, Failures: 0, Errors: 0, Skipped: 0, Time elapsed: 0.002 sec - in org.apache.commons.codec.language.RefinedSoundexTest
Running org.apache.commons.codec.language.MatchRatingApproachEncoderTest
Tests run: 96, Failures: 0, Errors: 0, Skipped: 0, Time elapsed: 0.035 sec - in org.apache.commons.codec.language.MatchRatingApproachEncoderTest
Running org.apache.commons.codec.language.ColognePhoneticTest
Tests run: 13, Failures: 0, Errors: 0, Skipped: 0, Time elapsed: 0.004 sec - in org.apache.commons.codec.language.ColognePhoneticTest
Running org.apache.commons.codec.language.DoubleMetaphone2Test
Tests run: 6, Failures: 0, Errors: 0, Skipped: 0, Time elapsed: 0.028 sec - in org.apache.commons.codec.language.DoubleMetaphone2Test
Running org.apache.commons.codec.language.MetaphoneTest
Tests run: 34, Failures: 0, Errors: 0, Skipped: 0, Time elapsed: 0.086 sec - in org.apache.commons.codec.language.MetaphoneTest
Running org.apache.commons.codec.CharEncodingTest
Tests run: 7, Failures: 0, Errors: 0, Skipped: 0, Time elapsed: 0.001 sec - in org.apache.commons.codec.CharEncodingTest

Results :

Tests in error: 
  Sha512CryptTest.testSha512CryptExplicitCall:55 » IllegalArgument Invalid salt ...
  Apr1CryptTest.testApr1CryptBytes:47 » IllegalArgument Invalid salt value: $apr...
  Apr1CryptTest.testApr1CryptWithoutSalt:85 » IllegalArgument Invalid salt value...
  Apr1CryptTest.testApr1CryptExplicitCall:63 » IllegalArgument Invalid salt valu...
  CryptTest.testDefaultCryptVariant:35 » IllegalArgument Invalid salt value: $6$
  CryptTest.testCryptWithBytes:42 » IllegalArgument Invalid salt value: $6$
  Sha256CryptTest.testSha256CryptExplicitCall:62 » IllegalArgument Invalid salt ...
  Md5CryptTest.testMd5CryptExplicitCall:58 » IllegalArgument Invalid salt value:...

Tests run: 662, Failures: 0, Errors: 8, Skipped: 1

[INFO] ------------------------------------------------------------------------
[INFO] BUILD FAILURE
[INFO] ------------------------------------------------------------------------
[INFO] Total time: 14.041s
[INFO] Finished at: Sun Aug 02 08:08:24 BST 2015
[INFO] Final Memory: 22M/335M
[INFO] ------------------------------------------------------------------------
[ERROR] Failed to execute goal org.apache.maven.plugins:maven-surefire-plugin:2.17:test (default-test) on project commons-codec: There are test failures.
[ERROR] 
[ERROR] Please refer to /home/perham/Study/LittleDarwin/Cases/commons-codec-1.10-src/target/surefire-reports for the individual test results.
[ERROR] -> [Help 1]
[ERROR] 
[ERROR] To see the full stack trace of the errors, re-run Maven with the -e switch.
[ERROR] Re-run Maven using the -X switch to enable full debug logging.
[ERROR] 
[ERROR] For more information about the errors and possible solutions, please read the following articles:
[ERROR] [Help 1] http://cwiki.apache.org/confluence/display/MAVEN/MojoFailureException
