[INFO] Scanning for projects...
[INFO]                                                                         
[INFO] ------------------------------------------------------------------------
[INFO] Building Apache Commons Codec 1.10
[INFO] ------------------------------------------------------------------------
[INFO] 
[INFO] --- maven-enforcer-plugin:1.3.1:enforce (enforce-maven-3) @ commons-codec ---
[INFO] 
[INFO] --- maven-antrun-plugin:1.7:run (javadoc.resources) @ commons-codec ---
[INFO] Executing tasks

main:
[INFO] Executed tasks
[INFO] 
[INFO] --- maven-remote-resources-plugin:1.5:process (default) @ commons-codec ---
[INFO] 
[INFO] --- buildnumber-maven-plugin:1.3:create (default) @ commons-codec ---
[INFO] Executing: /bin/sh -c cd /home/perham/Study/LittleDarwin/Cases/commons-codec-1.10-src && svn --non-interactive info
[INFO] Working directory: /home/perham/Study/LittleDarwin/Cases/commons-codec-1.10-src
[INFO] Storing buildNumber: ?????? at timestamp: 1438498963994
[INFO] Executing: /bin/sh -c cd /home/perham/Study/LittleDarwin/Cases/commons-codec-1.10-src && svn --non-interactive info
[INFO] Working directory: /home/perham/Study/LittleDarwin/Cases/commons-codec-1.10-src
[INFO] Storing buildScmBranch: UNKNOWN_BRANCH
[INFO] 
[INFO] --- maven-resources-plugin:2.7:resources (default-resources) @ commons-codec ---
[INFO] Using 'UTF-8' encoding to copy filtered resources.
[INFO] Copying 128 resources
[INFO] Copying 2 resources to META-INF
[INFO] 
[INFO] --- maven-compiler-plugin:3.2:compile (default-compile) @ commons-codec ---
[INFO] Changes detected - recompiling the module!
[INFO] Compiling 60 source files to /home/perham/Study/LittleDarwin/Cases/commons-codec-1.10-src/target/classes
[INFO] /home/perham/Study/LittleDarwin/Cases/commons-codec-1.10-src/src/main/java/org/apache/commons/codec/digest/Sha2Crypt.java: Some input files use or override a deprecated API.
[INFO] /home/perham/Study/LittleDarwin/Cases/commons-codec-1.10-src/src/main/java/org/apache/commons/codec/digest/Sha2Crypt.java: Recompile with -Xlint:deprecation for details.
[INFO] 
[INFO] --- maven-bundle-plugin:2.5.3:manifest (bundle-manifest) @ commons-codec ---
[INFO] 
[INFO] --- maven-resources-plugin:2.7:testResources (default-testResources) @ commons-codec ---
[INFO] Using 'UTF-8' encoding to copy filtered resources.
[INFO] skip non existing resourceDirectory /home/perham/Study/LittleDarwin/Cases/commons-codec-1.10-src/src/test/resources
[INFO] Copying 2 resources to META-INF
[INFO] 
[INFO] --- maven-compiler-plugin:3.2:testCompile (default-testCompile) @ commons-codec ---
[INFO] Nothing to compile - all classes are up to date
[INFO] 
[INFO] --- maven-surefire-plugin:2.17:test (default-test) @ commons-codec ---
[INFO] Surefire report directory: /home/perham/Study/LittleDarwin/Cases/commons-codec-1.10-src/target/surefire-reports

-------------------------------------------------------
 T E S T S
-------------------------------------------------------
Running org.apache.commons.codec.digest.B64Test
Tests run: 2, Failures: 0, Errors: 0, Skipped: 0, Time elapsed: 0.027 sec - in org.apache.commons.codec.digest.B64Test
Running org.apache.commons.codec.digest.DigestUtilsTest
Tests run: 17, Failures: 0, Errors: 13, Skipped: 0, Time elapsed: 0.116 sec <<< FAILURE! - in org.apache.commons.codec.digest.DigestUtilsTest
testMd2Length(org.apache.commons.codec.digest.DigestUtilsTest)  Time elapsed: 0.025 sec  <<< ERROR!
java.lang.NullPointerException: null
	at java.security.MessageDigest.update(MessageDigest.java:323)
	at java.security.MessageDigest.digest(MessageDigest.java:398)
	at org.apache.commons.codec.digest.DigestUtils.md2(DigestUtils.java:185)
	at org.apache.commons.codec.digest.DigestUtilsTest.testMd2Length(DigestUtilsTest.java:104)

testSha1UpdateWithString(org.apache.commons.codec.digest.DigestUtilsTest)  Time elapsed: 0.001 sec  <<< ERROR!
java.lang.NullPointerException: null
	at java.security.MessageDigest.update(MessageDigest.java:323)
	at org.apache.commons.codec.digest.DigestUtilsTest.testSha1UpdateWithString(DigestUtilsTest.java:203)

testMd5HexLength(org.apache.commons.codec.digest.DigestUtilsTest)  Time elapsed: 0.001 sec  <<< ERROR!
java.lang.NullPointerException: null
	at java.security.MessageDigest.update(MessageDigest.java:323)
	at java.security.MessageDigest.digest(MessageDigest.java:398)
	at org.apache.commons.codec.digest.DigestUtils.md5(DigestUtils.java:260)
	at org.apache.commons.codec.digest.DigestUtils.md5Hex(DigestUtils.java:296)
	at org.apache.commons.codec.digest.DigestUtilsTest.testMd5HexLength(DigestUtilsTest.java:143)

testMd5Length(org.apache.commons.codec.digest.DigestUtilsTest)  Time elapsed: 0 sec  <<< ERROR!
java.lang.NullPointerException: null
	at java.security.MessageDigest.update(MessageDigest.java:323)
	at java.security.MessageDigest.digest(MessageDigest.java:398)
	at org.apache.commons.codec.digest.DigestUtils.md5(DigestUtils.java:260)
	at org.apache.commons.codec.digest.DigestUtilsTest.testMd5Length(DigestUtilsTest.java:157)

testMd2Hex(org.apache.commons.codec.digest.DigestUtilsTest)  Time elapsed: 0.001 sec  <<< ERROR!
java.lang.NullPointerException: null
	at java.security.MessageDigest.update(MessageDigest.java:323)
	at java.security.MessageDigest.digest(MessageDigest.java:398)
	at org.apache.commons.codec.digest.DigestUtils.md2(DigestUtils.java:185)
	at org.apache.commons.codec.digest.DigestUtils.md2(DigestUtils.java:211)
	at org.apache.commons.codec.digest.DigestUtils.md2Hex(DigestUtils.java:249)
	at org.apache.commons.codec.digest.DigestUtilsTest.testMd2Hex(DigestUtilsTest.java:62)

testMd5Hex(org.apache.commons.codec.digest.DigestUtilsTest)  Time elapsed: 0.002 sec  <<< ERROR!
java.lang.NullPointerException: null
	at java.security.MessageDigest.update(MessageDigest.java:323)
	at java.security.MessageDigest.digest(MessageDigest.java:398)
	at org.apache.commons.codec.digest.DigestUtils.md5(DigestUtils.java:260)
	at org.apache.commons.codec.digest.DigestUtils.md5(DigestUtils.java:285)
	at org.apache.commons.codec.digest.DigestUtils.md5Hex(DigestUtils.java:321)
	at org.apache.commons.codec.digest.DigestUtilsTest.testMd5Hex(DigestUtilsTest.java:115)

testSha1Hex(org.apache.commons.codec.digest.DigestUtilsTest)  Time elapsed: 0.002 sec  <<< ERROR!
java.lang.NullPointerException: null
	at java.security.MessageDigest.update(MessageDigest.java:323)
	at java.security.MessageDigest.digest(MessageDigest.java:398)
	at org.apache.commons.codec.digest.DigestUtils.sha1(DigestUtils.java:375)
	at org.apache.commons.codec.digest.DigestUtils.sha1(DigestUtils.java:400)
	at org.apache.commons.codec.digest.DigestUtils.sha1Hex(DigestUtils.java:438)
	at org.apache.commons.codec.digest.DigestUtilsTest.testSha1Hex(DigestUtilsTest.java:168)

testMd2HexLength(org.apache.commons.codec.digest.DigestUtilsTest)  Time elapsed: 0.002 sec  <<< ERROR!
java.lang.NullPointerException: null
	at java.security.MessageDigest.update(MessageDigest.java:323)
	at java.security.MessageDigest.digest(MessageDigest.java:398)
	at org.apache.commons.codec.digest.DigestUtils.md2(DigestUtils.java:185)
	at org.apache.commons.codec.digest.DigestUtils.md2Hex(DigestUtils.java:223)
	at org.apache.commons.codec.digest.DigestUtilsTest.testMd2HexLength(DigestUtilsTest.java:90)

testSha256(org.apache.commons.codec.digest.DigestUtilsTest)  Time elapsed: 0.003 sec  <<< ERROR!
java.lang.NullPointerException: null
	at java.security.MessageDigest.update(MessageDigest.java:323)
	at java.security.MessageDigest.digest(MessageDigest.java:398)
	at org.apache.commons.codec.digest.DigestUtils.sha256(DigestUtils.java:453)
	at org.apache.commons.codec.digest.DigestUtils.sha256(DigestUtils.java:485)
	at org.apache.commons.codec.digest.DigestUtils.sha256Hex(DigestUtils.java:532)
	at org.apache.commons.codec.digest.DigestUtilsTest.testSha256(DigestUtilsTest.java:218)

testSha384(org.apache.commons.codec.digest.DigestUtilsTest)  Time elapsed: 0.003 sec  <<< ERROR!
java.lang.NullPointerException: null
	at java.security.MessageDigest.update(MessageDigest.java:323)
	at java.security.MessageDigest.digest(MessageDigest.java:398)
	at org.apache.commons.codec.digest.DigestUtils.sha384(DigestUtils.java:547)
	at org.apache.commons.codec.digest.DigestUtils.sha384(DigestUtils.java:579)
	at org.apache.commons.codec.digest.DigestUtils.sha384Hex(DigestUtils.java:626)
	at org.apache.commons.codec.digest.DigestUtilsTest.testSha384(DigestUtilsTest.java:232)

testSha512(org.apache.commons.codec.digest.DigestUtilsTest)  Time elapsed: 0 sec  <<< ERROR!
java.lang.NullPointerException: null
	at java.security.MessageDigest.update(MessageDigest.java:323)
	at java.security.MessageDigest.digest(MessageDigest.java:398)
	at org.apache.commons.codec.digest.DigestUtils.sha512(DigestUtils.java:641)
	at org.apache.commons.codec.digest.DigestUtils.sha512(DigestUtils.java:673)
	at org.apache.commons.codec.digest.DigestUtils.sha512Hex(DigestUtils.java:720)
	at org.apache.commons.codec.digest.DigestUtilsTest.testSha512(DigestUtilsTest.java:249)

testShaHex(org.apache.commons.codec.digest.DigestUtilsTest)  Time elapsed: 0.002 sec  <<< ERROR!
java.lang.NullPointerException: null
	at java.security.MessageDigest.update(MessageDigest.java:323)
	at java.security.MessageDigest.digest(MessageDigest.java:398)
	at org.apache.commons.codec.digest.DigestUtils.sha1(DigestUtils.java:375)
	at org.apache.commons.codec.digest.DigestUtils.sha1(DigestUtils.java:400)
	at org.apache.commons.codec.digest.DigestUtils.sha1Hex(DigestUtils.java:438)
	at org.apache.commons.codec.digest.DigestUtils.shaHex(DigestUtils.java:762)
	at org.apache.commons.codec.digest.DigestUtilsTest.testShaHex(DigestUtilsTest.java:267)

testShaUpdateWithString(org.apache.commons.codec.digest.DigestUtilsTest)  Time elapsed: 0.001 sec  <<< ERROR!
java.lang.NullPointerException: null
	at java.security.MessageDigest.update(MessageDigest.java:323)
	at org.apache.commons.codec.digest.DigestUtilsTest.testShaUpdateWithString(DigestUtilsTest.java:304)

Running org.apache.commons.codec.digest.Sha512CryptTest
Tests run: 8, Failures: 0, Errors: 0, Skipped: 0, Time elapsed: 0.607 sec - in org.apache.commons.codec.digest.Sha512CryptTest
Running org.apache.commons.codec.digest.Apr1CryptTest
Tests run: 8, Failures: 0, Errors: 0, Skipped: 0, Time elapsed: 0.206 sec - in org.apache.commons.codec.digest.Apr1CryptTest
Running org.apache.commons.codec.digest.HmacUtilsTest
Tests run: 24, Failures: 2, Errors: 7, Skipped: 0, Time elapsed: 0.041 sec <<< FAILURE! - in org.apache.commons.codec.digest.HmacUtilsTest
testHmacMd5Hex(org.apache.commons.codec.digest.HmacUtilsTest)  Time elapsed: 0.003 sec  <<< ERROR!
java.lang.IllegalArgumentException: Null key
	at org.apache.commons.codec.digest.HmacUtils.getInitializedMac(HmacUtils.java:177)
	at org.apache.commons.codec.digest.HmacUtils.getInitializedMac(HmacUtils.java:155)
	at org.apache.commons.codec.digest.HmacUtils.getHmacMd5(HmacUtils.java:63)
	at org.apache.commons.codec.digest.HmacUtils.hmacMd5(HmacUtils.java:207)
	at org.apache.commons.codec.digest.HmacUtils.hmacMd5(HmacUtils.java:246)
	at org.apache.commons.codec.digest.HmacUtils.hmacMd5Hex(HmacUtils.java:296)
	at org.apache.commons.codec.digest.HmacUtilsTest.testHmacMd5Hex(HmacUtilsTest.java:90)

testHmacSha1Hex(org.apache.commons.codec.digest.HmacUtilsTest)  Time elapsed: 0.001 sec  <<< ERROR!
java.lang.IllegalArgumentException: Null key
	at org.apache.commons.codec.digest.HmacUtils.getInitializedMac(HmacUtils.java:177)
	at org.apache.commons.codec.digest.HmacUtils.getInitializedMac(HmacUtils.java:155)
	at org.apache.commons.codec.digest.HmacUtils.getHmacSha1(HmacUtils.java:81)
	at org.apache.commons.codec.digest.HmacUtils.hmacSha1(HmacUtils.java:314)
	at org.apache.commons.codec.digest.HmacUtils.hmacSha1(HmacUtils.java:353)
	at org.apache.commons.codec.digest.HmacUtils.hmacSha1Hex(HmacUtils.java:403)
	at org.apache.commons.codec.digest.HmacUtilsTest.testHmacSha1Hex(HmacUtilsTest.java:101)

testSha256HMac(org.apache.commons.codec.digest.HmacUtilsTest)  Time elapsed: 0.004 sec  <<< ERROR!
java.lang.IllegalArgumentException: Null key
	at org.apache.commons.codec.digest.HmacUtils.getInitializedMac(HmacUtils.java:177)
	at org.apache.commons.codec.digest.HmacUtils.getInitializedMac(HmacUtils.java:155)
	at org.apache.commons.codec.digest.HmacUtils.getHmacSha256(HmacUtils.java:99)
	at org.apache.commons.codec.digest.HmacUtils.hmacSha256(HmacUtils.java:421)
	at org.apache.commons.codec.digest.HmacUtils.hmacSha256(HmacUtils.java:460)
	at org.apache.commons.codec.digest.HmacUtilsTest.testSha256HMac(HmacUtilsTest.java:220)

testSha1HMac(org.apache.commons.codec.digest.HmacUtilsTest)  Time elapsed: 0.001 sec  <<< ERROR!
java.lang.IllegalArgumentException: Null key
	at org.apache.commons.codec.digest.HmacUtils.getInitializedMac(HmacUtils.java:177)
	at org.apache.commons.codec.digest.HmacUtils.getInitializedMac(HmacUtils.java:155)
	at org.apache.commons.codec.digest.HmacUtils.getHmacSha1(HmacUtils.java:81)
	at org.apache.commons.codec.digest.HmacUtils.hmacSha1(HmacUtils.java:314)
	at org.apache.commons.codec.digest.HmacUtils.hmacSha1(HmacUtils.java:353)
	at org.apache.commons.codec.digest.HmacUtilsTest.testSha1HMac(HmacUtilsTest.java:199)

testSha384HMac(org.apache.commons.codec.digest.HmacUtilsTest)  Time elapsed: 0.001 sec  <<< ERROR!
java.lang.IllegalArgumentException: Null key
	at org.apache.commons.codec.digest.HmacUtils.getInitializedMac(HmacUtils.java:177)
	at org.apache.commons.codec.digest.HmacUtils.getInitializedMac(HmacUtils.java:155)
	at org.apache.commons.codec.digest.HmacUtils.getHmacSha384(HmacUtils.java:117)
	at org.apache.commons.codec.digest.HmacUtils.hmacSha384(HmacUtils.java:528)
	at org.apache.commons.codec.digest.HmacUtils.hmacSha384(HmacUtils.java:567)
	at org.apache.commons.codec.digest.HmacUtilsTest.testSha384HMac(HmacUtilsTest.java:241)

testMd5HMac(org.apache.commons.codec.digest.HmacUtilsTest)  Time elapsed: 0.001 sec  <<< ERROR!
java.lang.IllegalArgumentException: Null key
	at org.apache.commons.codec.digest.HmacUtils.getInitializedMac(HmacUtils.java:177)
	at org.apache.commons.codec.digest.HmacUtils.getInitializedMac(HmacUtils.java:155)
	at org.apache.commons.codec.digest.HmacUtils.getHmacMd5(HmacUtils.java:63)
	at org.apache.commons.codec.digest.HmacUtils.hmacMd5(HmacUtils.java:207)
	at org.apache.commons.codec.digest.HmacUtils.hmacMd5(HmacUtils.java:246)
	at org.apache.commons.codec.digest.HmacUtilsTest.testMd5HMac(HmacUtilsTest.java:169)

testInitializedMac(org.apache.commons.codec.digest.HmacUtilsTest)  Time elapsed: 0.001 sec  <<< FAILURE!
org.junit.internal.ArrayComparisonFailure: arrays first differed at element [0]; expected:<-128> but was:<99>
	at org.junit.internal.ComparisonCriteria.arrayEquals(ComparisonCriteria.java:50)
	at org.junit.Assert.internalArrayEquals(Assert.java:473)
	at org.junit.Assert.assertArrayEquals(Assert.java:294)
	at org.junit.Assert.assertArrayEquals(Assert.java:305)
	at org.apache.commons.codec.digest.HmacUtilsTest.testInitializedMac(HmacUtilsTest.java:142)

testHmacSha1UpdateWithString(org.apache.commons.codec.digest.HmacUtilsTest)  Time elapsed: 0.002 sec  <<< FAILURE!
org.junit.ComparisonFailure: expected:<[de7c9b85b8b78aa6bc8a7a36f70a90701c9db4d9]> but was:<[f42bb0eeb018ebbd4597ae7213711ec60760843f]>
	at org.junit.Assert.assertEquals(Assert.java:115)
	at org.junit.Assert.assertEquals(Assert.java:144)
	at org.apache.commons.codec.digest.HmacUtilsTest.testHmacSha1UpdateWithString(HmacUtilsTest.java:133)

testSha512HMac(org.apache.commons.codec.digest.HmacUtilsTest)  Time elapsed: 0.001 sec  <<< ERROR!
java.lang.IllegalArgumentException: Null key
	at org.apache.commons.codec.digest.HmacUtils.getInitializedMac(HmacUtils.java:177)
	at org.apache.commons.codec.digest.HmacUtils.getInitializedMac(HmacUtils.java:155)
	at org.apache.commons.codec.digest.HmacUtils.getHmacSha512(HmacUtils.java:135)
	at org.apache.commons.codec.digest.HmacUtils.hmacSha512(HmacUtils.java:635)
	at org.apache.commons.codec.digest.HmacUtils.hmacSha512(HmacUtils.java:674)
	at org.apache.commons.codec.digest.HmacUtilsTest.testSha512HMac(HmacUtilsTest.java:262)

Running org.apache.commons.codec.digest.Sha2CryptTest
Tests run: 1, Failures: 0, Errors: 0, Skipped: 0, Time elapsed: 0 sec - in org.apache.commons.codec.digest.Sha2CryptTest
Running org.apache.commons.codec.digest.CryptTest
Tests run: 4, Failures: 0, Errors: 0, Skipped: 0, Time elapsed: 0.09 sec - in org.apache.commons.codec.digest.CryptTest
Running org.apache.commons.codec.digest.Sha256CryptTest
Tests run: 7, Failures: 0, Errors: 0, Skipped: 0, Time elapsed: 0.113 sec - in org.apache.commons.codec.digest.Sha256CryptTest
Running org.apache.commons.codec.digest.Md5CryptTest
Tests run: 7, Failures: 0, Errors: 0, Skipped: 0, Time elapsed: 0.027 sec - in org.apache.commons.codec.digest.Md5CryptTest
Running org.apache.commons.codec.digest.UnixCryptTest
Tests run: 9, Failures: 0, Errors: 0, Skipped: 0, Time elapsed: 0.006 sec - in org.apache.commons.codec.digest.UnixCryptTest
Running org.apache.commons.codec.CharsetsTest
Tests run: 7, Failures: 0, Errors: 0, Skipped: 0, Time elapsed: 0.001 sec - in org.apache.commons.codec.CharsetsTest
Running org.apache.commons.codec.binary.Base32Test
Tests run: 8, Failures: 0, Errors: 0, Skipped: 0, Time elapsed: 0.006 sec - in org.apache.commons.codec.binary.Base32Test
Running org.apache.commons.codec.binary.Base64OutputStreamTest
Tests run: 7, Failures: 0, Errors: 3, Skipped: 0, Time elapsed: 0.003 sec <<< FAILURE! - in org.apache.commons.codec.binary.Base64OutputStreamTest
testCodec98NPE(org.apache.commons.codec.binary.Base64OutputStreamTest)  Time elapsed: 0 sec  <<< ERROR!
java.lang.NullPointerException: null
	at org.apache.commons.codec.binary.Base64OutputStreamTest.testCodec98NPE(Base64OutputStreamTest.java:52)

testBase64OutputStreamByteByByte(org.apache.commons.codec.binary.Base64OutputStreamTest)  Time elapsed: 0.001 sec  <<< ERROR!
java.lang.NullPointerException: null
	at org.apache.commons.codec.binary.Base64OutputStreamTest.testByteByByte(Base64OutputStreamTest.java:244)
	at org.apache.commons.codec.binary.Base64OutputStreamTest.testBase64OutputStreamByteByByte(Base64OutputStreamTest.java:144)

testBase64OutputStreamByChunk(org.apache.commons.codec.binary.Base64OutputStreamTest)  Time elapsed: 0.001 sec  <<< ERROR!
java.lang.NullPointerException: null
	at java.io.FilterOutputStream.write(FilterOutputStream.java:97)
	at org.apache.commons.codec.binary.Base64OutputStreamTest.testByChunk(Base64OutputStreamTest.java:194)
	at org.apache.commons.codec.binary.Base64OutputStreamTest.testBase64OutputStreamByChunk(Base64OutputStreamTest.java:106)

Running org.apache.commons.codec.binary.Base64Codec13Test
Tests run: 8, Failures: 0, Errors: 0, Skipped: 0, Time elapsed: 0.028 sec - in org.apache.commons.codec.binary.Base64Codec13Test
Running org.apache.commons.codec.binary.Base64InputStreamTest
Tests run: 19, Failures: 0, Errors: 16, Skipped: 0, Time elapsed: 0.03 sec <<< FAILURE! - in org.apache.commons.codec.binary.Base64InputStreamTest
testSkipToEnd(org.apache.commons.codec.binary.Base64InputStreamTest)  Time elapsed: 0.001 sec  <<< ERROR!
java.lang.NullPointerException: null
	at java.io.ByteArrayInputStream.<init>(ByteArrayInputStream.java:106)
	at org.apache.commons.codec.binary.Base64InputStreamTest.testSkipToEnd(Base64InputStreamTest.java:549)

testSkipNone(org.apache.commons.codec.binary.Base64InputStreamTest)  Time elapsed: 0 sec  <<< ERROR!
java.lang.NullPointerException: null
	at java.io.ByteArrayInputStream.<init>(ByteArrayInputStream.java:106)
	at org.apache.commons.codec.binary.Base64InputStreamTest.testSkipNone(Base64InputStreamTest.java:514)

testCodec98NPE(org.apache.commons.codec.binary.Base64InputStreamTest)  Time elapsed: 0.001 sec  <<< ERROR!
java.lang.NullPointerException: null
	at java.io.ByteArrayInputStream.<init>(ByteArrayInputStream.java:106)
	at org.apache.commons.codec.binary.Base64InputStreamTest.testCodec98NPE(Base64InputStreamTest.java:147)

testRead0(org.apache.commons.codec.binary.Base64InputStreamTest)  Time elapsed: 0 sec  <<< ERROR!
java.lang.NullPointerException: null
	at java.io.ByteArrayInputStream.<init>(ByteArrayInputStream.java:106)
	at org.apache.commons.codec.binary.Base64InputStreamTest.testRead0(Base64InputStreamTest.java:422)

testBase64InputStreamByChunk(org.apache.commons.codec.binary.Base64InputStreamTest)  Time elapsed: 0.001 sec  <<< ERROR!
java.lang.NullPointerException: null
	at java.io.ByteArrayInputStream.<init>(ByteArrayInputStream.java:106)
	at org.apache.commons.codec.binary.Base64InputStreamTest.testByChunk(Base64InputStreamTest.java:303)
	at org.apache.commons.codec.binary.Base64InputStreamTest.testBase64InputStreamByChunk(Base64InputStreamTest.java:216)

testMarkSupported(org.apache.commons.codec.binary.Base64InputStreamTest)  Time elapsed: 0 sec  <<< ERROR!
java.lang.NullPointerException: null
	at java.io.ByteArrayInputStream.<init>(ByteArrayInputStream.java:106)
	at org.apache.commons.codec.binary.Base64InputStreamTest.testMarkSupported(Base64InputStreamTest.java:405)

testInputStreamReader(org.apache.commons.codec.binary.Base64InputStreamTest)  Time elapsed: 0 sec  <<< ERROR!
java.lang.NullPointerException: null
	at java.io.ByteArrayInputStream.<init>(ByteArrayInputStream.java:106)
	at org.apache.commons.codec.binary.Base64InputStreamTest.testInputStreamReader(Base64InputStreamTest.java:129)

testReadOutOfBounds(org.apache.commons.codec.binary.Base64InputStreamTest)  Time elapsed: 0 sec  <<< ERROR!
java.lang.NullPointerException: null
	at java.io.ByteArrayInputStream.<init>(ByteArrayInputStream.java:106)
	at org.apache.commons.codec.binary.Base64InputStreamTest.testReadOutOfBounds(Base64InputStreamTest.java:458)

testReadNull(org.apache.commons.codec.binary.Base64InputStreamTest)  Time elapsed: 0.001 sec  <<< ERROR!
java.lang.NullPointerException: null
	at java.io.ByteArrayInputStream.<init>(ByteArrayInputStream.java:106)
	at org.apache.commons.codec.binary.Base64InputStreamTest.testReadNull(Base64InputStreamTest.java:438)

testCodec101(org.apache.commons.codec.binary.Base64InputStreamTest)  Time elapsed: 0 sec  <<< ERROR!
java.lang.NullPointerException: null
	at java.io.ByteArrayInputStream.<init>(ByteArrayInputStream.java:106)
	at org.apache.commons.codec.binary.Base64InputStreamTest.testCodec101(Base64InputStreamTest.java:100)

testCodec130(org.apache.commons.codec.binary.Base64InputStreamTest)  Time elapsed: 0.001 sec  <<< ERROR!
java.lang.NullPointerException: null
	at java.io.FilterOutputStream.write(FilterOutputStream.java:97)
	at org.apache.commons.codec.binary.Base64InputStreamTest.testCodec130(Base64InputStreamTest.java:62)

testSkipWrongArgument(org.apache.commons.codec.binary.Base64InputStreamTest)  Time elapsed: 0 sec  <<< ERROR!
java.lang.Exception: Unexpected exception, expected<java.lang.IllegalArgumentException> but was<java.lang.NullPointerException>
	at java.io.ByteArrayInputStream.<init>(ByteArrayInputStream.java:106)
	at org.apache.commons.codec.binary.Base64InputStreamTest.testSkipWrongArgument(Base64InputStreamTest.java:566)

testAvailable(org.apache.commons.codec.binary.Base64InputStreamTest)  Time elapsed: 0.001 sec  <<< ERROR!
java.lang.NullPointerException: null
	at java.io.ByteArrayInputStream.<init>(ByteArrayInputStream.java:106)
	at org.apache.commons.codec.binary.Base64InputStreamTest.testAvailable(Base64InputStreamTest.java:164)

testSkipPastEnd(org.apache.commons.codec.binary.Base64InputStreamTest)  Time elapsed: 0 sec  <<< ERROR!
java.lang.NullPointerException: null
	at java.io.ByteArrayInputStream.<init>(ByteArrayInputStream.java:106)
	at org.apache.commons.codec.binary.Base64InputStreamTest.testSkipPastEnd(Base64InputStreamTest.java:532)

testSkipBig(org.apache.commons.codec.binary.Base64InputStreamTest)  Time elapsed: 0 sec  <<< ERROR!
java.lang.NullPointerException: null
	at java.io.ByteArrayInputStream.<init>(ByteArrayInputStream.java:106)
	at org.apache.commons.codec.binary.Base64InputStreamTest.testSkipBig(Base64InputStreamTest.java:498)

testBase64InputStreamByteByByte(org.apache.commons.codec.binary.Base64InputStreamTest)  Time elapsed: 0 sec  <<< ERROR!
java.lang.NullPointerException: null
	at java.io.ByteArrayInputStream.<init>(ByteArrayInputStream.java:106)
	at org.apache.commons.codec.binary.Base64InputStreamTest.testByteByByte(Base64InputStreamTest.java:356)
	at org.apache.commons.codec.binary.Base64InputStreamTest.testBase64InputStreamByteByByte(Base64InputStreamTest.java:254)

Running org.apache.commons.codec.binary.Base32InputStreamTest
Tests run: 16, Failures: 0, Errors: 13, Skipped: 0, Time elapsed: 0.002 sec <<< FAILURE! - in org.apache.commons.codec.binary.Base32InputStreamTest
testBase32InputStreamByteByByte(org.apache.commons.codec.binary.Base32InputStreamTest)  Time elapsed: 0 sec  <<< ERROR!
java.lang.NullPointerException: null
	at java.io.ByteArrayInputStream.<init>(ByteArrayInputStream.java:106)
	at org.apache.commons.codec.binary.Base32InputStreamTest.testByteByByte(Base32InputStreamTest.java:342)
	at org.apache.commons.codec.binary.Base32InputStreamTest.testBase32InputStreamByteByByte(Base32InputStreamTest.java:245)

testSkipToEnd(org.apache.commons.codec.binary.Base32InputStreamTest)  Time elapsed: 0 sec  <<< ERROR!
java.lang.NullPointerException: null
	at java.io.ByteArrayInputStream.<init>(ByteArrayInputStream.java:106)
	at org.apache.commons.codec.binary.Base32InputStreamTest.testSkipToEnd(Base32InputStreamTest.java:535)

testSkipNone(org.apache.commons.codec.binary.Base32InputStreamTest)  Time elapsed: 0 sec  <<< ERROR!
java.lang.NullPointerException: null
	at java.io.ByteArrayInputStream.<init>(ByteArrayInputStream.java:106)
	at org.apache.commons.codec.binary.Base32InputStreamTest.testSkipNone(Base32InputStreamTest.java:484)

testRead0(org.apache.commons.codec.binary.Base32InputStreamTest)  Time elapsed: 0 sec  <<< ERROR!
java.lang.NullPointerException: null
	at java.io.ByteArrayInputStream.<init>(ByteArrayInputStream.java:106)
	at org.apache.commons.codec.binary.Base32InputStreamTest.testRead0(Base32InputStreamTest.java:408)

testMarkSupported(org.apache.commons.codec.binary.Base32InputStreamTest)  Time elapsed: 0 sec  <<< ERROR!
java.lang.NullPointerException: null
	at java.io.ByteArrayInputStream.<init>(ByteArrayInputStream.java:106)
	at org.apache.commons.codec.binary.Base32InputStreamTest.testMarkSupported(Base32InputStreamTest.java:391)

testReadOutOfBounds(org.apache.commons.codec.binary.Base32InputStreamTest)  Time elapsed: 0 sec  <<< ERROR!
java.lang.NullPointerException: null
	at java.io.ByteArrayInputStream.<init>(ByteArrayInputStream.java:106)
	at org.apache.commons.codec.binary.Base32InputStreamTest.testReadOutOfBounds(Base32InputStreamTest.java:444)

testReadNull(org.apache.commons.codec.binary.Base32InputStreamTest)  Time elapsed: 0 sec  <<< ERROR!
java.lang.NullPointerException: null
	at java.io.ByteArrayInputStream.<init>(ByteArrayInputStream.java:106)
	at org.apache.commons.codec.binary.Base32InputStreamTest.testReadNull(Base32InputStreamTest.java:424)

testCodec130(org.apache.commons.codec.binary.Base32InputStreamTest)  Time elapsed: 0 sec  <<< ERROR!
java.lang.NullPointerException: null
	at java.io.FilterOutputStream.write(FilterOutputStream.java:97)
	at org.apache.commons.codec.binary.Base32InputStreamTest.testCodec130(Base32InputStreamTest.java:52)

testSkipWrongArgument(org.apache.commons.codec.binary.Base32InputStreamTest)  Time elapsed: 0 sec  <<< ERROR!
java.lang.Exception: Unexpected exception, expected<java.lang.IllegalArgumentException> but was<java.lang.NullPointerException>
	at java.io.ByteArrayInputStream.<init>(ByteArrayInputStream.java:106)
	at org.apache.commons.codec.binary.Base32InputStreamTest.testSkipWrongArgument(Base32InputStreamTest.java:552)

testAvailable(org.apache.commons.codec.binary.Base32InputStreamTest)  Time elapsed: 0 sec  <<< ERROR!
java.lang.NullPointerException: null
	at java.io.ByteArrayInputStream.<init>(ByteArrayInputStream.java:106)
	at org.apache.commons.codec.binary.Base32InputStreamTest.testAvailable(Base32InputStreamTest.java:154)

testSkipPastEnd(org.apache.commons.codec.binary.Base32InputStreamTest)  Time elapsed: 0 sec  <<< ERROR!
java.lang.NullPointerException: null
	at java.io.ByteArrayInputStream.<init>(ByteArrayInputStream.java:106)
	at org.apache.commons.codec.binary.Base32InputStreamTest.testSkipPastEnd(Base32InputStreamTest.java:518)

testSkipBig(org.apache.commons.codec.binary.Base32InputStreamTest)  Time elapsed: 0 sec  <<< ERROR!
java.lang.NullPointerException: null
	at java.io.ByteArrayInputStream.<init>(ByteArrayInputStream.java:106)
	at org.apache.commons.codec.binary.Base32InputStreamTest.testSkipBig(Base32InputStreamTest.java:502)

testBase32InputStreamByChunk(org.apache.commons.codec.binary.Base32InputStreamTest)  Time elapsed: 0 sec  <<< ERROR!
java.lang.NullPointerException: null
	at java.io.ByteArrayInputStream.<init>(ByteArrayInputStream.java:106)
	at org.apache.commons.codec.binary.Base32InputStreamTest.testByChunk(Base32InputStreamTest.java:291)
	at org.apache.commons.codec.binary.Base32InputStreamTest.testBase32InputStreamByChunk(Base32InputStreamTest.java:206)

Running org.apache.commons.codec.binary.Base32OutputStreamTest
Tests run: 6, Failures: 0, Errors: 2, Skipped: 0, Time elapsed: 0.001 sec <<< FAILURE! - in org.apache.commons.codec.binary.Base32OutputStreamTest
testBase32OutputStreamByChunk(org.apache.commons.codec.binary.Base32OutputStreamTest)  Time elapsed: 0 sec  <<< ERROR!
java.lang.NullPointerException: null
	at java.io.FilterOutputStream.write(FilterOutputStream.java:97)
	at org.apache.commons.codec.binary.Base32OutputStreamTest.testByChunk(Base32OutputStreamTest.java:183)
	at org.apache.commons.codec.binary.Base32OutputStreamTest.testBase32OutputStreamByChunk(Base32OutputStreamTest.java:101)

testBase32OutputStreamByteByByte(org.apache.commons.codec.binary.Base32OutputStreamTest)  Time elapsed: 0 sec  <<< ERROR!
java.lang.NullPointerException: null
	at org.apache.commons.codec.binary.Base32OutputStreamTest.testByteByByte(Base32OutputStreamTest.java:233)
	at org.apache.commons.codec.binary.Base32OutputStreamTest.testBase32OutputStreamByteByByte(Base32OutputStreamTest.java:136)

Running org.apache.commons.codec.binary.BinaryCodecTest
Tests run: 13, Failures: 0, Errors: 0, Skipped: 0, Time elapsed: 0.006 sec - in org.apache.commons.codec.binary.BinaryCodecTest
Running org.apache.commons.codec.binary.BaseNCodecTest
Tests run: 7, Failures: 0, Errors: 1, Skipped: 0, Time elapsed: 0.003 sec <<< FAILURE! - in org.apache.commons.codec.binary.BaseNCodecTest
testIsInAlphabetString(org.apache.commons.codec.binary.BaseNCodecTest)  Time elapsed: 0 sec  <<< ERROR!
java.lang.NullPointerException: null
	at org.apache.commons.codec.binary.BaseNCodec.isInAlphabet(BaseNCodec.java:464)
	at org.apache.commons.codec.binary.BaseNCodec.isInAlphabet(BaseNCodec.java:483)
	at org.apache.commons.codec.binary.BaseNCodecTest.testIsInAlphabetString(BaseNCodecTest.java:151)

Running org.apache.commons.codec.binary.StringUtilsTest
Tests run: 17, Failures: 6, Errors: 0, Skipped: 0, Time elapsed: 0.025 sec <<< FAILURE! - in org.apache.commons.codec.binary.StringUtilsTest
testGetBytesUtf16(org.apache.commons.codec.binary.StringUtilsTest)  Time elapsed: 0.001 sec  <<< FAILURE!
java.lang.AssertionError: null
	at org.junit.Assert.fail(Assert.java:86)
	at org.junit.Assert.assertTrue(Assert.java:41)
	at org.junit.Assert.assertTrue(Assert.java:52)
	at org.apache.commons.codec.binary.StringUtilsTest.testGetBytesUtf16(StringUtilsTest.java:82)

testGetBytesUtf8(org.apache.commons.codec.binary.StringUtilsTest)  Time elapsed: 0 sec  <<< FAILURE!
java.lang.AssertionError: null
	at org.junit.Assert.fail(Assert.java:86)
	at org.junit.Assert.assertTrue(Assert.java:41)
	at org.junit.Assert.assertTrue(Assert.java:52)
	at org.apache.commons.codec.binary.StringUtilsTest.testGetBytesUtf8(StringUtilsTest.java:109)

testGetBytesIso8859_1(org.apache.commons.codec.binary.StringUtilsTest)  Time elapsed: 0 sec  <<< FAILURE!
java.lang.AssertionError: null
	at org.junit.Assert.fail(Assert.java:86)
	at org.junit.Assert.assertTrue(Assert.java:41)
	at org.junit.Assert.assertTrue(Assert.java:52)
	at org.apache.commons.codec.binary.StringUtilsTest.testGetBytesIso8859_1(StringUtilsTest.java:58)

testGetBytesUsAscii(org.apache.commons.codec.binary.StringUtilsTest)  Time elapsed: 0 sec  <<< FAILURE!
java.lang.AssertionError: null
	at org.junit.Assert.fail(Assert.java:86)
	at org.junit.Assert.assertTrue(Assert.java:41)
	at org.junit.Assert.assertTrue(Assert.java:52)
	at org.apache.commons.codec.binary.StringUtilsTest.testGetBytesUsAscii(StringUtilsTest.java:73)

testGetBytesUtf16Be(org.apache.commons.codec.binary.StringUtilsTest)  Time elapsed: 0.001 sec  <<< FAILURE!
java.lang.AssertionError: null
	at org.junit.Assert.fail(Assert.java:86)
	at org.junit.Assert.assertTrue(Assert.java:41)
	at org.junit.Assert.assertTrue(Assert.java:52)
	at org.apache.commons.codec.binary.StringUtilsTest.testGetBytesUtf16Be(StringUtilsTest.java:91)

testGetBytesUtf16Le(org.apache.commons.codec.binary.StringUtilsTest)  Time elapsed: 0 sec  <<< FAILURE!
java.lang.AssertionError: null
	at org.junit.Assert.fail(Assert.java:86)
	at org.junit.Assert.assertTrue(Assert.java:41)
	at org.junit.Assert.assertTrue(Assert.java:52)
	at org.apache.commons.codec.binary.StringUtilsTest.testGetBytesUtf16Le(StringUtilsTest.java:100)

Running org.apache.commons.codec.binary.Base64Test
Tests run: 53, Failures: 6, Errors: 5, Skipped: 1, Time elapsed: 0.05 sec <<< FAILURE! - in org.apache.commons.codec.binary.Base64Test
testStringToByteVariations(org.apache.commons.codec.binary.Base64Test)  Time elapsed: 0.001 sec  <<< FAILURE!
java.lang.AssertionError: StringToByte Hello World expected:<Hello World> but was:<null>
	at org.junit.Assert.fail(Assert.java:88)
	at org.junit.Assert.failNotEquals(Assert.java:743)
	at org.junit.Assert.assertEquals(Assert.java:118)
	at org.apache.commons.codec.binary.Base64Test.testStringToByteVariations(Base64Test.java:1218)

testUUID(org.apache.commons.codec.binary.Base64Test)  Time elapsed: 0 sec  <<< FAILURE!
java.lang.AssertionError: standard encode uuid
	at org.junit.Assert.fail(Assert.java:88)
	at org.junit.Assert.assertTrue(Assert.java:41)
	at org.apache.commons.codec.binary.Base64Test.testUUID(Base64Test.java:1180)

testRfc4648Section10DecodeEncode(org.apache.commons.codec.binary.Base64Test)  Time elapsed: 0 sec  <<< ERROR!
java.lang.NullPointerException: null
	at java.lang.String.<init>(String.java:505)
	at org.apache.commons.codec.binary.StringUtils.newStringUsAscii(StringUtils.java:34)
	at org.apache.commons.codec.binary.Base64Test.testDecodeEncode(Base64Test.java:680)
	at org.apache.commons.codec.binary.Base64Test.testRfc4648Section10DecodeEncode(Base64Test.java:670)

testChunkedEncodeMultipleOf76(org.apache.commons.codec.binary.Base64Test)  Time elapsed: 0.001 sec  <<< FAILURE!
java.lang.AssertionError: chunkedEncodeMultipleOf76
	at org.junit.Assert.fail(Assert.java:88)
	at org.junit.Assert.assertTrue(Assert.java:41)
	at org.apache.commons.codec.binary.Base64Test.testChunkedEncodeMultipleOf76(Base64Test.java:132)

testBase64(org.apache.commons.codec.binary.Base64Test)  Time elapsed: 0 sec  <<< FAILURE!
java.lang.AssertionError: encoding hello world expected:<SGVsbG8gV29ybGQ=> but was:<null>
	at org.junit.Assert.fail(Assert.java:88)
	at org.junit.Assert.failNotEquals(Assert.java:743)
	at org.junit.Assert.assertEquals(Assert.java:118)
	at org.apache.commons.codec.binary.Base64Test.testBase64(Base64Test.java:84)

testByteToStringVariations(org.apache.commons.codec.binary.Base64Test)  Time elapsed: 0 sec  <<< FAILURE!
java.lang.AssertionError: byteToString Hello World expected:<SGVsbG8gV29ybGQ=> but was:<null>
	at org.junit.Assert.fail(Assert.java:88)
	at org.junit.Assert.failNotEquals(Assert.java:743)
	at org.junit.Assert.assertEquals(Assert.java:118)
	at org.apache.commons.codec.binary.Base64Test.testByteToStringVariations(Base64Test.java:1197)

testRfc4648Section10DecodeWithCrLf(org.apache.commons.codec.binary.Base64Test)  Time elapsed: 0 sec  <<< ERROR!
java.lang.NullPointerException: null
	at java.lang.String.<init>(String.java:505)
	at org.apache.commons.codec.binary.StringUtils.newStringUsAscii(StringUtils.java:34)
	at org.apache.commons.codec.binary.Base64Test.testRfc4648Section10DecodeWithCrLf(Base64Test.java:620)

testRfc4648Section10Decode(org.apache.commons.codec.binary.Base64Test)  Time elapsed: 0 sec  <<< ERROR!
java.lang.NullPointerException: null
	at java.lang.String.<init>(String.java:505)
	at org.apache.commons.codec.binary.StringUtils.newStringUsAscii(StringUtils.java:34)
	at org.apache.commons.codec.binary.Base64Test.testRfc4648Section10Decode(Base64Test.java:594)

testRfc4648Section10Encode(org.apache.commons.codec.binary.Base64Test)  Time elapsed: 0.001 sec  <<< FAILURE!
java.lang.AssertionError: expected:<> but was:<null>
	at org.junit.Assert.fail(Assert.java:88)
	at org.junit.Assert.failNotEquals(Assert.java:743)
	at org.junit.Assert.assertEquals(Assert.java:118)
	at org.junit.Assert.assertEquals(Assert.java:144)
	at org.apache.commons.codec.binary.Base64Test.testRfc4648Section10Encode(Base64Test.java:645)

testIsStringBase64(org.apache.commons.codec.binary.Base64Test)  Time elapsed: 0 sec  <<< ERROR!
java.lang.NullPointerException: null
	at org.apache.commons.codec.binary.Base64.isBase64(Base64.java:538)
	at org.apache.commons.codec.binary.Base64.isBase64(Base64.java:524)
	at org.apache.commons.codec.binary.Base64Test.testIsStringBase64(Base64Test.java:70)

testRfc4648Section10EncodeDecode(org.apache.commons.codec.binary.Base64Test)  Time elapsed: 0.001 sec  <<< ERROR!
java.lang.NullPointerException: null
	at org.apache.commons.codec.binary.StringUtils.getBytes(StringUtils.java:18)
	at org.apache.commons.codec.binary.StringUtils.getBytesUtf8(StringUtils.java:27)
	at org.apache.commons.codec.binary.BaseNCodec.decode(BaseNCodec.java:394)
	at org.apache.commons.codec.binary.Base64.decodeBase64(Base64.java:692)
	at org.apache.commons.codec.binary.Base64Test.testEncodeDecode(Base64Test.java:712)
	at org.apache.commons.codec.binary.Base64Test.testRfc4648Section10EncodeDecode(Base64Test.java:701)

Running org.apache.commons.codec.binary.HexTest
Tests run: 19, Failures: 1, Errors: 2, Skipped: 0, Time elapsed: 0.173 sec <<< FAILURE! - in org.apache.commons.codec.binary.HexTest
testHelloWorldLowerCaseHex(org.apache.commons.codec.binary.HexTest)  Time elapsed: 0 sec  <<< ERROR!
java.lang.NullPointerException: null
	at org.apache.commons.codec.binary.Hex.encodeHex(Hex.java:141)
	at org.apache.commons.codec.binary.Hex.encodeHex(Hex.java:125)
	at org.apache.commons.codec.binary.Hex.encodeHex(Hex.java:109)
	at org.apache.commons.codec.binary.HexTest.testHelloWorldLowerCaseHex(HexTest.java:313)

testHelloWorldUpperCaseHex(org.apache.commons.codec.binary.HexTest)  Time elapsed: 0 sec  <<< ERROR!
java.lang.NullPointerException: null
	at org.apache.commons.codec.binary.Hex.encodeHex(Hex.java:141)
	at org.apache.commons.codec.binary.Hex.encodeHex(Hex.java:125)
	at org.apache.commons.codec.binary.Hex.encodeHex(Hex.java:109)
	at org.apache.commons.codec.binary.HexTest.testHelloWorldUpperCaseHex(HexTest.java:326)

testEncodeDecodeRandom(org.apache.commons.codec.binary.HexTest)  Time elapsed: 0.003 sec  <<< FAILURE!
java.lang.AssertionError: null
	at org.junit.Assert.fail(Assert.java:86)
	at org.junit.Assert.assertTrue(Assert.java:41)
	at org.junit.Assert.assertTrue(Assert.java:52)
	at org.apache.commons.codec.binary.HexTest.testEncodeDecodeRandom(HexTest.java:285)

Running org.apache.commons.codec.DecoderExceptionTest
Tests run: 4, Failures: 0, Errors: 0, Skipped: 0, Time elapsed: 0 sec - in org.apache.commons.codec.DecoderExceptionTest
Running org.apache.commons.codec.EncoderExceptionTest
Tests run: 4, Failures: 0, Errors: 0, Skipped: 0, Time elapsed: 0.001 sec - in org.apache.commons.codec.EncoderExceptionTest
Running org.apache.commons.codec.net.BCodecTest
Tests run: 9, Failures: 0, Errors: 3, Skipped: 0, Time elapsed: 0.007 sec <<< FAILURE! - in org.apache.commons.codec.net.BCodecTest
testUTF8RoundTrip(org.apache.commons.codec.net.BCodecTest)  Time elapsed: 0.002 sec  <<< ERROR!
java.lang.NullPointerException: null
	at java.lang.String.<init>(String.java:481)
	at org.apache.commons.codec.net.RFC1522Codec.decodeText(RFC1522Codec.java:155)
	at org.apache.commons.codec.net.BCodec.decode(BCodec.java:181)
	at org.apache.commons.codec.net.BCodecTest.testUTF8RoundTrip(BCodecTest.java:72)

testBasicEncodeDecode(org.apache.commons.codec.net.BCodecTest)  Time elapsed: 0.001 sec  <<< ERROR!
java.lang.NullPointerException: null
	at java.lang.String.<init>(String.java:481)
	at org.apache.commons.codec.net.RFC1522Codec.decodeText(RFC1522Codec.java:155)
	at org.apache.commons.codec.net.BCodec.decode(BCodec.java:181)
	at org.apache.commons.codec.net.BCodecTest.testBasicEncodeDecode(BCodecTest.java:82)

testDecodeObjects(org.apache.commons.codec.net.BCodecTest)  Time elapsed: 0.001 sec  <<< ERROR!
java.lang.NullPointerException: null
	at java.lang.String.<init>(String.java:481)
	at org.apache.commons.codec.net.RFC1522Codec.decodeText(RFC1522Codec.java:155)
	at org.apache.commons.codec.net.BCodec.decode(BCodec.java:181)
	at org.apache.commons.codec.net.BCodec.decode(BCodec.java:225)
	at org.apache.commons.codec.net.BCodecTest.testDecodeObjects(BCodecTest.java:137)

Running org.apache.commons.codec.net.QCodecTest
Tests run: 12, Failures: 0, Errors: 5, Skipped: 0, Time elapsed: 0.009 sec <<< FAILURE! - in org.apache.commons.codec.net.QCodecTest
testUTF8RoundTrip(org.apache.commons.codec.net.QCodecTest)  Time elapsed: 0.003 sec  <<< ERROR!
java.lang.NullPointerException: null
	at java.lang.String.<init>(String.java:481)
	at org.apache.commons.codec.net.RFC1522Codec.decodeText(RFC1522Codec.java:155)
	at org.apache.commons.codec.net.QCodec.decode(QCodec.java:269)
	at org.apache.commons.codec.net.QCodecTest.testUTF8RoundTrip(QCodecTest.java:81)

testEncodeDecodeBlanks(org.apache.commons.codec.net.QCodecTest)  Time elapsed: 0 sec  <<< ERROR!
java.lang.NullPointerException: null
	at java.lang.String.<init>(String.java:481)
	at org.apache.commons.codec.net.RFC1522Codec.decodeText(RFC1522Codec.java:155)
	at org.apache.commons.codec.net.QCodec.decode(QCodec.java:269)
	at org.apache.commons.codec.net.QCodecTest.testEncodeDecodeBlanks(QCodecTest.java:193)

testBasicEncodeDecode(org.apache.commons.codec.net.QCodecTest)  Time elapsed: 0 sec  <<< ERROR!
java.lang.NullPointerException: null
	at java.lang.String.<init>(String.java:481)
	at org.apache.commons.codec.net.RFC1522Codec.decodeText(RFC1522Codec.java:155)
	at org.apache.commons.codec.net.QCodec.decode(QCodec.java:269)
	at org.apache.commons.codec.net.QCodecTest.testBasicEncodeDecode(QCodecTest.java:93)

testDecodeObjects(org.apache.commons.codec.net.QCodecTest)  Time elapsed: 0 sec  <<< ERROR!
java.lang.NullPointerException: null
	at java.lang.String.<init>(String.java:481)
	at org.apache.commons.codec.net.RFC1522Codec.decodeText(RFC1522Codec.java:155)
	at org.apache.commons.codec.net.QCodec.decode(QCodec.java:269)
	at org.apache.commons.codec.net.QCodec.decode(QCodec.java:313)
	at org.apache.commons.codec.net.QCodecTest.testDecodeObjects(QCodecTest.java:164)

testUnsafeEncodeDecode(org.apache.commons.codec.net.QCodecTest)  Time elapsed: 0.001 sec  <<< ERROR!
java.lang.NullPointerException: null
	at java.lang.String.<init>(String.java:481)
	at org.apache.commons.codec.net.RFC1522Codec.decodeText(RFC1522Codec.java:155)
	at org.apache.commons.codec.net.QCodec.decode(QCodec.java:269)
	at org.apache.commons.codec.net.QCodecTest.testUnsafeEncodeDecode(QCodecTest.java:104)

Running org.apache.commons.codec.net.UtilsTest
Tests run: 1, Failures: 0, Errors: 0, Skipped: 0, Time elapsed: 0 sec - in org.apache.commons.codec.net.UtilsTest
Running org.apache.commons.codec.net.RFC1522CodecTest
Tests run: 2, Failures: 0, Errors: 0, Skipped: 0, Time elapsed: 0.001 sec - in org.apache.commons.codec.net.RFC1522CodecTest
Running org.apache.commons.codec.net.URLCodecTest
Tests run: 16, Failures: 0, Errors: 8, Skipped: 0, Time elapsed: 0.006 sec <<< FAILURE! - in org.apache.commons.codec.net.URLCodecTest
testUTF8RoundTrip(org.apache.commons.codec.net.URLCodecTest)  Time elapsed: 0 sec  <<< ERROR!
java.lang.NullPointerException: null
	at java.lang.String.<init>(String.java:481)
	at org.apache.commons.codec.net.URLCodec.decode(URLCodec.java:273)
	at org.apache.commons.codec.net.URLCodecTest.testUTF8RoundTrip(URLCodecTest.java:77)

testEncodeUrlWithNullBitSet(org.apache.commons.codec.net.URLCodecTest)  Time elapsed: 0 sec  <<< ERROR!
java.lang.NullPointerException: null
	at java.lang.String.<init>(String.java:481)
	at org.apache.commons.codec.net.URLCodec.decode(URLCodec.java:273)
	at org.apache.commons.codec.net.URLCodec.decode(URLCodec.java:293)
	at org.apache.commons.codec.net.URLCodecTest.testEncodeUrlWithNullBitSet(URLCodecTest.java:194)

testBasicEncodeDecode(org.apache.commons.codec.net.URLCodecTest)  Time elapsed: 0.001 sec  <<< ERROR!
java.lang.NullPointerException: null
	at java.lang.String.<init>(String.java:481)
	at org.apache.commons.codec.net.URLCodec.decode(URLCodec.java:273)
	at org.apache.commons.codec.net.URLCodec.decode(URLCodec.java:293)
	at org.apache.commons.codec.net.URLCodecTest.testBasicEncodeDecode(URLCodecTest.java:89)

testSafeCharEncodeDecode(org.apache.commons.codec.net.URLCodecTest)  Time elapsed: 0.001 sec  <<< ERROR!
java.lang.NullPointerException: null
	at java.lang.String.<init>(String.java:481)
	at org.apache.commons.codec.net.URLCodec.decode(URLCodec.java:273)
	at org.apache.commons.codec.net.URLCodec.decode(URLCodec.java:293)
	at org.apache.commons.codec.net.URLCodecTest.testSafeCharEncodeDecode(URLCodecTest.java:102)

testDecodeInvalid(org.apache.commons.codec.net.URLCodecTest)  Time elapsed: 0 sec  <<< ERROR!
java.lang.NullPointerException: null
	at java.lang.String.<init>(String.java:481)
	at org.apache.commons.codec.net.URLCodec.decode(URLCodec.java:273)
	at org.apache.commons.codec.net.URLCodec.decode(URLCodec.java:293)
	at org.apache.commons.codec.net.URLCodecTest.testDecodeInvalid(URLCodecTest.java:136)

testDecodeObjects(org.apache.commons.codec.net.URLCodecTest)  Time elapsed: 0.001 sec  <<< ERROR!
java.lang.NullPointerException: null
	at java.lang.String.<init>(String.java:481)
	at org.apache.commons.codec.net.URLCodec.decode(URLCodec.java:273)
	at org.apache.commons.codec.net.URLCodec.decode(URLCodec.java:293)
	at org.apache.commons.codec.net.URLCodec.decode(URLCodec.java:340)
	at org.apache.commons.codec.net.URLCodecTest.testDecodeObjects(URLCodecTest.java:272)

testInvalidEncoding(org.apache.commons.codec.net.URLCodecTest)  Time elapsed: 0 sec  <<< ERROR!
java.lang.NullPointerException: null
	at java.lang.String.<init>(String.java:481)
	at org.apache.commons.codec.net.URLCodec.decode(URLCodec.java:273)
	at org.apache.commons.codec.net.URLCodec.decode(URLCodec.java:293)
	at org.apache.commons.codec.net.URLCodecTest.testInvalidEncoding(URLCodecTest.java:260)

testUnsafeEncodeDecode(org.apache.commons.codec.net.URLCodecTest)  Time elapsed: 0 sec  <<< ERROR!
java.lang.NullPointerException: null
	at java.lang.String.<init>(String.java:481)
	at org.apache.commons.codec.net.URLCodec.decode(URLCodec.java:273)
	at org.apache.commons.codec.net.URLCodec.decode(URLCodec.java:293)
	at org.apache.commons.codec.net.URLCodecTest.testUnsafeEncodeDecode(URLCodecTest.java:115)

Running org.apache.commons.codec.net.QuotedPrintableCodecTest
Tests run: 21, Failures: 0, Errors: 10, Skipped: 0, Time elapsed: 0.01 sec <<< FAILURE! - in org.apache.commons.codec.net.QuotedPrintableCodecTest
testUTF8RoundTrip(org.apache.commons.codec.net.QuotedPrintableCodecTest)  Time elapsed: 0 sec  <<< ERROR!
java.lang.NullPointerException: null
	at java.lang.String.<init>(String.java:481)
	at org.apache.commons.codec.net.QuotedPrintableCodec.decode(QuotedPrintableCodec.java:471)
	at org.apache.commons.codec.net.QuotedPrintableCodecTest.testUTF8RoundTrip(QuotedPrintableCodecTest.java:70)

testEncodeUrlWithNullBitSet(org.apache.commons.codec.net.QuotedPrintableCodecTest)  Time elapsed: 0 sec  <<< ERROR!
java.lang.NullPointerException: null
	at java.lang.String.<init>(String.java:505)
	at org.apache.commons.codec.net.QuotedPrintableCodec.decode(QuotedPrintableCodec.java:450)
	at org.apache.commons.codec.net.QuotedPrintableCodec.decode(QuotedPrintableCodec.java:487)
	at org.apache.commons.codec.net.QuotedPrintableCodecTest.testEncodeUrlWithNullBitSet(QuotedPrintableCodecTest.java:158)

testBasicEncodeDecode(org.apache.commons.codec.net.QuotedPrintableCodecTest)  Time elapsed: 0 sec  <<< ERROR!
java.lang.NullPointerException: null
	at java.lang.String.<init>(String.java:505)
	at org.apache.commons.codec.net.QuotedPrintableCodec.decode(QuotedPrintableCodec.java:450)
	at org.apache.commons.codec.net.QuotedPrintableCodec.decode(QuotedPrintableCodec.java:487)
	at org.apache.commons.codec.net.QuotedPrintableCodecTest.testBasicEncodeDecode(QuotedPrintableCodecTest.java:81)

testSafeCharEncodeDecode(org.apache.commons.codec.net.QuotedPrintableCodecTest)  Time elapsed: 0 sec  <<< ERROR!
java.lang.NullPointerException: null
	at java.lang.String.<init>(String.java:505)
	at org.apache.commons.codec.net.QuotedPrintableCodec.decode(QuotedPrintableCodec.java:450)
	at org.apache.commons.codec.net.QuotedPrintableCodec.decode(QuotedPrintableCodec.java:487)
	at org.apache.commons.codec.net.QuotedPrintableCodecTest.testSafeCharEncodeDecode(QuotedPrintableCodecTest.java:92)

testDecodeInvalid(org.apache.commons.codec.net.QuotedPrintableCodecTest)  Time elapsed: 0 sec  <<< ERROR!
java.lang.NullPointerException: null
	at java.lang.String.<init>(String.java:505)
	at org.apache.commons.codec.net.QuotedPrintableCodec.decode(QuotedPrintableCodec.java:450)
	at org.apache.commons.codec.net.QuotedPrintableCodec.decode(QuotedPrintableCodec.java:487)
	at org.apache.commons.codec.net.QuotedPrintableCodecTest.testDecodeInvalid(QuotedPrintableCodecTest.java:122)

testSkipNotEncodedCRLF(org.apache.commons.codec.net.QuotedPrintableCodecTest)  Time elapsed: 0 sec  <<< ERROR!
java.lang.NullPointerException: null
	at java.lang.String.<init>(String.java:505)
	at org.apache.commons.codec.net.QuotedPrintableCodec.decode(QuotedPrintableCodec.java:450)
	at org.apache.commons.codec.net.QuotedPrintableCodec.decode(QuotedPrintableCodec.java:487)
	at org.apache.commons.codec.net.QuotedPrintableCodecTest.testSkipNotEncodedCRLF(QuotedPrintableCodecTest.java:283)

testSoftLineBreakDecode(org.apache.commons.codec.net.QuotedPrintableCodecTest)  Time elapsed: 0.001 sec  <<< ERROR!
java.lang.NullPointerException: null
	at java.lang.String.<init>(String.java:505)
	at org.apache.commons.codec.net.QuotedPrintableCodec.decode(QuotedPrintableCodec.java:450)
	at org.apache.commons.codec.net.QuotedPrintableCodec.decode(QuotedPrintableCodec.java:487)
	at org.apache.commons.codec.net.QuotedPrintableCodecTest.testSoftLineBreakDecode(QuotedPrintableCodecTest.java:259)

testSoftLineBreakEncode(org.apache.commons.codec.net.QuotedPrintableCodecTest)  Time elapsed: 0 sec  <<< ERROR!
java.lang.NullPointerException: null
	at java.lang.String.<init>(String.java:505)
	at org.apache.commons.codec.net.QuotedPrintableCodec.decode(QuotedPrintableCodec.java:450)
	at org.apache.commons.codec.net.QuotedPrintableCodec.decode(QuotedPrintableCodec.java:487)
	at org.apache.commons.codec.net.QuotedPrintableCodecTest.testSoftLineBreakEncode(QuotedPrintableCodecTest.java:273)

testDecodeObjects(org.apache.commons.codec.net.QuotedPrintableCodecTest)  Time elapsed: 0.001 sec  <<< ERROR!
java.lang.NullPointerException: null
	at java.lang.String.<init>(String.java:505)
	at org.apache.commons.codec.net.QuotedPrintableCodec.decode(QuotedPrintableCodec.java:450)
	at org.apache.commons.codec.net.QuotedPrintableCodec.decode(QuotedPrintableCodec.java:487)
	at org.apache.commons.codec.net.QuotedPrintableCodec.decode(QuotedPrintableCodec.java:533)
	at org.apache.commons.codec.net.QuotedPrintableCodecTest.testDecodeObjects(QuotedPrintableCodecTest.java:221)

testUnsafeEncodeDecode(org.apache.commons.codec.net.QuotedPrintableCodecTest)  Time elapsed: 0.001 sec  <<< ERROR!
java.lang.NullPointerException: null
	at java.lang.String.<init>(String.java:505)
	at org.apache.commons.codec.net.QuotedPrintableCodec.decode(QuotedPrintableCodec.java:450)
	at org.apache.commons.codec.net.QuotedPrintableCodec.decode(QuotedPrintableCodec.java:487)
	at org.apache.commons.codec.net.QuotedPrintableCodecTest.testUnsafeEncodeDecode(QuotedPrintableCodecTest.java:104)

Running org.apache.commons.codec.StringEncoderComparatorTest
Tests run: 3, Failures: 0, Errors: 0, Skipped: 0, Time elapsed: 0.002 sec - in org.apache.commons.codec.StringEncoderComparatorTest
Running org.apache.commons.codec.language.Caverphone1Test
Tests run: 9, Failures: 0, Errors: 0, Skipped: 0, Time elapsed: 0.025 sec - in org.apache.commons.codec.language.Caverphone1Test
Running org.apache.commons.codec.language.NysiisTest
Tests run: 23, Failures: 0, Errors: 0, Skipped: 0, Time elapsed: 0.018 sec - in org.apache.commons.codec.language.NysiisTest
Running org.apache.commons.codec.language.Caverphone2Test
Tests run: 13, Failures: 0, Errors: 0, Skipped: 0, Time elapsed: 0.145 sec - in org.apache.commons.codec.language.Caverphone2Test
Running org.apache.commons.codec.language.DaitchMokotoffSoundexTest
Tests run: 13, Failures: 0, Errors: 0, Skipped: 0, Time elapsed: 0.053 sec - in org.apache.commons.codec.language.DaitchMokotoffSoundexTest
Running org.apache.commons.codec.language.bm.BeiderMorseEncoderTest
Tests run: 22, Failures: 0, Errors: 0, Skipped: 0, Time elapsed: 3.044 sec - in org.apache.commons.codec.language.bm.BeiderMorseEncoderTest
Running org.apache.commons.codec.language.bm.PhoneticEngineTest
Tests run: 8, Failures: 0, Errors: 0, Skipped: 0, Time elapsed: 0.02 sec - in org.apache.commons.codec.language.bm.PhoneticEngineTest
Running org.apache.commons.codec.language.bm.PhoneticEngineRegressionTest
Tests run: 4, Failures: 0, Errors: 0, Skipped: 0, Time elapsed: 0.014 sec - in org.apache.commons.codec.language.bm.PhoneticEngineRegressionTest
Running org.apache.commons.codec.language.bm.RuleTest
Tests run: 3, Failures: 0, Errors: 0, Skipped: 0, Time elapsed: 0.003 sec - in org.apache.commons.codec.language.bm.RuleTest
Running org.apache.commons.codec.language.bm.LanguageGuessingTest
Tests run: 18, Failures: 0, Errors: 0, Skipped: 0, Time elapsed: 0.02 sec - in org.apache.commons.codec.language.bm.LanguageGuessingTest
Running org.apache.commons.codec.language.DoubleMetaphoneTest
Tests run: 16, Failures: 0, Errors: 0, Skipped: 0, Time elapsed: 0.059 sec - in org.apache.commons.codec.language.DoubleMetaphoneTest
Running org.apache.commons.codec.language.SoundexTest
Tests run: 28, Failures: 0, Errors: 0, Skipped: 0, Time elapsed: 0.011 sec - in org.apache.commons.codec.language.SoundexTest
Running org.apache.commons.codec.language.RefinedSoundexTest
Tests run: 10, Failures: 0, Errors: 0, Skipped: 0, Time elapsed: 0.003 sec - in org.apache.commons.codec.language.RefinedSoundexTest
Running org.apache.commons.codec.language.MatchRatingApproachEncoderTest
Tests run: 96, Failures: 0, Errors: 0, Skipped: 0, Time elapsed: 0.035 sec - in org.apache.commons.codec.language.MatchRatingApproachEncoderTest
Running org.apache.commons.codec.language.ColognePhoneticTest
Tests run: 13, Failures: 0, Errors: 0, Skipped: 0, Time elapsed: 0.004 sec - in org.apache.commons.codec.language.ColognePhoneticTest
Running org.apache.commons.codec.language.DoubleMetaphone2Test
Tests run: 6, Failures: 0, Errors: 0, Skipped: 0, Time elapsed: 0.038 sec - in org.apache.commons.codec.language.DoubleMetaphone2Test
Running org.apache.commons.codec.language.MetaphoneTest
Tests run: 34, Failures: 0, Errors: 0, Skipped: 0, Time elapsed: 0.103 sec - in org.apache.commons.codec.language.MetaphoneTest
Running org.apache.commons.codec.CharEncodingTest
Tests run: 7, Failures: 0, Errors: 0, Skipped: 0, Time elapsed: 0 sec - in org.apache.commons.codec.CharEncodingTest

Results :

Failed tests: 
  HmacUtilsTest.testInitializedMac:142 arrays first differed at element [0]; expected:<-128> but was:<99>
  HmacUtilsTest.testHmacSha1UpdateWithString:133 expected:<[de7c9b85b8b78aa6bc8a7a36f70a90701c9db4d9]> but was:<[f42bb0eeb018ebbd4597ae7213711ec60760843f]>
  StringUtilsTest.testGetBytesUtf16:82 null
  StringUtilsTest.testGetBytesUtf8:109 null
  StringUtilsTest.testGetBytesIso8859_1:58 null
  StringUtilsTest.testGetBytesUsAscii:73 null
  StringUtilsTest.testGetBytesUtf16Be:91 null
  StringUtilsTest.testGetBytesUtf16Le:100 null
  Base64Test.testStringToByteVariations:1218 StringToByte Hello World expected:<Hello World> but was:<null>
  Base64Test.testUUID:1180 standard encode uuid
  Base64Test.testChunkedEncodeMultipleOf76:132 chunkedEncodeMultipleOf76
  Base64Test.testBase64:84 encoding hello world expected:<SGVsbG8gV29ybGQ=> but was:<null>
  Base64Test.testByteToStringVariations:1197 byteToString Hello World expected:<SGVsbG8gV29ybGQ=> but was:<null>
  Base64Test.testRfc4648Section10Encode:645 expected:<> but was:<null>
  HexTest.testEncodeDecodeRandom:285 null

Tests in error: 
  DigestUtilsTest.testMd2Length:104 » NullPointer
  DigestUtilsTest.testSha1UpdateWithString:203 » NullPointer
  DigestUtilsTest.testMd5HexLength:143 » NullPointer
  DigestUtilsTest.testMd5Length:157 » NullPointer
  DigestUtilsTest.testMd2Hex:62 » NullPointer
  DigestUtilsTest.testMd5Hex:115 » NullPointer
  DigestUtilsTest.testSha1Hex:168 » NullPointer
  DigestUtilsTest.testMd2HexLength:90 » NullPointer
  DigestUtilsTest.testSha256:218 » NullPointer
  DigestUtilsTest.testSha384:232 » NullPointer
  DigestUtilsTest.testSha512:249 » NullPointer
  DigestUtilsTest.testShaHex:267 » NullPointer
  DigestUtilsTest.testShaUpdateWithString:304 » NullPointer
  HmacUtilsTest.testHmacMd5Hex:90 » IllegalArgument Null key
  HmacUtilsTest.testHmacSha1Hex:101 » IllegalArgument Null key
  HmacUtilsTest.testSha256HMac:220 » IllegalArgument Null key
  HmacUtilsTest.testSha1HMac:199 » IllegalArgument Null key
  HmacUtilsTest.testSha384HMac:241 » IllegalArgument Null key
  HmacUtilsTest.testMd5HMac:169 » IllegalArgument Null key
  HmacUtilsTest.testSha512HMac:262 » IllegalArgument Null key
  Base64OutputStreamTest.testCodec98NPE:52 NullPointer
  Base64OutputStreamTest.testBase64OutputStreamByteByByte:144->testByteByByte:244 NullPointer
  Base64OutputStreamTest.testBase64OutputStreamByChunk:106->testByChunk:194 » NullPointer
  Base64InputStreamTest.testSkipToEnd:549 » NullPointer
  Base64InputStreamTest.testSkipNone:514 » NullPointer
  Base64InputStreamTest.testCodec98NPE:147 » NullPointer
  Base64InputStreamTest.testRead0:422 » NullPointer
  Base64InputStreamTest.testBase64InputStreamByChunk:216->testByChunk:303 » NullPointer
  Base64InputStreamTest.testMarkSupported:405 » NullPointer
  Base64InputStreamTest.testInputStreamReader:129 » NullPointer
  Base64InputStreamTest.testReadOutOfBounds:458 » NullPointer
  Base64InputStreamTest.testReadNull:438 » NullPointer
  Base64InputStreamTest.testCodec101:100 » NullPointer
  Base64InputStreamTest.testCodec130:62 » NullPointer
  Base64InputStreamTest.testSkipWrongArgument »  Unexpected exception, expected<...
  Base64InputStreamTest.testAvailable:164 » NullPointer
  Base64InputStreamTest.testSkipPastEnd:532 » NullPointer
  Base64InputStreamTest.testSkipBig:498 » NullPointer
  Base64InputStreamTest.testBase64InputStreamByteByByte:254->testByteByByte:356 » NullPointer
  Base32InputStreamTest.testBase32InputStreamByteByByte:245->testByteByByte:342 » NullPointer
  Base32InputStreamTest.testSkipToEnd:535 » NullPointer
  Base32InputStreamTest.testSkipNone:484 » NullPointer
  Base32InputStreamTest.testRead0:408 » NullPointer
  Base32InputStreamTest.testMarkSupported:391 » NullPointer
  Base32InputStreamTest.testReadOutOfBounds:444 » NullPointer
  Base32InputStreamTest.testReadNull:424 » NullPointer
  Base32InputStreamTest.testCodec130:52 » NullPointer
  Base32InputStreamTest.testSkipWrongArgument »  Unexpected exception, expected<...
  Base32InputStreamTest.testAvailable:154 » NullPointer
  Base32InputStreamTest.testSkipPastEnd:518 » NullPointer
  Base32InputStreamTest.testSkipBig:502 » NullPointer
  Base32InputStreamTest.testBase32InputStreamByChunk:206->testByChunk:291 » NullPointer
  Base32OutputStreamTest.testBase32OutputStreamByChunk:101->testByChunk:183 » NullPointer
  Base32OutputStreamTest.testBase32OutputStreamByteByByte:136->testByteByByte:233 NullPointer
  BaseNCodecTest.testIsInAlphabetString:151 » NullPointer
  Base64Test.testRfc4648Section10DecodeEncode:670->testDecodeEncode:680 » NullPointer
  Base64Test.testRfc4648Section10DecodeWithCrLf:620 » NullPointer
  Base64Test.testRfc4648Section10Decode:594 » NullPointer
  Base64Test.testIsStringBase64:70 » NullPointer
  Base64Test.testRfc4648Section10EncodeDecode:701->testEncodeDecode:712 » NullPointer
  HexTest.testHelloWorldLowerCaseHex:313 » NullPointer
  HexTest.testHelloWorldUpperCaseHex:326 » NullPointer
  BCodecTest.testUTF8RoundTrip:72 » NullPointer
  BCodecTest.testBasicEncodeDecode:82 » NullPointer
  BCodecTest.testDecodeObjects:137 » NullPointer
  QCodecTest.testUTF8RoundTrip:81 » NullPointer
  QCodecTest.testEncodeDecodeBlanks:193 » NullPointer
  QCodecTest.testBasicEncodeDecode:93 » NullPointer
  QCodecTest.testDecodeObjects:164 » NullPointer
  QCodecTest.testUnsafeEncodeDecode:104 » NullPointer
  URLCodecTest.testUTF8RoundTrip:77 » NullPointer
  URLCodecTest.testEncodeUrlWithNullBitSet:194 » NullPointer
  URLCodecTest.testBasicEncodeDecode:89 » NullPointer
  URLCodecTest.testSafeCharEncodeDecode:102 » NullPointer
  URLCodecTest.testDecodeInvalid:136 » NullPointer
  URLCodecTest.testDecodeObjects:272 » NullPointer
  URLCodecTest.testInvalidEncoding:260 » NullPointer
  URLCodecTest.testUnsafeEncodeDecode:115 » NullPointer
  QuotedPrintableCodecTest.testUTF8RoundTrip:70 » NullPointer
  QuotedPrintableCodecTest.testEncodeUrlWithNullBitSet:158 » NullPointer
  QuotedPrintableCodecTest.testBasicEncodeDecode:81 » NullPointer
  QuotedPrintableCodecTest.testSafeCharEncodeDecode:92 » NullPointer
  QuotedPrintableCodecTest.testDecodeInvalid:122 » NullPointer
  QuotedPrintableCodecTest.testSkipNotEncodedCRLF:283 » NullPointer
  QuotedPrintableCodecTest.testSoftLineBreakDecode:259 » NullPointer
  QuotedPrintableCodecTest.testSoftLineBreakEncode:273 » NullPointer
  QuotedPrintableCodecTest.testDecodeObjects:221 » NullPointer
  QuotedPrintableCodecTest.testUnsafeEncodeDecode:104 » NullPointer

Tests run: 662, Failures: 15, Errors: 88, Skipped: 1

[INFO] ------------------------------------------------------------------------
[INFO] BUILD FAILURE
[INFO] ------------------------------------------------------------------------
[INFO] Total time: 13.369s
[INFO] Finished at: Sun Aug 02 08:02:54 BST 2015
[INFO] Final Memory: 20M/336M
[INFO] ------------------------------------------------------------------------
[ERROR] Failed to execute goal org.apache.maven.plugins:maven-surefire-plugin:2.17:test (default-test) on project commons-codec: There are test failures.
[ERROR] 
[ERROR] Please refer to /home/perham/Study/LittleDarwin/Cases/commons-codec-1.10-src/target/surefire-reports for the individual test results.
[ERROR] -> [Help 1]
[ERROR] 
[ERROR] To see the full stack trace of the errors, re-run Maven with the -e switch.
[ERROR] Re-run Maven using the -X switch to enable full debug logging.
[ERROR] 
[ERROR] For more information about the errors and possible solutions, please read the following articles:
[ERROR] [Help 1] http://cwiki.apache.org/confluence/display/MAVEN/MojoFailureException
