[INFO] Scanning for projects...
[INFO]                                                                         
[INFO] ------------------------------------------------------------------------
[INFO] Building Apache Commons Codec 1.10
[INFO] ------------------------------------------------------------------------
[INFO] 
[INFO] --- maven-enforcer-plugin:1.3.1:enforce (enforce-maven-3) @ commons-codec ---
[INFO] 
[INFO] --- maven-antrun-plugin:1.7:run (javadoc.resources) @ commons-codec ---
[INFO] Executing tasks

main:
[INFO] Executed tasks
[INFO] 
[INFO] --- maven-remote-resources-plugin:1.5:process (default) @ commons-codec ---
[INFO] 
[INFO] --- buildnumber-maven-plugin:1.3:create (default) @ commons-codec ---
[INFO] Executing: /bin/sh -c cd /home/perham/Study/LittleDarwin/Cases/commons-codec-1.10-src && svn --non-interactive info
[INFO] Working directory: /home/perham/Study/LittleDarwin/Cases/commons-codec-1.10-src
[INFO] Storing buildNumber: ?????? at timestamp: 1438498628323
[INFO] Executing: /bin/sh -c cd /home/perham/Study/LittleDarwin/Cases/commons-codec-1.10-src && svn --non-interactive info
[INFO] Working directory: /home/perham/Study/LittleDarwin/Cases/commons-codec-1.10-src
[INFO] Storing buildScmBranch: UNKNOWN_BRANCH
[INFO] 
[INFO] --- maven-resources-plugin:2.7:resources (default-resources) @ commons-codec ---
[INFO] Using 'UTF-8' encoding to copy filtered resources.
[INFO] Copying 128 resources
[INFO] Copying 2 resources to META-INF
[INFO] 
[INFO] --- maven-compiler-plugin:3.2:compile (default-compile) @ commons-codec ---
[INFO] Changes detected - recompiling the module!
[INFO] Compiling 60 source files to /home/perham/Study/LittleDarwin/Cases/commons-codec-1.10-src/target/classes
[INFO] /home/perham/Study/LittleDarwin/Cases/commons-codec-1.10-src/src/main/java/org/apache/commons/codec/digest/Sha2Crypt.java: Some input files use or override a deprecated API.
[INFO] /home/perham/Study/LittleDarwin/Cases/commons-codec-1.10-src/src/main/java/org/apache/commons/codec/digest/Sha2Crypt.java: Recompile with -Xlint:deprecation for details.
[INFO] 
[INFO] --- maven-bundle-plugin:2.5.3:manifest (bundle-manifest) @ commons-codec ---
[INFO] 
[INFO] --- maven-resources-plugin:2.7:testResources (default-testResources) @ commons-codec ---
[INFO] Using 'UTF-8' encoding to copy filtered resources.
[INFO] skip non existing resourceDirectory /home/perham/Study/LittleDarwin/Cases/commons-codec-1.10-src/src/test/resources
[INFO] Copying 2 resources to META-INF
[INFO] 
[INFO] --- maven-compiler-plugin:3.2:testCompile (default-testCompile) @ commons-codec ---
[INFO] Nothing to compile - all classes are up to date
[INFO] 
[INFO] --- maven-surefire-plugin:2.17:test (default-test) @ commons-codec ---
[INFO] Surefire report directory: /home/perham/Study/LittleDarwin/Cases/commons-codec-1.10-src/target/surefire-reports

-------------------------------------------------------
 T E S T S
-------------------------------------------------------
Running org.apache.commons.codec.digest.B64Test
Tests run: 2, Failures: 0, Errors: 0, Skipped: 0, Time elapsed: 0.025 sec - in org.apache.commons.codec.digest.B64Test
Running org.apache.commons.codec.digest.DigestUtilsTest
Tests run: 17, Failures: 0, Errors: 13, Skipped: 0, Time elapsed: 0.103 sec <<< FAILURE! - in org.apache.commons.codec.digest.DigestUtilsTest
testSha1UpdateWithByteArray(org.apache.commons.codec.digest.DigestUtilsTest)  Time elapsed: 0.009 sec  <<< ERROR!
java.lang.ArrayIndexOutOfBoundsException: -1
	at org.apache.commons.codec.binary.Hex.encodeHex(Hex.java:37)
	at org.apache.commons.codec.binary.Hex.encodeHex(Hex.java:32)
	at org.apache.commons.codec.binary.Hex.encodeHex(Hex.java:31)
	at org.apache.commons.codec.binary.Hex.encodeHexString(Hex.java:40)
	at org.apache.commons.codec.digest.DigestUtilsTest.testSha1UpdateWithByteArray(DigestUtilsTest.java:187)

testSha1UpdateWithString(org.apache.commons.codec.digest.DigestUtilsTest)  Time elapsed: 0 sec  <<< ERROR!
java.lang.ArrayIndexOutOfBoundsException: -1
	at org.apache.commons.codec.binary.Hex.encodeHex(Hex.java:37)
	at org.apache.commons.codec.binary.Hex.encodeHex(Hex.java:32)
	at org.apache.commons.codec.binary.Hex.encodeHex(Hex.java:31)
	at org.apache.commons.codec.binary.Hex.encodeHexString(Hex.java:40)
	at org.apache.commons.codec.digest.DigestUtilsTest.testSha1UpdateWithString(DigestUtilsTest.java:205)

testMd5HexLength(org.apache.commons.codec.digest.DigestUtilsTest)  Time elapsed: 0.001 sec  <<< ERROR!
java.lang.ArrayIndexOutOfBoundsException: -1
	at org.apache.commons.codec.binary.Hex.encodeHex(Hex.java:37)
	at org.apache.commons.codec.binary.Hex.encodeHex(Hex.java:32)
	at org.apache.commons.codec.binary.Hex.encodeHex(Hex.java:31)
	at org.apache.commons.codec.binary.Hex.encodeHexString(Hex.java:40)
	at org.apache.commons.codec.digest.DigestUtils.md5Hex(DigestUtils.java:296)
	at org.apache.commons.codec.digest.DigestUtilsTest.testMd5HexLength(DigestUtilsTest.java:143)

testShaUpdateWithByteArray(org.apache.commons.codec.digest.DigestUtilsTest)  Time elapsed: 0.001 sec  <<< ERROR!
java.lang.ArrayIndexOutOfBoundsException: -1
	at org.apache.commons.codec.binary.Hex.encodeHex(Hex.java:37)
	at org.apache.commons.codec.binary.Hex.encodeHex(Hex.java:32)
	at org.apache.commons.codec.binary.Hex.encodeHex(Hex.java:31)
	at org.apache.commons.codec.binary.Hex.encodeHexString(Hex.java:40)
	at org.apache.commons.codec.digest.DigestUtilsTest.testShaUpdateWithByteArray(DigestUtilsTest.java:287)

testMd2Hex(org.apache.commons.codec.digest.DigestUtilsTest)  Time elapsed: 0.002 sec  <<< ERROR!
java.lang.ArrayIndexOutOfBoundsException: -1
	at org.apache.commons.codec.binary.Hex.encodeHex(Hex.java:37)
	at org.apache.commons.codec.binary.Hex.encodeHex(Hex.java:32)
	at org.apache.commons.codec.binary.Hex.encodeHex(Hex.java:31)
	at org.apache.commons.codec.binary.Hex.encodeHexString(Hex.java:40)
	at org.apache.commons.codec.digest.DigestUtils.md2Hex(DigestUtils.java:249)
	at org.apache.commons.codec.digest.DigestUtilsTest.testMd2Hex(DigestUtilsTest.java:62)

testMd5Hex(org.apache.commons.codec.digest.DigestUtilsTest)  Time elapsed: 0.002 sec  <<< ERROR!
java.lang.ArrayIndexOutOfBoundsException: -1
	at org.apache.commons.codec.binary.Hex.encodeHex(Hex.java:37)
	at org.apache.commons.codec.binary.Hex.encodeHex(Hex.java:32)
	at org.apache.commons.codec.binary.Hex.encodeHex(Hex.java:31)
	at org.apache.commons.codec.binary.Hex.encodeHexString(Hex.java:40)
	at org.apache.commons.codec.digest.DigestUtils.md5Hex(DigestUtils.java:321)
	at org.apache.commons.codec.digest.DigestUtilsTest.testMd5Hex(DigestUtilsTest.java:115)

testSha1Hex(org.apache.commons.codec.digest.DigestUtilsTest)  Time elapsed: 0.001 sec  <<< ERROR!
java.lang.ArrayIndexOutOfBoundsException: -1
	at org.apache.commons.codec.binary.Hex.encodeHex(Hex.java:37)
	at org.apache.commons.codec.binary.Hex.encodeHex(Hex.java:32)
	at org.apache.commons.codec.binary.Hex.encodeHex(Hex.java:31)
	at org.apache.commons.codec.binary.Hex.encodeHexString(Hex.java:40)
	at org.apache.commons.codec.digest.DigestUtils.sha1Hex(DigestUtils.java:438)
	at org.apache.commons.codec.digest.DigestUtilsTest.testSha1Hex(DigestUtilsTest.java:168)

testMd2HexLength(org.apache.commons.codec.digest.DigestUtilsTest)  Time elapsed: 0.001 sec  <<< ERROR!
java.lang.ArrayIndexOutOfBoundsException: -1
	at org.apache.commons.codec.binary.Hex.encodeHex(Hex.java:37)
	at org.apache.commons.codec.binary.Hex.encodeHex(Hex.java:32)
	at org.apache.commons.codec.binary.Hex.encodeHex(Hex.java:31)
	at org.apache.commons.codec.binary.Hex.encodeHexString(Hex.java:40)
	at org.apache.commons.codec.digest.DigestUtils.md2Hex(DigestUtils.java:223)
	at org.apache.commons.codec.digest.DigestUtilsTest.testMd2HexLength(DigestUtilsTest.java:90)

testSha256(org.apache.commons.codec.digest.DigestUtilsTest)  Time elapsed: 0.002 sec  <<< ERROR!
java.lang.ArrayIndexOutOfBoundsException: -1
	at org.apache.commons.codec.binary.Hex.encodeHex(Hex.java:37)
	at org.apache.commons.codec.binary.Hex.encodeHex(Hex.java:32)
	at org.apache.commons.codec.binary.Hex.encodeHex(Hex.java:31)
	at org.apache.commons.codec.binary.Hex.encodeHexString(Hex.java:40)
	at org.apache.commons.codec.digest.DigestUtils.sha256Hex(DigestUtils.java:532)
	at org.apache.commons.codec.digest.DigestUtilsTest.testSha256(DigestUtilsTest.java:218)

testSha384(org.apache.commons.codec.digest.DigestUtilsTest)  Time elapsed: 0.002 sec  <<< ERROR!
java.lang.ArrayIndexOutOfBoundsException: -1
	at org.apache.commons.codec.binary.Hex.encodeHex(Hex.java:37)
	at org.apache.commons.codec.binary.Hex.encodeHex(Hex.java:32)
	at org.apache.commons.codec.binary.Hex.encodeHex(Hex.java:31)
	at org.apache.commons.codec.binary.Hex.encodeHexString(Hex.java:40)
	at org.apache.commons.codec.digest.DigestUtils.sha384Hex(DigestUtils.java:626)
	at org.apache.commons.codec.digest.DigestUtilsTest.testSha384(DigestUtilsTest.java:232)

testSha512(org.apache.commons.codec.digest.DigestUtilsTest)  Time elapsed: 0.002 sec  <<< ERROR!
java.lang.ArrayIndexOutOfBoundsException: -1
	at org.apache.commons.codec.binary.Hex.encodeHex(Hex.java:37)
	at org.apache.commons.codec.binary.Hex.encodeHex(Hex.java:32)
	at org.apache.commons.codec.binary.Hex.encodeHex(Hex.java:31)
	at org.apache.commons.codec.binary.Hex.encodeHexString(Hex.java:40)
	at org.apache.commons.codec.digest.DigestUtils.sha512Hex(DigestUtils.java:720)
	at org.apache.commons.codec.digest.DigestUtilsTest.testSha512(DigestUtilsTest.java:249)

testShaHex(org.apache.commons.codec.digest.DigestUtilsTest)  Time elapsed: 0.001 sec  <<< ERROR!
java.lang.ArrayIndexOutOfBoundsException: -1
	at org.apache.commons.codec.binary.Hex.encodeHex(Hex.java:37)
	at org.apache.commons.codec.binary.Hex.encodeHex(Hex.java:32)
	at org.apache.commons.codec.binary.Hex.encodeHex(Hex.java:31)
	at org.apache.commons.codec.binary.Hex.encodeHexString(Hex.java:40)
	at org.apache.commons.codec.digest.DigestUtils.sha1Hex(DigestUtils.java:438)
	at org.apache.commons.codec.digest.DigestUtils.shaHex(DigestUtils.java:762)
	at org.apache.commons.codec.digest.DigestUtilsTest.testShaHex(DigestUtilsTest.java:267)

testShaUpdateWithString(org.apache.commons.codec.digest.DigestUtilsTest)  Time elapsed: 0.001 sec  <<< ERROR!
java.lang.ArrayIndexOutOfBoundsException: -1
	at org.apache.commons.codec.binary.Hex.encodeHex(Hex.java:37)
	at org.apache.commons.codec.binary.Hex.encodeHex(Hex.java:32)
	at org.apache.commons.codec.binary.Hex.encodeHex(Hex.java:31)
	at org.apache.commons.codec.binary.Hex.encodeHexString(Hex.java:40)
	at org.apache.commons.codec.digest.DigestUtilsTest.testShaUpdateWithString(DigestUtilsTest.java:306)

Running org.apache.commons.codec.digest.Sha512CryptTest
Tests run: 8, Failures: 0, Errors: 0, Skipped: 0, Time elapsed: 0.653 sec - in org.apache.commons.codec.digest.Sha512CryptTest
Running org.apache.commons.codec.digest.Apr1CryptTest
Tests run: 8, Failures: 0, Errors: 0, Skipped: 0, Time elapsed: 0.189 sec - in org.apache.commons.codec.digest.Apr1CryptTest
Running org.apache.commons.codec.digest.HmacUtilsTest
Tests run: 24, Failures: 0, Errors: 10, Skipped: 0, Time elapsed: 0.044 sec <<< FAILURE! - in org.apache.commons.codec.digest.HmacUtilsTest
testHmacMd5Hex(org.apache.commons.codec.digest.HmacUtilsTest)  Time elapsed: 0.014 sec  <<< ERROR!
java.lang.ArrayIndexOutOfBoundsException: -1
	at org.apache.commons.codec.binary.Hex.encodeHex(Hex.java:37)
	at org.apache.commons.codec.binary.Hex.encodeHex(Hex.java:32)
	at org.apache.commons.codec.binary.Hex.encodeHex(Hex.java:31)
	at org.apache.commons.codec.binary.Hex.encodeHexString(Hex.java:40)
	at org.apache.commons.codec.digest.HmacUtils.hmacMd5Hex(HmacUtils.java:296)
	at org.apache.commons.codec.digest.HmacUtilsTest.testHmacMd5Hex(HmacUtilsTest.java:90)

testHmacSha1Hex(org.apache.commons.codec.digest.HmacUtilsTest)  Time elapsed: 0.002 sec  <<< ERROR!
java.lang.ArrayIndexOutOfBoundsException: -1
	at org.apache.commons.codec.binary.Hex.encodeHex(Hex.java:37)
	at org.apache.commons.codec.binary.Hex.encodeHex(Hex.java:32)
	at org.apache.commons.codec.binary.Hex.encodeHex(Hex.java:31)
	at org.apache.commons.codec.binary.Hex.encodeHexString(Hex.java:40)
	at org.apache.commons.codec.digest.HmacUtils.hmacSha1Hex(HmacUtils.java:403)
	at org.apache.commons.codec.digest.HmacUtilsTest.testHmacSha1Hex(HmacUtilsTest.java:101)

testHmacSha1UpdateWithByteArray(org.apache.commons.codec.digest.HmacUtilsTest)  Time elapsed: 0.001 sec  <<< ERROR!
java.lang.ArrayIndexOutOfBoundsException: -1
	at org.apache.commons.codec.binary.Hex.encodeHex(Hex.java:37)
	at org.apache.commons.codec.binary.Hex.encodeHex(Hex.java:32)
	at org.apache.commons.codec.binary.Hex.encodeHex(Hex.java:31)
	at org.apache.commons.codec.binary.Hex.encodeHexString(Hex.java:40)
	at org.apache.commons.codec.digest.HmacUtilsTest.testHmacSha1UpdateWithByteArray(HmacUtilsTest.java:115)

testSha256HMac(org.apache.commons.codec.digest.HmacUtilsTest)  Time elapsed: 0.005 sec  <<< ERROR!
java.lang.ArrayIndexOutOfBoundsException: -1
	at org.apache.commons.codec.binary.Hex.encodeHex(Hex.java:37)
	at org.apache.commons.codec.binary.Hex.encodeHex(Hex.java:32)
	at org.apache.commons.codec.binary.Hex.encodeHex(Hex.java:31)
	at org.apache.commons.codec.binary.Hex.encodeHexString(Hex.java:40)
	at org.apache.commons.codec.digest.HmacUtils.hmacSha256Hex(HmacUtils.java:475)
	at org.apache.commons.codec.digest.HmacUtilsTest.testSha256HMac(HmacUtilsTest.java:222)

testSha1HMac(org.apache.commons.codec.digest.HmacUtilsTest)  Time elapsed: 0.003 sec  <<< ERROR!
java.lang.ArrayIndexOutOfBoundsException: -1
	at org.apache.commons.codec.binary.Hex.encodeHex(Hex.java:37)
	at org.apache.commons.codec.binary.Hex.encodeHex(Hex.java:32)
	at org.apache.commons.codec.binary.Hex.encodeHex(Hex.java:31)
	at org.apache.commons.codec.binary.Hex.encodeHexString(Hex.java:40)
	at org.apache.commons.codec.digest.HmacUtils.hmacSha1Hex(HmacUtils.java:368)
	at org.apache.commons.codec.digest.HmacUtilsTest.testSha1HMac(HmacUtilsTest.java:201)

testSha384HMac(org.apache.commons.codec.digest.HmacUtilsTest)  Time elapsed: 0.002 sec  <<< ERROR!
java.lang.ArrayIndexOutOfBoundsException: -1
	at org.apache.commons.codec.binary.Hex.encodeHex(Hex.java:37)
	at org.apache.commons.codec.binary.Hex.encodeHex(Hex.java:32)
	at org.apache.commons.codec.binary.Hex.encodeHex(Hex.java:31)
	at org.apache.commons.codec.binary.Hex.encodeHexString(Hex.java:40)
	at org.apache.commons.codec.digest.HmacUtils.hmacSha384Hex(HmacUtils.java:582)
	at org.apache.commons.codec.digest.HmacUtilsTest.testSha384HMac(HmacUtilsTest.java:243)

testMd5HMac(org.apache.commons.codec.digest.HmacUtilsTest)  Time elapsed: 0.002 sec  <<< ERROR!
java.lang.ArrayIndexOutOfBoundsException: -1
	at org.apache.commons.codec.binary.Hex.encodeHex(Hex.java:37)
	at org.apache.commons.codec.binary.Hex.encodeHex(Hex.java:32)
	at org.apache.commons.codec.binary.Hex.encodeHex(Hex.java:31)
	at org.apache.commons.codec.binary.Hex.encodeHexString(Hex.java:40)
	at org.apache.commons.codec.digest.HmacUtils.hmacMd5Hex(HmacUtils.java:261)
	at org.apache.commons.codec.digest.HmacUtilsTest.testMd5HMac(HmacUtilsTest.java:171)

testHmacSha1UpdateWithString(org.apache.commons.codec.digest.HmacUtilsTest)  Time elapsed: 0.001 sec  <<< ERROR!
java.lang.ArrayIndexOutOfBoundsException: -1
	at org.apache.commons.codec.binary.Hex.encodeHex(Hex.java:37)
	at org.apache.commons.codec.binary.Hex.encodeHex(Hex.java:32)
	at org.apache.commons.codec.binary.Hex.encodeHex(Hex.java:31)
	at org.apache.commons.codec.binary.Hex.encodeHexString(Hex.java:40)
	at org.apache.commons.codec.digest.HmacUtilsTest.testHmacSha1UpdateWithString(HmacUtilsTest.java:133)

testHmacSha1UpdateWithInpustream(org.apache.commons.codec.digest.HmacUtilsTest)  Time elapsed: 0.001 sec  <<< ERROR!
java.lang.ArrayIndexOutOfBoundsException: -1
	at org.apache.commons.codec.binary.Hex.encodeHex(Hex.java:37)
	at org.apache.commons.codec.binary.Hex.encodeHex(Hex.java:32)
	at org.apache.commons.codec.binary.Hex.encodeHex(Hex.java:31)
	at org.apache.commons.codec.binary.Hex.encodeHexString(Hex.java:40)
	at org.apache.commons.codec.digest.HmacUtilsTest.testHmacSha1UpdateWithInpustream(HmacUtilsTest.java:124)

testSha512HMac(org.apache.commons.codec.digest.HmacUtilsTest)  Time elapsed: 0.001 sec  <<< ERROR!
java.lang.ArrayIndexOutOfBoundsException: -1
	at org.apache.commons.codec.binary.Hex.encodeHex(Hex.java:37)
	at org.apache.commons.codec.binary.Hex.encodeHex(Hex.java:32)
	at org.apache.commons.codec.binary.Hex.encodeHex(Hex.java:31)
	at org.apache.commons.codec.binary.Hex.encodeHexString(Hex.java:40)
	at org.apache.commons.codec.digest.HmacUtils.hmacSha512Hex(HmacUtils.java:689)
	at org.apache.commons.codec.digest.HmacUtilsTest.testSha512HMac(HmacUtilsTest.java:264)

Running org.apache.commons.codec.digest.Sha2CryptTest
Tests run: 1, Failures: 0, Errors: 0, Skipped: 0, Time elapsed: 0 sec - in org.apache.commons.codec.digest.Sha2CryptTest
Running org.apache.commons.codec.digest.CryptTest
Tests run: 4, Failures: 0, Errors: 0, Skipped: 0, Time elapsed: 0.088 sec - in org.apache.commons.codec.digest.CryptTest
Running org.apache.commons.codec.digest.Sha256CryptTest
Tests run: 7, Failures: 0, Errors: 0, Skipped: 0, Time elapsed: 0.11 sec - in org.apache.commons.codec.digest.Sha256CryptTest
Running org.apache.commons.codec.digest.Md5CryptTest
Tests run: 7, Failures: 0, Errors: 0, Skipped: 0, Time elapsed: 0.021 sec - in org.apache.commons.codec.digest.Md5CryptTest
Running org.apache.commons.codec.digest.UnixCryptTest
Tests run: 9, Failures: 0, Errors: 0, Skipped: 0, Time elapsed: 0.005 sec - in org.apache.commons.codec.digest.UnixCryptTest
Running org.apache.commons.codec.CharsetsTest
Tests run: 7, Failures: 0, Errors: 0, Skipped: 0, Time elapsed: 0 sec - in org.apache.commons.codec.CharsetsTest
Running org.apache.commons.codec.binary.Base32Test
Tests run: 8, Failures: 0, Errors: 0, Skipped: 0, Time elapsed: 0.009 sec - in org.apache.commons.codec.binary.Base32Test
Running org.apache.commons.codec.binary.Base64OutputStreamTest
Tests run: 7, Failures: 0, Errors: 0, Skipped: 0, Time elapsed: 0.201 sec - in org.apache.commons.codec.binary.Base64OutputStreamTest
Running org.apache.commons.codec.binary.Base64Codec13Test
Tests run: 8, Failures: 0, Errors: 0, Skipped: 0, Time elapsed: 0.009 sec - in org.apache.commons.codec.binary.Base64Codec13Test
Running org.apache.commons.codec.binary.Base64InputStreamTest
Tests run: 19, Failures: 0, Errors: 0, Skipped: 0, Time elapsed: 0.111 sec - in org.apache.commons.codec.binary.Base64InputStreamTest
Running org.apache.commons.codec.binary.Base32InputStreamTest
Tests run: 16, Failures: 0, Errors: 0, Skipped: 0, Time elapsed: 0.122 sec - in org.apache.commons.codec.binary.Base32InputStreamTest
Running org.apache.commons.codec.binary.Base32OutputStreamTest
Tests run: 6, Failures: 0, Errors: 0, Skipped: 0, Time elapsed: 0.093 sec - in org.apache.commons.codec.binary.Base32OutputStreamTest
Running org.apache.commons.codec.binary.BinaryCodecTest
Tests run: 13, Failures: 0, Errors: 0, Skipped: 0, Time elapsed: 0.011 sec - in org.apache.commons.codec.binary.BinaryCodecTest
Running org.apache.commons.codec.binary.BaseNCodecTest
Tests run: 7, Failures: 0, Errors: 0, Skipped: 0, Time elapsed: 0.003 sec - in org.apache.commons.codec.binary.BaseNCodecTest
Running org.apache.commons.codec.binary.StringUtilsTest
Tests run: 17, Failures: 0, Errors: 0, Skipped: 0, Time elapsed: 0.028 sec - in org.apache.commons.codec.binary.StringUtilsTest
Running org.apache.commons.codec.binary.Base64Test
Tests run: 53, Failures: 0, Errors: 0, Skipped: 1, Time elapsed: 0.048 sec - in org.apache.commons.codec.binary.Base64Test
Running org.apache.commons.codec.binary.HexTest
Tests run: 19, Failures: 0, Errors: 6, Skipped: 0, Time elapsed: 0.071 sec <<< FAILURE! - in org.apache.commons.codec.binary.HexTest
testHelloWorldLowerCaseHex(org.apache.commons.codec.binary.HexTest)  Time elapsed: 0 sec  <<< ERROR!
java.lang.ArrayIndexOutOfBoundsException: -1
	at org.apache.commons.codec.binary.Hex.encodeHex(Hex.java:37)
	at org.apache.commons.codec.binary.Hex.encodeHex(Hex.java:32)
	at org.apache.commons.codec.binary.Hex.encodeHex(Hex.java:31)
	at org.apache.commons.codec.binary.HexTest.testHelloWorldLowerCaseHex(HexTest.java:313)

testCustomCharset(org.apache.commons.codec.binary.HexTest)  Time elapsed: 0.064 sec  <<< ERROR!
java.lang.ArrayIndexOutOfBoundsException: -1
	at org.apache.commons.codec.binary.Hex.encodeHex(Hex.java:37)
	at org.apache.commons.codec.binary.Hex.encodeHex(Hex.java:32)
	at org.apache.commons.codec.binary.Hex.encodeHex(Hex.java:31)
	at org.apache.commons.codec.binary.Hex.encodeHexString(Hex.java:40)
	at org.apache.commons.codec.binary.Hex.encode(Hex.java:52)
	at org.apache.commons.codec.binary.HexTest.testCustomCharset(HexTest.java:147)
	at org.apache.commons.codec.binary.HexTest.testCustomCharset(HexTest.java:126)

testHelloWorldUpperCaseHex(org.apache.commons.codec.binary.HexTest)  Time elapsed: 0.001 sec  <<< ERROR!
java.lang.ArrayIndexOutOfBoundsException: -1
	at org.apache.commons.codec.binary.Hex.encodeHex(Hex.java:37)
	at org.apache.commons.codec.binary.Hex.encodeHex(Hex.java:32)
	at org.apache.commons.codec.binary.Hex.encodeHex(Hex.java:31)
	at org.apache.commons.codec.binary.HexTest.testHelloWorldUpperCaseHex(HexTest.java:326)

testEncodeDecodeRandom(org.apache.commons.codec.binary.HexTest)  Time elapsed: 0.001 sec  <<< ERROR!
java.lang.ArrayIndexOutOfBoundsException: -1
	at org.apache.commons.codec.binary.Hex.encodeHex(Hex.java:37)
	at org.apache.commons.codec.binary.Hex.encodeHex(Hex.java:32)
	at org.apache.commons.codec.binary.Hex.encodeHex(Hex.java:31)
	at org.apache.commons.codec.binary.HexTest.testEncodeDecodeRandom(HexTest.java:272)

testEncodeZeroes(org.apache.commons.codec.binary.HexTest)  Time elapsed: 0 sec  <<< ERROR!
java.lang.ArrayIndexOutOfBoundsException: -1
	at org.apache.commons.codec.binary.Hex.encodeHex(Hex.java:37)
	at org.apache.commons.codec.binary.Hex.encodeHex(Hex.java:32)
	at org.apache.commons.codec.binary.Hex.encodeHex(Hex.java:31)
	at org.apache.commons.codec.binary.HexTest.testEncodeZeroes(HexTest.java:304)

testRequiredCharset(org.apache.commons.codec.binary.HexTest)  Time elapsed: 0 sec  <<< ERROR!
java.lang.ArrayIndexOutOfBoundsException: -1
	at org.apache.commons.codec.binary.Hex.encodeHex(Hex.java:37)
	at org.apache.commons.codec.binary.Hex.encodeHex(Hex.java:32)
	at org.apache.commons.codec.binary.Hex.encodeHex(Hex.java:31)
	at org.apache.commons.codec.binary.Hex.encodeHexString(Hex.java:40)
	at org.apache.commons.codec.binary.Hex.encode(Hex.java:52)
	at org.apache.commons.codec.binary.HexTest.testCustomCharset(HexTest.java:147)
	at org.apache.commons.codec.binary.HexTest.testRequiredCharset(HexTest.java:336)

Running org.apache.commons.codec.DecoderExceptionTest
Tests run: 4, Failures: 0, Errors: 0, Skipped: 0, Time elapsed: 0 sec - in org.apache.commons.codec.DecoderExceptionTest
Running org.apache.commons.codec.EncoderExceptionTest
Tests run: 4, Failures: 0, Errors: 0, Skipped: 0, Time elapsed: 0.001 sec - in org.apache.commons.codec.EncoderExceptionTest
Running org.apache.commons.codec.net.BCodecTest
Tests run: 9, Failures: 0, Errors: 0, Skipped: 0, Time elapsed: 0 sec - in org.apache.commons.codec.net.BCodecTest
Running org.apache.commons.codec.net.QCodecTest
Tests run: 12, Failures: 0, Errors: 0, Skipped: 0, Time elapsed: 0.001 sec - in org.apache.commons.codec.net.QCodecTest
Running org.apache.commons.codec.net.UtilsTest
Tests run: 1, Failures: 0, Errors: 0, Skipped: 0, Time elapsed: 0 sec - in org.apache.commons.codec.net.UtilsTest
Running org.apache.commons.codec.net.RFC1522CodecTest
Tests run: 2, Failures: 0, Errors: 0, Skipped: 0, Time elapsed: 0.001 sec - in org.apache.commons.codec.net.RFC1522CodecTest
Running org.apache.commons.codec.net.URLCodecTest
Tests run: 16, Failures: 0, Errors: 0, Skipped: 0, Time elapsed: 0 sec - in org.apache.commons.codec.net.URLCodecTest
Running org.apache.commons.codec.net.QuotedPrintableCodecTest
Tests run: 21, Failures: 0, Errors: 0, Skipped: 0, Time elapsed: 0.003 sec - in org.apache.commons.codec.net.QuotedPrintableCodecTest
Running org.apache.commons.codec.StringEncoderComparatorTest
Tests run: 3, Failures: 0, Errors: 0, Skipped: 0, Time elapsed: 0.003 sec - in org.apache.commons.codec.StringEncoderComparatorTest
Running org.apache.commons.codec.language.Caverphone1Test
Tests run: 9, Failures: 0, Errors: 0, Skipped: 0, Time elapsed: 0.025 sec - in org.apache.commons.codec.language.Caverphone1Test
Running org.apache.commons.codec.language.NysiisTest
Tests run: 23, Failures: 0, Errors: 0, Skipped: 0, Time elapsed: 0.021 sec - in org.apache.commons.codec.language.NysiisTest
Running org.apache.commons.codec.language.Caverphone2Test
Tests run: 13, Failures: 0, Errors: 0, Skipped: 0, Time elapsed: 0.146 sec - in org.apache.commons.codec.language.Caverphone2Test
Running org.apache.commons.codec.language.DaitchMokotoffSoundexTest
Tests run: 13, Failures: 0, Errors: 0, Skipped: 0, Time elapsed: 0.047 sec - in org.apache.commons.codec.language.DaitchMokotoffSoundexTest
Running org.apache.commons.codec.language.bm.BeiderMorseEncoderTest
Tests run: 22, Failures: 0, Errors: 0, Skipped: 0, Time elapsed: 2.994 sec - in org.apache.commons.codec.language.bm.BeiderMorseEncoderTest
Running org.apache.commons.codec.language.bm.PhoneticEngineTest
Tests run: 8, Failures: 0, Errors: 0, Skipped: 0, Time elapsed: 0.02 sec - in org.apache.commons.codec.language.bm.PhoneticEngineTest
Running org.apache.commons.codec.language.bm.PhoneticEngineRegressionTest
Tests run: 4, Failures: 0, Errors: 0, Skipped: 0, Time elapsed: 0.013 sec - in org.apache.commons.codec.language.bm.PhoneticEngineRegressionTest
Running org.apache.commons.codec.language.bm.RuleTest
Tests run: 3, Failures: 0, Errors: 0, Skipped: 0, Time elapsed: 0.002 sec - in org.apache.commons.codec.language.bm.RuleTest
Running org.apache.commons.codec.language.bm.LanguageGuessingTest
Tests run: 18, Failures: 0, Errors: 0, Skipped: 0, Time elapsed: 0.015 sec - in org.apache.commons.codec.language.bm.LanguageGuessingTest
Running org.apache.commons.codec.language.DoubleMetaphoneTest
Tests run: 16, Failures: 0, Errors: 0, Skipped: 0, Time elapsed: 0.054 sec - in org.apache.commons.codec.language.DoubleMetaphoneTest
Running org.apache.commons.codec.language.SoundexTest
Tests run: 28, Failures: 0, Errors: 0, Skipped: 0, Time elapsed: 0.012 sec - in org.apache.commons.codec.language.SoundexTest
Running org.apache.commons.codec.language.RefinedSoundexTest
Tests run: 10, Failures: 0, Errors: 0, Skipped: 0, Time elapsed: 0.003 sec - in org.apache.commons.codec.language.RefinedSoundexTest
Running org.apache.commons.codec.language.MatchRatingApproachEncoderTest
Tests run: 96, Failures: 0, Errors: 0, Skipped: 0, Time elapsed: 0.035 sec - in org.apache.commons.codec.language.MatchRatingApproachEncoderTest
Running org.apache.commons.codec.language.ColognePhoneticTest
Tests run: 13, Failures: 0, Errors: 0, Skipped: 0, Time elapsed: 0.002 sec - in org.apache.commons.codec.language.ColognePhoneticTest
Running org.apache.commons.codec.language.DoubleMetaphone2Test
Tests run: 6, Failures: 0, Errors: 0, Skipped: 0, Time elapsed: 0.031 sec - in org.apache.commons.codec.language.DoubleMetaphone2Test
Running org.apache.commons.codec.language.MetaphoneTest
Tests run: 34, Failures: 0, Errors: 0, Skipped: 0, Time elapsed: 0.124 sec - in org.apache.commons.codec.language.MetaphoneTest
Running org.apache.commons.codec.CharEncodingTest
Tests run: 7, Failures: 0, Errors: 0, Skipped: 0, Time elapsed: 0.001 sec - in org.apache.commons.codec.CharEncodingTest

Results :

Tests in error: 
  DigestUtilsTest.testSha1UpdateWithByteArray:187 » ArrayIndexOutOfBounds -1
  DigestUtilsTest.testSha1UpdateWithString:205 » ArrayIndexOutOfBounds -1
  DigestUtilsTest.testMd5HexLength:143 » ArrayIndexOutOfBounds -1
  DigestUtilsTest.testShaUpdateWithByteArray:287 » ArrayIndexOutOfBounds -1
  DigestUtilsTest.testMd2Hex:62 » ArrayIndexOutOfBounds -1
  DigestUtilsTest.testMd5Hex:115 » ArrayIndexOutOfBounds -1
  DigestUtilsTest.testSha1Hex:168 » ArrayIndexOutOfBounds -1
  DigestUtilsTest.testMd2HexLength:90 » ArrayIndexOutOfBounds -1
  DigestUtilsTest.testSha256:218 » ArrayIndexOutOfBounds -1
  DigestUtilsTest.testSha384:232 » ArrayIndexOutOfBounds -1
  DigestUtilsTest.testSha512:249 » ArrayIndexOutOfBounds -1
  DigestUtilsTest.testShaHex:267 » ArrayIndexOutOfBounds -1
  DigestUtilsTest.testShaUpdateWithString:306 » ArrayIndexOutOfBounds -1
  HmacUtilsTest.testHmacMd5Hex:90 » ArrayIndexOutOfBounds -1
  HmacUtilsTest.testHmacSha1Hex:101 » ArrayIndexOutOfBounds -1
  HmacUtilsTest.testHmacSha1UpdateWithByteArray:115 » ArrayIndexOutOfBounds -1
  HmacUtilsTest.testSha256HMac:222 » ArrayIndexOutOfBounds -1
  HmacUtilsTest.testSha1HMac:201 » ArrayIndexOutOfBounds -1
  HmacUtilsTest.testSha384HMac:243 » ArrayIndexOutOfBounds -1
  HmacUtilsTest.testMd5HMac:171 » ArrayIndexOutOfBounds -1
  HmacUtilsTest.testHmacSha1UpdateWithString:133 » ArrayIndexOutOfBounds -1
  HmacUtilsTest.testHmacSha1UpdateWithInpustream:124 » ArrayIndexOutOfBounds -1
  HmacUtilsTest.testSha512HMac:264 » ArrayIndexOutOfBounds -1
  HexTest.testHelloWorldLowerCaseHex:313 » ArrayIndexOutOfBounds -1
  HexTest.testCustomCharset:126->testCustomCharset:147 » ArrayIndexOutOfBounds -...
  HexTest.testHelloWorldUpperCaseHex:326 » ArrayIndexOutOfBounds -1
  HexTest.testEncodeDecodeRandom:272 » ArrayIndexOutOfBounds -1
  HexTest.testEncodeZeroes:304 » ArrayIndexOutOfBounds -1
  HexTest.testRequiredCharset:336->testCustomCharset:147 » ArrayIndexOutOfBounds

Tests run: 662, Failures: 0, Errors: 29, Skipped: 1

[INFO] ------------------------------------------------------------------------
[INFO] BUILD FAILURE
[INFO] ------------------------------------------------------------------------
[INFO] Total time: 13.785s
[INFO] Finished at: Sun Aug 02 07:57:19 BST 2015
[INFO] Final Memory: 20M/344M
[INFO] ------------------------------------------------------------------------
[ERROR] Failed to execute goal org.apache.maven.plugins:maven-surefire-plugin:2.17:test (default-test) on project commons-codec: There are test failures.
[ERROR] 
[ERROR] Please refer to /home/perham/Study/LittleDarwin/Cases/commons-codec-1.10-src/target/surefire-reports for the individual test results.
[ERROR] -> [Help 1]
[ERROR] 
[ERROR] To see the full stack trace of the errors, re-run Maven with the -e switch.
[ERROR] Re-run Maven using the -X switch to enable full debug logging.
[ERROR] 
[ERROR] For more information about the errors and possible solutions, please read the following articles:
[ERROR] [Help 1] http://cwiki.apache.org/confluence/display/MAVEN/MojoFailureException
