[INFO] Scanning for projects...
[INFO]                                                                         
[INFO] ------------------------------------------------------------------------
[INFO] Building Apache Commons Codec 1.10
[INFO] ------------------------------------------------------------------------
[INFO] 
[INFO] --- maven-enforcer-plugin:1.3.1:enforce (enforce-maven-3) @ commons-codec ---
[INFO] 
[INFO] --- maven-antrun-plugin:1.7:run (javadoc.resources) @ commons-codec ---
[INFO] Executing tasks

main:
[INFO] Executed tasks
[INFO] 
[INFO] --- maven-remote-resources-plugin:1.5:process (default) @ commons-codec ---
[INFO] 
[INFO] --- buildnumber-maven-plugin:1.3:create (default) @ commons-codec ---
[INFO] Executing: /bin/sh -c cd /home/perham/Study/LittleDarwin/Cases/commons-codec-1.10-src && svn --non-interactive info
[INFO] Working directory: /home/perham/Study/LittleDarwin/Cases/commons-codec-1.10-src
[INFO] Storing buildNumber: ?????? at timestamp: 1438498595774
[INFO] Executing: /bin/sh -c cd /home/perham/Study/LittleDarwin/Cases/commons-codec-1.10-src && svn --non-interactive info
[INFO] Working directory: /home/perham/Study/LittleDarwin/Cases/commons-codec-1.10-src
[INFO] Storing buildScmBranch: UNKNOWN_BRANCH
[INFO] 
[INFO] --- maven-resources-plugin:2.7:resources (default-resources) @ commons-codec ---
[INFO] Using 'UTF-8' encoding to copy filtered resources.
[INFO] Copying 128 resources
[INFO] Copying 2 resources to META-INF
[INFO] 
[INFO] --- maven-compiler-plugin:3.2:compile (default-compile) @ commons-codec ---
[INFO] Changes detected - recompiling the module!
[INFO] Compiling 60 source files to /home/perham/Study/LittleDarwin/Cases/commons-codec-1.10-src/target/classes
[INFO] /home/perham/Study/LittleDarwin/Cases/commons-codec-1.10-src/src/main/java/org/apache/commons/codec/digest/Sha2Crypt.java: Some input files use or override a deprecated API.
[INFO] /home/perham/Study/LittleDarwin/Cases/commons-codec-1.10-src/src/main/java/org/apache/commons/codec/digest/Sha2Crypt.java: Recompile with -Xlint:deprecation for details.
[INFO] 
[INFO] --- maven-bundle-plugin:2.5.3:manifest (bundle-manifest) @ commons-codec ---
[INFO] 
[INFO] --- maven-resources-plugin:2.7:testResources (default-testResources) @ commons-codec ---
[INFO] Using 'UTF-8' encoding to copy filtered resources.
[INFO] skip non existing resourceDirectory /home/perham/Study/LittleDarwin/Cases/commons-codec-1.10-src/src/test/resources
[INFO] Copying 2 resources to META-INF
[INFO] 
[INFO] --- maven-compiler-plugin:3.2:testCompile (default-testCompile) @ commons-codec ---
[INFO] Nothing to compile - all classes are up to date
[INFO] 
[INFO] --- maven-surefire-plugin:2.17:test (default-test) @ commons-codec ---
[INFO] Surefire report directory: /home/perham/Study/LittleDarwin/Cases/commons-codec-1.10-src/target/surefire-reports

-------------------------------------------------------
 T E S T S
-------------------------------------------------------
Running org.apache.commons.codec.digest.B64Test
Tests run: 2, Failures: 0, Errors: 0, Skipped: 0, Time elapsed: 0.028 sec - in org.apache.commons.codec.digest.B64Test
Running org.apache.commons.codec.digest.DigestUtilsTest
Tests run: 17, Failures: 7, Errors: 0, Skipped: 0, Time elapsed: 0.117 sec <<< FAILURE! - in org.apache.commons.codec.digest.DigestUtilsTest
testMd2Hex(org.apache.commons.codec.digest.DigestUtilsTest)  Time elapsed: 0.007 sec  <<< FAILURE!
org.junit.ComparisonFailure: expected:<[8350e5a3e24c153df2275c9f80692773]> but was:<[73                              ]>
	at org.junit.Assert.assertEquals(Assert.java:115)
	at org.junit.Assert.assertEquals(Assert.java:144)
	at org.apache.commons.codec.digest.DigestUtilsTest.testMd2Hex(DigestUtilsTest.java:62)

testMd5Hex(org.apache.commons.codec.digest.DigestUtilsTest)  Time elapsed: 0.001 sec  <<< FAILURE!
org.junit.ComparisonFailure: expected:<[d41d8cd98f00b204e9800998ecf8427e]> but was:<[7e                              ]>
	at org.junit.Assert.assertEquals(Assert.java:115)
	at org.junit.Assert.assertEquals(Assert.java:144)
	at org.apache.commons.codec.digest.DigestUtilsTest.testMd5Hex(DigestUtilsTest.java:115)

testSha1Hex(org.apache.commons.codec.digest.DigestUtilsTest)  Time elapsed: 0.003 sec  <<< FAILURE!
org.junit.ComparisonFailure: expected:<[a9993e364706816aba3e25717850c26c9cd0d89d]> but was:<[9d                                      ]>
	at org.junit.Assert.assertEquals(Assert.java:115)
	at org.junit.Assert.assertEquals(Assert.java:144)
	at org.apache.commons.codec.digest.DigestUtilsTest.testSha1Hex(DigestUtilsTest.java:168)

testSha256(org.apache.commons.codec.digest.DigestUtilsTest)  Time elapsed: 0.012 sec  <<< FAILURE!
org.junit.ComparisonFailure: expected:<[ba7816bf8f01cfea414140de5dae2223b00361a396177a9cb410ff61f20015ad]> but was:<[ad                                                              ]>
	at org.junit.Assert.assertEquals(Assert.java:115)
	at org.junit.Assert.assertEquals(Assert.java:144)
	at org.apache.commons.codec.digest.DigestUtilsTest.testSha256(DigestUtilsTest.java:218)

testSha384(org.apache.commons.codec.digest.DigestUtilsTest)  Time elapsed: 0 sec  <<< FAILURE!
org.junit.ComparisonFailure: expected:<[cb00753f45a35e8bb5a03d699ac65007272c32ab0eded1631a8b605a43ff5bed8086072ba1e7cc2358baeca134c825a7]> but was:<[a7                                                                                              ]>
	at org.junit.Assert.assertEquals(Assert.java:115)
	at org.junit.Assert.assertEquals(Assert.java:144)
	at org.apache.commons.codec.digest.DigestUtilsTest.testSha384(DigestUtilsTest.java:232)

testSha512(org.apache.commons.codec.digest.DigestUtilsTest)  Time elapsed: 0.001 sec  <<< FAILURE!
org.junit.ComparisonFailure: expected:<[ddaf35a193617abacc417349ae20413112e6fa4e89a97ea20a9eeee64b55d39a2192992a274fc1a836ba3c23a3feebbd454d4423643ce80e2a9ac94fa54ca49f]> but was:<[9f                                                                                                                              ]>
	at org.junit.Assert.assertEquals(Assert.java:115)
	at org.junit.Assert.assertEquals(Assert.java:144)
	at org.apache.commons.codec.digest.DigestUtilsTest.testSha512(DigestUtilsTest.java:249)

testShaHex(org.apache.commons.codec.digest.DigestUtilsTest)  Time elapsed: 0 sec  <<< FAILURE!
org.junit.ComparisonFailure: expected:<[a9993e364706816aba3e25717850c26c9cd0d89d]> but was:<[9d                                      ]>
	at org.junit.Assert.assertEquals(Assert.java:115)
	at org.junit.Assert.assertEquals(Assert.java:144)
	at org.apache.commons.codec.digest.DigestUtilsTest.testShaHex(DigestUtilsTest.java:267)

Running org.apache.commons.codec.digest.Sha512CryptTest
Tests run: 8, Failures: 0, Errors: 0, Skipped: 0, Time elapsed: 0.604 sec - in org.apache.commons.codec.digest.Sha512CryptTest
Running org.apache.commons.codec.digest.Apr1CryptTest
Tests run: 8, Failures: 0, Errors: 0, Skipped: 0, Time elapsed: 0.168 sec - in org.apache.commons.codec.digest.Apr1CryptTest
Running org.apache.commons.codec.digest.HmacUtilsTest
Tests run: 24, Failures: 10, Errors: 0, Skipped: 0, Time elapsed: 0.04 sec <<< FAILURE! - in org.apache.commons.codec.digest.HmacUtilsTest
testHmacMd5Hex(org.apache.commons.codec.digest.HmacUtilsTest)  Time elapsed: 0.014 sec  <<< FAILURE!
org.junit.ComparisonFailure: expected:<[80070713463e7749b90c2dc24911e275]> but was:<[75                              ]>
	at org.junit.Assert.assertEquals(Assert.java:115)
	at org.junit.Assert.assertEquals(Assert.java:144)
	at org.apache.commons.codec.digest.HmacUtilsTest.testHmacMd5Hex(HmacUtilsTest.java:90)

testHmacSha1Hex(org.apache.commons.codec.digest.HmacUtilsTest)  Time elapsed: 0.001 sec  <<< FAILURE!
org.junit.ComparisonFailure: expected:<d[e7c9b85b8b78aa6bc8a7a36f70a90701c9db4d9]> but was:<d[9                                      ]>
	at org.junit.Assert.assertEquals(Assert.java:115)
	at org.junit.Assert.assertEquals(Assert.java:144)
	at org.apache.commons.codec.digest.HmacUtilsTest.testHmacSha1Hex(HmacUtilsTest.java:101)

testHmacSha1UpdateWithByteArray(org.apache.commons.codec.digest.HmacUtilsTest)  Time elapsed: 0.001 sec  <<< FAILURE!
org.junit.ComparisonFailure: expected:<d[e7c9b85b8b78aa6bc8a7a36f70a90701c9db4d9]> but was:<d[9                                      ]>
	at org.junit.Assert.assertEquals(Assert.java:115)
	at org.junit.Assert.assertEquals(Assert.java:144)
	at org.apache.commons.codec.digest.HmacUtilsTest.testHmacSha1UpdateWithByteArray(HmacUtilsTest.java:115)

testSha256HMac(org.apache.commons.codec.digest.HmacUtilsTest)  Time elapsed: 0.004 sec  <<< FAILURE!
org.junit.ComparisonFailure: expected:<[f7bc83f430538424b13298e6aa6fb143ef4d59a14946175997479dbc2d1a3cd8]> but was:<[d8                                                              ]>
	at org.junit.Assert.assertEquals(Assert.java:115)
	at org.junit.Assert.assertEquals(Assert.java:144)
	at org.apache.commons.codec.digest.HmacUtilsTest.testSha256HMac(HmacUtilsTest.java:222)

testSha1HMac(org.apache.commons.codec.digest.HmacUtilsTest)  Time elapsed: 0.002 sec  <<< FAILURE!
org.junit.ComparisonFailure: expected:<d[e7c9b85b8b78aa6bc8a7a36f70a90701c9db4d9]> but was:<d[9                                      ]>
	at org.junit.Assert.assertEquals(Assert.java:115)
	at org.junit.Assert.assertEquals(Assert.java:144)
	at org.apache.commons.codec.digest.HmacUtilsTest.testSha1HMac(HmacUtilsTest.java:201)

testSha384HMac(org.apache.commons.codec.digest.HmacUtilsTest)  Time elapsed: 0.001 sec  <<< FAILURE!
org.junit.ComparisonFailure: expected:<[d7f4727e2c0b39ae0f1e40cc96f60242d5b7801841cea6fc592c5d3e1ae50700582a96cf35e1e554995fe4e03381c237]> but was:<[37                                                                                              ]>
	at org.junit.Assert.assertEquals(Assert.java:115)
	at org.junit.Assert.assertEquals(Assert.java:144)
	at org.apache.commons.codec.digest.HmacUtilsTest.testSha384HMac(HmacUtilsTest.java:243)

testMd5HMac(org.apache.commons.codec.digest.HmacUtilsTest)  Time elapsed: 0.001 sec  <<< FAILURE!
org.junit.ComparisonFailure: expected:<[80070713463e7749b90c2dc24911e275]> but was:<[75                              ]>
	at org.junit.Assert.assertEquals(Assert.java:115)
	at org.junit.Assert.assertEquals(Assert.java:144)
	at org.apache.commons.codec.digest.HmacUtilsTest.testMd5HMac(HmacUtilsTest.java:171)

testHmacSha1UpdateWithString(org.apache.commons.codec.digest.HmacUtilsTest)  Time elapsed: 0.001 sec  <<< FAILURE!
org.junit.ComparisonFailure: expected:<d[e7c9b85b8b78aa6bc8a7a36f70a90701c9db4d9]> but was:<d[9                                      ]>
	at org.junit.Assert.assertEquals(Assert.java:115)
	at org.junit.Assert.assertEquals(Assert.java:144)
	at org.apache.commons.codec.digest.HmacUtilsTest.testHmacSha1UpdateWithString(HmacUtilsTest.java:133)

testHmacSha1UpdateWithInpustream(org.apache.commons.codec.digest.HmacUtilsTest)  Time elapsed: 0.001 sec  <<< FAILURE!
org.junit.ComparisonFailure: expected:<d[e7c9b85b8b78aa6bc8a7a36f70a90701c9db4d9]> but was:<d[9                                      ]>
	at org.junit.Assert.assertEquals(Assert.java:115)
	at org.junit.Assert.assertEquals(Assert.java:144)
	at org.apache.commons.codec.digest.HmacUtilsTest.testHmacSha1UpdateWithInpustream(HmacUtilsTest.java:124)

testSha512HMac(org.apache.commons.codec.digest.HmacUtilsTest)  Time elapsed: 0.001 sec  <<< FAILURE!
org.junit.ComparisonFailure: expected:<[b42af09057bac1e2d41708e48a902e09b5ff7f12ab428a4fe86653c73dd248fb82f948a549f7b791a5b41915ee4d1ec3935357e4e2317250d0372afa2ebeeb3a]> but was:<[3a                                                                                                                              ]>
	at org.junit.Assert.assertEquals(Assert.java:115)
	at org.junit.Assert.assertEquals(Assert.java:144)
	at org.apache.commons.codec.digest.HmacUtilsTest.testSha512HMac(HmacUtilsTest.java:264)

Running org.apache.commons.codec.digest.Sha2CryptTest
Tests run: 1, Failures: 0, Errors: 0, Skipped: 0, Time elapsed: 0 sec - in org.apache.commons.codec.digest.Sha2CryptTest
Running org.apache.commons.codec.digest.CryptTest
Tests run: 4, Failures: 0, Errors: 0, Skipped: 0, Time elapsed: 0.094 sec - in org.apache.commons.codec.digest.CryptTest
Running org.apache.commons.codec.digest.Sha256CryptTest
Tests run: 7, Failures: 0, Errors: 0, Skipped: 0, Time elapsed: 0.103 sec - in org.apache.commons.codec.digest.Sha256CryptTest
Running org.apache.commons.codec.digest.Md5CryptTest
Tests run: 7, Failures: 0, Errors: 0, Skipped: 0, Time elapsed: 0.027 sec - in org.apache.commons.codec.digest.Md5CryptTest
Running org.apache.commons.codec.digest.UnixCryptTest
Tests run: 9, Failures: 0, Errors: 0, Skipped: 0, Time elapsed: 0.006 sec - in org.apache.commons.codec.digest.UnixCryptTest
Running org.apache.commons.codec.CharsetsTest
Tests run: 7, Failures: 0, Errors: 0, Skipped: 0, Time elapsed: 0 sec - in org.apache.commons.codec.CharsetsTest
Running org.apache.commons.codec.binary.Base32Test
Tests run: 8, Failures: 0, Errors: 0, Skipped: 0, Time elapsed: 0.007 sec - in org.apache.commons.codec.binary.Base32Test
Running org.apache.commons.codec.binary.Base64OutputStreamTest
Tests run: 7, Failures: 0, Errors: 0, Skipped: 0, Time elapsed: 0.185 sec - in org.apache.commons.codec.binary.Base64OutputStreamTest
Running org.apache.commons.codec.binary.Base64Codec13Test
Tests run: 8, Failures: 0, Errors: 0, Skipped: 0, Time elapsed: 0.01 sec - in org.apache.commons.codec.binary.Base64Codec13Test
Running org.apache.commons.codec.binary.Base64InputStreamTest
Tests run: 19, Failures: 0, Errors: 0, Skipped: 0, Time elapsed: 0.124 sec - in org.apache.commons.codec.binary.Base64InputStreamTest
Running org.apache.commons.codec.binary.Base32InputStreamTest
Tests run: 16, Failures: 0, Errors: 0, Skipped: 0, Time elapsed: 0.148 sec - in org.apache.commons.codec.binary.Base32InputStreamTest
Running org.apache.commons.codec.binary.Base32OutputStreamTest
Tests run: 6, Failures: 0, Errors: 0, Skipped: 0, Time elapsed: 0.086 sec - in org.apache.commons.codec.binary.Base32OutputStreamTest
Running org.apache.commons.codec.binary.BinaryCodecTest
Tests run: 13, Failures: 0, Errors: 0, Skipped: 0, Time elapsed: 0.009 sec - in org.apache.commons.codec.binary.BinaryCodecTest
Running org.apache.commons.codec.binary.BaseNCodecTest
Tests run: 7, Failures: 0, Errors: 0, Skipped: 0, Time elapsed: 0.002 sec - in org.apache.commons.codec.binary.BaseNCodecTest
Running org.apache.commons.codec.binary.StringUtilsTest
Tests run: 17, Failures: 0, Errors: 0, Skipped: 0, Time elapsed: 0.025 sec - in org.apache.commons.codec.binary.StringUtilsTest
Running org.apache.commons.codec.binary.Base64Test
Tests run: 53, Failures: 0, Errors: 0, Skipped: 1, Time elapsed: 0.044 sec - in org.apache.commons.codec.binary.Base64Test
Running org.apache.commons.codec.binary.HexTest
Tests run: 19, Failures: 3, Errors: 3, Skipped: 0, Time elapsed: 0.074 sec <<< FAILURE! - in org.apache.commons.codec.binary.HexTest
testHelloWorldLowerCaseHex(org.apache.commons.codec.binary.HexTest)  Time elapsed: 0 sec  <<< FAILURE!
org.junit.ComparisonFailure: expected:<[48656c6c6f20576f726c64]> but was:<[64                    ]>
	at org.junit.Assert.assertEquals(Assert.java:115)
	at org.junit.Assert.assertEquals(Assert.java:144)
	at org.apache.commons.codec.binary.HexTest.testHelloWorldLowerCaseHex(HexTest.java:314)

testCustomCharset(org.apache.commons.codec.binary.HexTest)  Time elapsed: 0.068 sec  <<< ERROR!
org.apache.commons.codec.DecoderException: Illegal hexadecimal character   at index 2
	at org.apache.commons.codec.binary.Hex.toDigit(Hex.java:42)
	at org.apache.commons.codec.binary.Hex.decodeHex(Hex.java:25)
	at org.apache.commons.codec.binary.Hex.decode(Hex.java:48)
	at org.apache.commons.codec.binary.HexTest.testCustomCharset(HexTest.java:165)
	at org.apache.commons.codec.binary.HexTest.testCustomCharset(HexTest.java:126)

testHelloWorldUpperCaseHex(org.apache.commons.codec.binary.HexTest)  Time elapsed: 0 sec  <<< FAILURE!
java.lang.AssertionError: null
	at org.junit.Assert.fail(Assert.java:86)
	at org.junit.Assert.assertTrue(Assert.java:41)
	at org.junit.Assert.assertTrue(Assert.java:52)
	at org.apache.commons.codec.binary.HexTest.testHelloWorldUpperCaseHex(HexTest.java:331)

testEncodeDecodeRandom(org.apache.commons.codec.binary.HexTest)  Time elapsed: 0 sec  <<< ERROR!
org.apache.commons.codec.DecoderException: Illegal hexadecimal character   at index 2
	at org.apache.commons.codec.binary.Hex.toDigit(Hex.java:42)
	at org.apache.commons.codec.binary.Hex.decodeHex(Hex.java:25)
	at org.apache.commons.codec.binary.HexTest.testEncodeDecodeRandom(HexTest.java:273)

testEncodeZeroes(org.apache.commons.codec.binary.HexTest)  Time elapsed: 0.001 sec  <<< FAILURE!
org.junit.ComparisonFailure: expected:<00[0000000000000000000000000000000000000000000000000000000000000000000000]> but was:<00[                                                                      ]>
	at org.junit.Assert.assertEquals(Assert.java:115)
	at org.junit.Assert.assertEquals(Assert.java:144)
	at org.apache.commons.codec.binary.HexTest.testEncodeZeroes(HexTest.java:305)

testRequiredCharset(org.apache.commons.codec.binary.HexTest)  Time elapsed: 0.001 sec  <<< ERROR!
org.apache.commons.codec.DecoderException: Illegal hexadecimal character   at index 2
	at org.apache.commons.codec.binary.Hex.toDigit(Hex.java:42)
	at org.apache.commons.codec.binary.Hex.decodeHex(Hex.java:25)
	at org.apache.commons.codec.binary.Hex.decode(Hex.java:48)
	at org.apache.commons.codec.binary.HexTest.testCustomCharset(HexTest.java:165)
	at org.apache.commons.codec.binary.HexTest.testRequiredCharset(HexTest.java:336)

Running org.apache.commons.codec.DecoderExceptionTest
Tests run: 4, Failures: 0, Errors: 0, Skipped: 0, Time elapsed: 0.001 sec - in org.apache.commons.codec.DecoderExceptionTest
Running org.apache.commons.codec.EncoderExceptionTest
Tests run: 4, Failures: 0, Errors: 0, Skipped: 0, Time elapsed: 0.004 sec - in org.apache.commons.codec.EncoderExceptionTest
Running org.apache.commons.codec.net.BCodecTest
Tests run: 9, Failures: 0, Errors: 0, Skipped: 0, Time elapsed: 0.001 sec - in org.apache.commons.codec.net.BCodecTest
Running org.apache.commons.codec.net.QCodecTest
Tests run: 12, Failures: 0, Errors: 0, Skipped: 0, Time elapsed: 0.006 sec - in org.apache.commons.codec.net.QCodecTest
Running org.apache.commons.codec.net.UtilsTest
Tests run: 1, Failures: 0, Errors: 0, Skipped: 0, Time elapsed: 0 sec - in org.apache.commons.codec.net.UtilsTest
Running org.apache.commons.codec.net.RFC1522CodecTest
Tests run: 2, Failures: 0, Errors: 0, Skipped: 0, Time elapsed: 0.002 sec - in org.apache.commons.codec.net.RFC1522CodecTest
Running org.apache.commons.codec.net.URLCodecTest
Tests run: 16, Failures: 0, Errors: 0, Skipped: 0, Time elapsed: 0.006 sec - in org.apache.commons.codec.net.URLCodecTest
Running org.apache.commons.codec.net.QuotedPrintableCodecTest
Tests run: 21, Failures: 0, Errors: 0, Skipped: 0, Time elapsed: 0.016 sec - in org.apache.commons.codec.net.QuotedPrintableCodecTest
Running org.apache.commons.codec.StringEncoderComparatorTest
Tests run: 3, Failures: 0, Errors: 0, Skipped: 0, Time elapsed: 0.001 sec - in org.apache.commons.codec.StringEncoderComparatorTest
Running org.apache.commons.codec.language.Caverphone1Test
Tests run: 9, Failures: 0, Errors: 0, Skipped: 0, Time elapsed: 0.025 sec - in org.apache.commons.codec.language.Caverphone1Test
Running org.apache.commons.codec.language.NysiisTest
Tests run: 23, Failures: 0, Errors: 0, Skipped: 0, Time elapsed: 0.017 sec - in org.apache.commons.codec.language.NysiisTest
Running org.apache.commons.codec.language.Caverphone2Test
Tests run: 13, Failures: 0, Errors: 0, Skipped: 0, Time elapsed: 0.129 sec - in org.apache.commons.codec.language.Caverphone2Test
Running org.apache.commons.codec.language.DaitchMokotoffSoundexTest
Tests run: 13, Failures: 0, Errors: 0, Skipped: 0, Time elapsed: 0.045 sec - in org.apache.commons.codec.language.DaitchMokotoffSoundexTest
Running org.apache.commons.codec.language.bm.BeiderMorseEncoderTest
Tests run: 22, Failures: 0, Errors: 0, Skipped: 0, Time elapsed: 3.005 sec - in org.apache.commons.codec.language.bm.BeiderMorseEncoderTest
Running org.apache.commons.codec.language.bm.PhoneticEngineTest
Tests run: 8, Failures: 0, Errors: 0, Skipped: 0, Time elapsed: 0.016 sec - in org.apache.commons.codec.language.bm.PhoneticEngineTest
Running org.apache.commons.codec.language.bm.PhoneticEngineRegressionTest
Tests run: 4, Failures: 0, Errors: 0, Skipped: 0, Time elapsed: 0.013 sec - in org.apache.commons.codec.language.bm.PhoneticEngineRegressionTest
Running org.apache.commons.codec.language.bm.RuleTest
Tests run: 3, Failures: 0, Errors: 0, Skipped: 0, Time elapsed: 0.002 sec - in org.apache.commons.codec.language.bm.RuleTest
Running org.apache.commons.codec.language.bm.LanguageGuessingTest
Tests run: 18, Failures: 0, Errors: 0, Skipped: 0, Time elapsed: 0.015 sec - in org.apache.commons.codec.language.bm.LanguageGuessingTest
Running org.apache.commons.codec.language.DoubleMetaphoneTest
Tests run: 16, Failures: 0, Errors: 0, Skipped: 0, Time elapsed: 0.054 sec - in org.apache.commons.codec.language.DoubleMetaphoneTest
Running org.apache.commons.codec.language.SoundexTest
Tests run: 28, Failures: 0, Errors: 0, Skipped: 0, Time elapsed: 0.014 sec - in org.apache.commons.codec.language.SoundexTest
Running org.apache.commons.codec.language.RefinedSoundexTest
Tests run: 10, Failures: 0, Errors: 0, Skipped: 0, Time elapsed: 0.003 sec - in org.apache.commons.codec.language.RefinedSoundexTest
Running org.apache.commons.codec.language.MatchRatingApproachEncoderTest
Tests run: 96, Failures: 0, Errors: 0, Skipped: 0, Time elapsed: 0.034 sec - in org.apache.commons.codec.language.MatchRatingApproachEncoderTest
Running org.apache.commons.codec.language.ColognePhoneticTest
Tests run: 13, Failures: 0, Errors: 0, Skipped: 0, Time elapsed: 0.002 sec - in org.apache.commons.codec.language.ColognePhoneticTest
Running org.apache.commons.codec.language.DoubleMetaphone2Test
Tests run: 6, Failures: 0, Errors: 0, Skipped: 0, Time elapsed: 0.031 sec - in org.apache.commons.codec.language.DoubleMetaphone2Test
Running org.apache.commons.codec.language.MetaphoneTest
Tests run: 34, Failures: 0, Errors: 0, Skipped: 0, Time elapsed: 0.124 sec - in org.apache.commons.codec.language.MetaphoneTest
Running org.apache.commons.codec.CharEncodingTest
Tests run: 7, Failures: 0, Errors: 0, Skipped: 0, Time elapsed: 0 sec - in org.apache.commons.codec.CharEncodingTest

Results :

Failed tests: 
  DigestUtilsTest.testMd2Hex:62 expected:<[8350e5a3e24c153df2275c9f80692773]> but was:<[73                              ]>
  DigestUtilsTest.testMd5Hex:115 expected:<[d41d8cd98f00b204e9800998ecf8427e]> but was:<[7e                              ]>
  DigestUtilsTest.testSha1Hex:168 expected:<[a9993e364706816aba3e25717850c26c9cd0d89d]> but was:<[9d                                      ]>
  DigestUtilsTest.testSha256:218 expected:<[ba7816bf8f01cfea414140de5dae2223b00361a396177a9cb410ff61f20015ad]> but was:<[ad                                                              ]>
  DigestUtilsTest.testSha384:232 expected:<[cb00753f45a35e8bb5a03d699ac65007272c32ab0eded1631a8b605a43ff5bed8086072ba1e7cc2358baeca134c825a7]> but was:<[a7                                                                                              ]>
  DigestUtilsTest.testSha512:249 expected:<[ddaf35a193617abacc417349ae20413112e6fa4e89a97ea20a9eeee64b55d39a2192992a274fc1a836ba3c23a3feebbd454d4423643ce80e2a9ac94fa54ca49f]> but was:<[9f                                                                                                                              ]>
  DigestUtilsTest.testShaHex:267 expected:<[a9993e364706816aba3e25717850c26c9cd0d89d]> but was:<[9d                                      ]>
  HmacUtilsTest.testHmacMd5Hex:90 expected:<[80070713463e7749b90c2dc24911e275]> but was:<[75                              ]>
  HmacUtilsTest.testHmacSha1Hex:101 expected:<d[e7c9b85b8b78aa6bc8a7a36f70a90701c9db4d9]> but was:<d[9                                      ]>
  HmacUtilsTest.testHmacSha1UpdateWithByteArray:115 expected:<d[e7c9b85b8b78aa6bc8a7a36f70a90701c9db4d9]> but was:<d[9                                      ]>
  HmacUtilsTest.testSha256HMac:222 expected:<[f7bc83f430538424b13298e6aa6fb143ef4d59a14946175997479dbc2d1a3cd8]> but was:<[d8                                                              ]>
  HmacUtilsTest.testSha1HMac:201 expected:<d[e7c9b85b8b78aa6bc8a7a36f70a90701c9db4d9]> but was:<d[9                                      ]>
  HmacUtilsTest.testSha384HMac:243 expected:<[d7f4727e2c0b39ae0f1e40cc96f60242d5b7801841cea6fc592c5d3e1ae50700582a96cf35e1e554995fe4e03381c237]> but was:<[37                                                                                              ]>
  HmacUtilsTest.testMd5HMac:171 expected:<[80070713463e7749b90c2dc24911e275]> but was:<[75                              ]>
  HmacUtilsTest.testHmacSha1UpdateWithString:133 expected:<d[e7c9b85b8b78aa6bc8a7a36f70a90701c9db4d9]> but was:<d[9                                      ]>
  HmacUtilsTest.testHmacSha1UpdateWithInpustream:124 expected:<d[e7c9b85b8b78aa6bc8a7a36f70a90701c9db4d9]> but was:<d[9                                      ]>
  HmacUtilsTest.testSha512HMac:264 expected:<[b42af09057bac1e2d41708e48a902e09b5ff7f12ab428a4fe86653c73dd248fb82f948a549f7b791a5b41915ee4d1ec3935357e4e2317250d0372afa2ebeeb3a]> but was:<[3a                                                                                                                              ]>
  HexTest.testHelloWorldLowerCaseHex:314 expected:<[48656c6c6f20576f726c64]> but was:<[64                    ]>
  HexTest.testHelloWorldUpperCaseHex:331 null
  HexTest.testEncodeZeroes:305 expected:<00[0000000000000000000000000000000000000000000000000000000000000000000000]> but was:<00[                                                                      ]>

Tests in error: 
  HexTest.testCustomCharset:126->testCustomCharset:165 » Decoder Illegal hexadec...
  HexTest.testEncodeDecodeRandom:273 » Decoder Illegal hexadecimal character   a...
  HexTest.testRequiredCharset:336->testCustomCharset:165 » Decoder Illegal hexad...

Tests run: 662, Failures: 20, Errors: 3, Skipped: 1

[INFO] ------------------------------------------------------------------------
[INFO] BUILD FAILURE
[INFO] ------------------------------------------------------------------------
[INFO] Total time: 15.395s
[INFO] Finished at: Sun Aug 02 07:56:47 BST 2015
[INFO] Final Memory: 18M/208M
[INFO] ------------------------------------------------------------------------
[ERROR] Failed to execute goal org.apache.maven.plugins:maven-surefire-plugin:2.17:test (default-test) on project commons-codec: There are test failures.
[ERROR] 
[ERROR] Please refer to /home/perham/Study/LittleDarwin/Cases/commons-codec-1.10-src/target/surefire-reports for the individual test results.
[ERROR] -> [Help 1]
[ERROR] 
[ERROR] To see the full stack trace of the errors, re-run Maven with the -e switch.
[ERROR] Re-run Maven using the -X switch to enable full debug logging.
[ERROR] 
[ERROR] For more information about the errors and possible solutions, please read the following articles:
[ERROR] [Help 1] http://cwiki.apache.org/confluence/display/MAVEN/MojoFailureException
