[INFO] Scanning for projects...
[INFO]                                                                         
[INFO] ------------------------------------------------------------------------
[INFO] Building Apache Commons Codec 1.10
[INFO] ------------------------------------------------------------------------
[INFO] 
[INFO] --- maven-enforcer-plugin:1.3.1:enforce (enforce-maven-3) @ commons-codec ---
[INFO] 
[INFO] --- maven-antrun-plugin:1.7:run (javadoc.resources) @ commons-codec ---
[INFO] Executing tasks

main:
[INFO] Executed tasks
[INFO] 
[INFO] --- maven-remote-resources-plugin:1.5:process (default) @ commons-codec ---
[INFO] 
[INFO] --- buildnumber-maven-plugin:1.3:create (default) @ commons-codec ---
[INFO] Executing: /bin/sh -c cd /home/perham/Study/LittleDarwin/Cases/commons-codec-1.10-src && svn --non-interactive info
[INFO] Working directory: /home/perham/Study/LittleDarwin/Cases/commons-codec-1.10-src
[INFO] Storing buildNumber: ?????? at timestamp: 1438496502050
[INFO] Executing: /bin/sh -c cd /home/perham/Study/LittleDarwin/Cases/commons-codec-1.10-src && svn --non-interactive info
[INFO] Working directory: /home/perham/Study/LittleDarwin/Cases/commons-codec-1.10-src
[INFO] Storing buildScmBranch: UNKNOWN_BRANCH
[INFO] 
[INFO] --- maven-resources-plugin:2.7:resources (default-resources) @ commons-codec ---
[INFO] Using 'UTF-8' encoding to copy filtered resources.
[INFO] Copying 128 resources
[INFO] Copying 2 resources to META-INF
[INFO] 
[INFO] --- maven-compiler-plugin:3.2:compile (default-compile) @ commons-codec ---
[INFO] Changes detected - recompiling the module!
[INFO] Compiling 60 source files to /home/perham/Study/LittleDarwin/Cases/commons-codec-1.10-src/target/classes
[INFO] /home/perham/Study/LittleDarwin/Cases/commons-codec-1.10-src/src/main/java/org/apache/commons/codec/digest/Sha2Crypt.java: Some input files use or override a deprecated API.
[INFO] /home/perham/Study/LittleDarwin/Cases/commons-codec-1.10-src/src/main/java/org/apache/commons/codec/digest/Sha2Crypt.java: Recompile with -Xlint:deprecation for details.
[INFO] 
[INFO] --- maven-bundle-plugin:2.5.3:manifest (bundle-manifest) @ commons-codec ---
[INFO] 
[INFO] --- maven-resources-plugin:2.7:testResources (default-testResources) @ commons-codec ---
[INFO] Using 'UTF-8' encoding to copy filtered resources.
[INFO] skip non existing resourceDirectory /home/perham/Study/LittleDarwin/Cases/commons-codec-1.10-src/src/test/resources
[INFO] Copying 2 resources to META-INF
[INFO] 
[INFO] --- maven-compiler-plugin:3.2:testCompile (default-testCompile) @ commons-codec ---
[INFO] Nothing to compile - all classes are up to date
[INFO] 
[INFO] --- maven-surefire-plugin:2.17:test (default-test) @ commons-codec ---
[INFO] Surefire report directory: /home/perham/Study/LittleDarwin/Cases/commons-codec-1.10-src/target/surefire-reports

-------------------------------------------------------
 T E S T S
-------------------------------------------------------
Running org.apache.commons.codec.digest.B64Test
Tests run: 2, Failures: 0, Errors: 0, Skipped: 0, Time elapsed: 0.031 sec - in org.apache.commons.codec.digest.B64Test
Running org.apache.commons.codec.digest.DigestUtilsTest
Tests run: 17, Failures: 0, Errors: 0, Skipped: 0, Time elapsed: 0.663 sec - in org.apache.commons.codec.digest.DigestUtilsTest
Running org.apache.commons.codec.digest.Sha512CryptTest
Tests run: 8, Failures: 0, Errors: 0, Skipped: 0, Time elapsed: 0.485 sec - in org.apache.commons.codec.digest.Sha512CryptTest
Running org.apache.commons.codec.digest.Apr1CryptTest
Tests run: 8, Failures: 0, Errors: 0, Skipped: 0, Time elapsed: 0.088 sec - in org.apache.commons.codec.digest.Apr1CryptTest
Running org.apache.commons.codec.digest.HmacUtilsTest
Tests run: 24, Failures: 0, Errors: 0, Skipped: 0, Time elapsed: 0.046 sec - in org.apache.commons.codec.digest.HmacUtilsTest
Running org.apache.commons.codec.digest.Sha2CryptTest
Tests run: 1, Failures: 0, Errors: 0, Skipped: 0, Time elapsed: 0 sec - in org.apache.commons.codec.digest.Sha2CryptTest
Running org.apache.commons.codec.digest.CryptTest
Tests run: 4, Failures: 0, Errors: 0, Skipped: 0, Time elapsed: 0.103 sec - in org.apache.commons.codec.digest.CryptTest
Running org.apache.commons.codec.digest.Sha256CryptTest
Tests run: 7, Failures: 0, Errors: 0, Skipped: 0, Time elapsed: 0.101 sec - in org.apache.commons.codec.digest.Sha256CryptTest
Running org.apache.commons.codec.digest.Md5CryptTest
Tests run: 7, Failures: 0, Errors: 0, Skipped: 0, Time elapsed: 0.015 sec - in org.apache.commons.codec.digest.Md5CryptTest
Running org.apache.commons.codec.digest.UnixCryptTest
Tests run: 9, Failures: 0, Errors: 0, Skipped: 0, Time elapsed: 0.008 sec - in org.apache.commons.codec.digest.UnixCryptTest
Running org.apache.commons.codec.CharsetsTest
Tests run: 7, Failures: 0, Errors: 0, Skipped: 0, Time elapsed: 0.001 sec - in org.apache.commons.codec.CharsetsTest
Running org.apache.commons.codec.binary.Base32Test
Tests run: 8, Failures: 0, Errors: 8, Skipped: 0, Time elapsed: 0.013 sec <<< FAILURE! - in org.apache.commons.codec.binary.Base32Test
testBase32Samples(org.apache.commons.codec.binary.Base32Test)  Time elapsed: 0.002 sec  <<< ERROR!
java.lang.NullPointerException: null
	at org.apache.commons.codec.binary.BaseNCodec.ensureBufferSize(BaseNCodec.java:53)
	at org.apache.commons.codec.binary.Base32.encode(Base32.java:501)
	at org.apache.commons.codec.binary.BaseNCodec.encode(BaseNCodec.java:80)
	at org.apache.commons.codec.binary.BaseNCodec.encodeAsString(BaseNCodec.java:66)
	at org.apache.commons.codec.binary.Base32Test.testBase32Samples(Base32Test.java:76)

testBase32SamplesNonDefaultPadding(org.apache.commons.codec.binary.Base32Test)  Time elapsed: 0 sec  <<< ERROR!
java.lang.NullPointerException: null
	at org.apache.commons.codec.binary.BaseNCodec.ensureBufferSize(BaseNCodec.java:53)
	at org.apache.commons.codec.binary.Base32.encode(Base32.java:501)
	at org.apache.commons.codec.binary.BaseNCodec.encode(BaseNCodec.java:80)
	at org.apache.commons.codec.binary.BaseNCodec.encodeAsString(BaseNCodec.java:66)
	at org.apache.commons.codec.binary.Base32Test.testBase32SamplesNonDefaultPadding(Base32Test.java:151)

testRandomBytes(org.apache.commons.codec.binary.Base32Test)  Time elapsed: 0.001 sec  <<< ERROR!
java.lang.NullPointerException: null
	at org.apache.commons.codec.binary.BaseNCodec.ensureBufferSize(BaseNCodec.java:53)
	at org.apache.commons.codec.binary.Base32.encode(Base32.java:501)
	at org.apache.commons.codec.binary.BaseNCodec.encode(BaseNCodec.java:80)
	at org.apache.commons.codec.binary.Base32TestData.randomData(Base32TestData.java:106)
	at org.apache.commons.codec.binary.Base32Test.testRandomBytes(Base32Test.java:120)

testRandomBytesHex(org.apache.commons.codec.binary.Base32Test)  Time elapsed: 0 sec  <<< ERROR!
java.lang.NullPointerException: null
	at org.apache.commons.codec.binary.BaseNCodec.ensureBufferSize(BaseNCodec.java:53)
	at org.apache.commons.codec.binary.Base32.encode(Base32.java:501)
	at org.apache.commons.codec.binary.BaseNCodec.encode(BaseNCodec.java:80)
	at org.apache.commons.codec.binary.Base32TestData.randomData(Base32TestData.java:106)
	at org.apache.commons.codec.binary.Base32Test.testRandomBytesHex(Base32Test.java:140)

testSingleCharEncoding(org.apache.commons.codec.binary.Base32Test)  Time elapsed: 0.009 sec  <<< ERROR!
java.lang.NullPointerException: null
	at org.apache.commons.codec.binary.BaseNCodec.ensureBufferSize(BaseNCodec.java:53)
	at org.apache.commons.codec.binary.Base32.encode(Base32.java:501)
	at org.apache.commons.codec.binary.BaseNCodec.encode(BaseNCodec.java:80)
	at org.apache.commons.codec.binary.Base32Test.testSingleCharEncoding(Base32Test.java:102)

testRandomBytesChunked(org.apache.commons.codec.binary.Base32Test)  Time elapsed: 0 sec  <<< ERROR!
java.lang.NullPointerException: null
	at org.apache.commons.codec.binary.BaseNCodec.ensureBufferSize(BaseNCodec.java:53)
	at org.apache.commons.codec.binary.Base32.encode(Base32.java:501)
	at org.apache.commons.codec.binary.BaseNCodec.encode(BaseNCodec.java:80)
	at org.apache.commons.codec.binary.Base32TestData.randomData(Base32TestData.java:106)
	at org.apache.commons.codec.binary.Base32Test.testRandomBytesChunked(Base32Test.java:130)

testBase32HexSamples(org.apache.commons.codec.binary.Base32Test)  Time elapsed: 0 sec  <<< ERROR!
java.lang.NullPointerException: null
	at org.apache.commons.codec.binary.BaseNCodec.ensureBufferSize(BaseNCodec.java:53)
	at org.apache.commons.codec.binary.Base32.encode(Base32.java:501)
	at org.apache.commons.codec.binary.BaseNCodec.encode(BaseNCodec.java:80)
	at org.apache.commons.codec.binary.BaseNCodec.encodeAsString(BaseNCodec.java:66)
	at org.apache.commons.codec.binary.Base32Test.testBase32HexSamples(Base32Test.java:84)

testBase32Chunked(org.apache.commons.codec.binary.Base32Test)  Time elapsed: 0 sec  <<< ERROR!
java.lang.NullPointerException: null
	at org.apache.commons.codec.binary.BaseNCodec.ensureBufferSize(BaseNCodec.java:53)
	at org.apache.commons.codec.binary.Base32.encode(Base32.java:501)
	at org.apache.commons.codec.binary.BaseNCodec.encode(BaseNCodec.java:80)
	at org.apache.commons.codec.binary.BaseNCodec.encodeAsString(BaseNCodec.java:66)
	at org.apache.commons.codec.binary.Base32Test.testBase32Chunked(Base32Test.java:92)

Running org.apache.commons.codec.binary.Base64OutputStreamTest
Tests run: 7, Failures: 0, Errors: 7, Skipped: 0, Time elapsed: 0.001 sec <<< FAILURE! - in org.apache.commons.codec.binary.Base64OutputStreamTest
testCodec98NPE(org.apache.commons.codec.binary.Base64OutputStreamTest)  Time elapsed: 0 sec  <<< ERROR!
java.lang.NullPointerException: null
	at org.apache.commons.codec.binary.BaseNCodec.ensureBufferSize(BaseNCodec.java:53)
	at org.apache.commons.codec.binary.Base64.decode(Base64.java:436)
	at org.apache.commons.codec.binary.BaseNCodecOutputStream.write(BaseNCodecOutputStream.java:95)
	at org.apache.commons.codec.binary.Base64OutputStreamTest.testCodec98NPE(Base64OutputStreamTest.java:55)

testWriteOutOfBounds(org.apache.commons.codec.binary.Base64OutputStreamTest)  Time elapsed: 0 sec  <<< ERROR!
java.lang.NullPointerException: null
	at org.apache.commons.codec.binary.BaseNCodec.ensureBufferSize(BaseNCodec.java:53)
	at org.apache.commons.codec.binary.Base64.encode(Base64.java:342)
	at org.apache.commons.codec.binary.BaseNCodecOutputStream.close(BaseNCodecOutputStream.java:145)
	at org.apache.commons.codec.binary.Base64OutputStreamTest.testWriteOutOfBounds(Base64OutputStreamTest.java:327)

testBase64OutputStreamByteByByte(org.apache.commons.codec.binary.Base64OutputStreamTest)  Time elapsed: 0 sec  <<< ERROR!
java.lang.NullPointerException: null
	at org.apache.commons.codec.binary.BaseNCodec.ensureBufferSize(BaseNCodec.java:53)
	at org.apache.commons.codec.binary.Base64.encode(Base64.java:379)
	at org.apache.commons.codec.binary.BaseNCodecOutputStream.write(BaseNCodecOutputStream.java:93)
	at org.apache.commons.codec.binary.BaseNCodecOutputStream.write(BaseNCodecOutputStream.java:62)
	at org.apache.commons.codec.binary.Base64OutputStreamTest.testByteByByte(Base64OutputStreamTest.java:245)
	at org.apache.commons.codec.binary.Base64OutputStreamTest.testBase64OutputStreamByteByByte(Base64OutputStreamTest.java:144)

testWriteToNullCoverage(org.apache.commons.codec.binary.Base64OutputStreamTest)  Time elapsed: 0 sec  <<< ERROR!
java.lang.NullPointerException: null
	at org.apache.commons.codec.binary.BaseNCodec.ensureBufferSize(BaseNCodec.java:53)
	at org.apache.commons.codec.binary.Base64.encode(Base64.java:342)
	at org.apache.commons.codec.binary.BaseNCodecOutputStream.close(BaseNCodecOutputStream.java:145)
	at org.apache.commons.codec.binary.Base64OutputStreamTest.testWriteToNullCoverage(Base64OutputStreamTest.java:346)

testBase64EmptyOutputStreamMimeChunkSize(org.apache.commons.codec.binary.Base64OutputStreamTest)  Time elapsed: 0 sec  <<< ERROR!
java.lang.NullPointerException: null
	at org.apache.commons.codec.binary.BaseNCodec.ensureBufferSize(BaseNCodec.java:53)
	at org.apache.commons.codec.binary.Base64.encode(Base64.java:342)
	at org.apache.commons.codec.binary.BaseNCodecOutputStream.close(BaseNCodecOutputStream.java:145)
	at org.apache.commons.codec.binary.Base64OutputStreamTest.testByteByByte(Base64OutputStreamTest.java:247)
	at org.apache.commons.codec.binary.Base64OutputStreamTest.testBase64EmptyOutputStream(Base64OutputStreamTest.java:91)
	at org.apache.commons.codec.binary.Base64OutputStreamTest.testBase64EmptyOutputStreamMimeChunkSize(Base64OutputStreamTest.java:74)

testBase64EmptyOutputStreamPemChunkSize(org.apache.commons.codec.binary.Base64OutputStreamTest)  Time elapsed: 0 sec  <<< ERROR!
java.lang.NullPointerException: null
	at org.apache.commons.codec.binary.BaseNCodec.ensureBufferSize(BaseNCodec.java:53)
	at org.apache.commons.codec.binary.Base64.encode(Base64.java:342)
	at org.apache.commons.codec.binary.BaseNCodecOutputStream.close(BaseNCodecOutputStream.java:145)
	at org.apache.commons.codec.binary.Base64OutputStreamTest.testByteByByte(Base64OutputStreamTest.java:247)
	at org.apache.commons.codec.binary.Base64OutputStreamTest.testBase64EmptyOutputStream(Base64OutputStreamTest.java:91)
	at org.apache.commons.codec.binary.Base64OutputStreamTest.testBase64EmptyOutputStreamPemChunkSize(Base64OutputStreamTest.java:85)

testBase64OutputStreamByChunk(org.apache.commons.codec.binary.Base64OutputStreamTest)  Time elapsed: 0 sec  <<< ERROR!
java.lang.NullPointerException: null
	at org.apache.commons.codec.binary.BaseNCodec.ensureBufferSize(BaseNCodec.java:53)
	at org.apache.commons.codec.binary.Base64.encode(Base64.java:379)
	at org.apache.commons.codec.binary.BaseNCodecOutputStream.write(BaseNCodecOutputStream.java:93)
	at java.io.FilterOutputStream.write(FilterOutputStream.java:97)
	at org.apache.commons.codec.binary.Base64OutputStreamTest.testByChunk(Base64OutputStreamTest.java:194)
	at org.apache.commons.codec.binary.Base64OutputStreamTest.testBase64OutputStreamByChunk(Base64OutputStreamTest.java:106)

Running org.apache.commons.codec.binary.Base64Codec13Test
Tests run: 8, Failures: 0, Errors: 8, Skipped: 0, Time elapsed: 0.001 sec <<< FAILURE! - in org.apache.commons.codec.binary.Base64Codec13Test
testEncoder(org.apache.commons.codec.binary.Base64Codec13Test)  Time elapsed: 0 sec  <<< ERROR!
java.lang.NullPointerException: null
	at org.apache.commons.codec.binary.BaseNCodec.ensureBufferSize(BaseNCodec.java:53)
	at org.apache.commons.codec.binary.Base64.encode(Base64.java:379)
	at org.apache.commons.codec.binary.BaseNCodec.encode(BaseNCodec.java:80)
	at org.apache.commons.codec.binary.BaseNCodec.encode(BaseNCodec.java:64)
	at org.apache.commons.codec.binary.Base64Codec13Test.testEncoder(Base64Codec13Test.java:371)

testBinaryEncoder(org.apache.commons.codec.binary.Base64Codec13Test)  Time elapsed: 0 sec  <<< ERROR!
java.lang.NullPointerException: null
	at org.apache.commons.codec.binary.BaseNCodec.ensureBufferSize(BaseNCodec.java:53)
	at org.apache.commons.codec.binary.Base64.encode(Base64.java:379)
	at org.apache.commons.codec.binary.BaseNCodec.encode(BaseNCodec.java:80)
	at org.apache.commons.codec.binary.Base64Codec13Test.testBinaryEncoder(Base64Codec13Test.java:409)

testStaticEncodeChunked(org.apache.commons.codec.binary.Base64Codec13Test)  Time elapsed: 0 sec  <<< ERROR!
java.lang.NullPointerException: null
	at org.apache.commons.codec.binary.BaseNCodec.ensureBufferSize(BaseNCodec.java:53)
	at org.apache.commons.codec.binary.Base64.encode(Base64.java:379)
	at org.apache.commons.codec.binary.BaseNCodec.encode(BaseNCodec.java:80)
	at org.apache.commons.codec.binary.Base64.encodeBase64(Base64.java:677)
	at org.apache.commons.codec.binary.Base64.encodeBase64(Base64.java:640)
	at org.apache.commons.codec.binary.Base64.encodeBase64(Base64.java:621)
	at org.apache.commons.codec.binary.Base64.encodeBase64Chunked(Base64.java:606)
	at org.apache.commons.codec.binary.Base64Codec13Test.testStaticEncodeChunked(Base64Codec13Test.java:482)

testDecoder(org.apache.commons.codec.binary.Base64Codec13Test)  Time elapsed: 0 sec  <<< ERROR!
java.lang.NullPointerException: null
	at org.apache.commons.codec.binary.BaseNCodec.ensureBufferSize(BaseNCodec.java:53)
	at org.apache.commons.codec.binary.Base64.decode(Base64.java:436)
	at org.apache.commons.codec.binary.BaseNCodec.decode(BaseNCodec.java:73)
	at org.apache.commons.codec.binary.BaseNCodec.decode(BaseNCodec.java:67)
	at org.apache.commons.codec.binary.Base64Codec13Test.testDecoder(Base64Codec13Test.java:390)

testBinaryDecoder(org.apache.commons.codec.binary.Base64Codec13Test)  Time elapsed: 0 sec  <<< ERROR!
java.lang.NullPointerException: null
	at org.apache.commons.codec.binary.BaseNCodec.ensureBufferSize(BaseNCodec.java:53)
	at org.apache.commons.codec.binary.Base64.decode(Base64.java:436)
	at org.apache.commons.codec.binary.BaseNCodec.decode(BaseNCodec.java:73)
	at org.apache.commons.codec.binary.Base64Codec13Test.testBinaryDecoder(Base64Codec13Test.java:428)

testStaticDecodeChunked(org.apache.commons.codec.binary.Base64Codec13Test)  Time elapsed: 0 sec  <<< ERROR!
java.lang.NullPointerException: null
	at org.apache.commons.codec.binary.BaseNCodec.ensureBufferSize(BaseNCodec.java:53)
	at org.apache.commons.codec.binary.Base64.decode(Base64.java:436)
	at org.apache.commons.codec.binary.BaseNCodec.decode(BaseNCodec.java:73)
	at org.apache.commons.codec.binary.Base64.decodeBase64(Base64.java:706)
	at org.apache.commons.codec.binary.Base64Codec13Test.testStaticDecodeChunked(Base64Codec13Test.java:501)

testStaticDecode(org.apache.commons.codec.binary.Base64Codec13Test)  Time elapsed: 0 sec  <<< ERROR!
java.lang.NullPointerException: null
	at org.apache.commons.codec.binary.BaseNCodec.ensureBufferSize(BaseNCodec.java:53)
	at org.apache.commons.codec.binary.Base64.decode(Base64.java:436)
	at org.apache.commons.codec.binary.BaseNCodec.decode(BaseNCodec.java:73)
	at org.apache.commons.codec.binary.Base64.decodeBase64(Base64.java:706)
	at org.apache.commons.codec.binary.Base64Codec13Test.testStaticDecode(Base64Codec13Test.java:464)

testStaticEncode(org.apache.commons.codec.binary.Base64Codec13Test)  Time elapsed: 0 sec  <<< ERROR!
java.lang.NullPointerException: null
	at org.apache.commons.codec.binary.BaseNCodec.ensureBufferSize(BaseNCodec.java:53)
	at org.apache.commons.codec.binary.Base64.encode(Base64.java:379)
	at org.apache.commons.codec.binary.BaseNCodec.encode(BaseNCodec.java:80)
	at org.apache.commons.codec.binary.Base64.encodeBase64(Base64.java:677)
	at org.apache.commons.codec.binary.Base64.encodeBase64(Base64.java:640)
	at org.apache.commons.codec.binary.Base64.encodeBase64(Base64.java:621)
	at org.apache.commons.codec.binary.Base64.encodeBase64(Base64.java:554)
	at org.apache.commons.codec.binary.Base64Codec13Test.testStaticEncode(Base64Codec13Test.java:446)

Running org.apache.commons.codec.binary.Base64InputStreamTest
Tests run: 19, Failures: 0, Errors: 14, Skipped: 0, Time elapsed: 0.011 sec <<< FAILURE! - in org.apache.commons.codec.binary.Base64InputStreamTest
testSkipToEnd(org.apache.commons.codec.binary.Base64InputStreamTest)  Time elapsed: 0.001 sec  <<< ERROR!
java.lang.NullPointerException: null
	at org.apache.commons.codec.binary.BaseNCodec.ensureBufferSize(BaseNCodec.java:53)
	at org.apache.commons.codec.binary.Base64.decode(Base64.java:436)
	at org.apache.commons.codec.binary.BaseNCodecInputStream.read(BaseNCodecInputStream.java:162)
	at org.apache.commons.codec.binary.BaseNCodecInputStream.skip(BaseNCodecInputStream.java:202)
	at org.apache.commons.codec.binary.Base64InputStreamTest.testSkipToEnd(Base64InputStreamTest.java:552)

testSkipNone(org.apache.commons.codec.binary.Base64InputStreamTest)  Time elapsed: 0 sec  <<< ERROR!
java.lang.NullPointerException: null
	at org.apache.commons.codec.binary.BaseNCodec.ensureBufferSize(BaseNCodec.java:53)
	at org.apache.commons.codec.binary.Base64.decode(Base64.java:436)
	at org.apache.commons.codec.binary.BaseNCodecInputStream.read(BaseNCodecInputStream.java:162)
	at org.apache.commons.codec.binary.Base64InputStreamTest.testSkipNone(Base64InputStreamTest.java:518)

testCodec98NPE(org.apache.commons.codec.binary.Base64InputStreamTest)  Time elapsed: 0.002 sec  <<< ERROR!
java.lang.NullPointerException: null
	at org.apache.commons.codec.binary.BaseNCodec.ensureBufferSize(BaseNCodec.java:53)
	at org.apache.commons.codec.binary.Base64.decode(Base64.java:436)
	at org.apache.commons.codec.binary.BaseNCodecInputStream.read(BaseNCodecInputStream.java:162)
	at org.apache.commons.codec.binary.Base64TestData.fill(Base64TestData.java:172)
	at org.apache.commons.codec.binary.Base64TestData.streamToBytes(Base64TestData.java:149)
	at org.apache.commons.codec.binary.Base64InputStreamTest.testCodec98NPE(Base64InputStreamTest.java:151)

testBase64InputStreamByChunk(org.apache.commons.codec.binary.Base64InputStreamTest)  Time elapsed: 0 sec  <<< ERROR!
java.lang.NullPointerException: null
	at org.apache.commons.codec.binary.BaseNCodec.ensureBufferSize(BaseNCodec.java:53)
	at org.apache.commons.codec.binary.Base64.encode(Base64.java:379)
	at org.apache.commons.codec.binary.BaseNCodecInputStream.read(BaseNCodecInputStream.java:160)
	at org.apache.commons.codec.binary.Base64TestData.fill(Base64TestData.java:172)
	at org.apache.commons.codec.binary.Base64TestData.streamToBytes(Base64TestData.java:149)
	at org.apache.commons.codec.binary.Base64TestData.streamToBytes(Base64TestData.java:144)
	at org.apache.commons.codec.binary.Base64InputStreamTest.testByChunk(Base64InputStreamTest.java:304)
	at org.apache.commons.codec.binary.Base64InputStreamTest.testBase64InputStreamByChunk(Base64InputStreamTest.java:216)

testInputStreamReader(org.apache.commons.codec.binary.Base64InputStreamTest)  Time elapsed: 0 sec  <<< ERROR!
java.lang.NullPointerException: null
	at org.apache.commons.codec.binary.BaseNCodec.ensureBufferSize(BaseNCodec.java:53)
	at org.apache.commons.codec.binary.Base64.decode(Base64.java:436)
	at org.apache.commons.codec.binary.BaseNCodecInputStream.read(BaseNCodecInputStream.java:162)
	at sun.nio.cs.StreamDecoder.readBytes(StreamDecoder.java:283)
	at sun.nio.cs.StreamDecoder.implRead(StreamDecoder.java:325)
	at sun.nio.cs.StreamDecoder.read(StreamDecoder.java:177)
	at java.io.InputStreamReader.read(InputStreamReader.java:184)
	at java.io.BufferedReader.fill(BufferedReader.java:154)
	at java.io.BufferedReader.readLine(BufferedReader.java:317)
	at java.io.BufferedReader.readLine(BufferedReader.java:382)
	at org.apache.commons.codec.binary.Base64InputStreamTest.testInputStreamReader(Base64InputStreamTest.java:133)

testCodec101(org.apache.commons.codec.binary.Base64InputStreamTest)  Time elapsed: 0 sec  <<< ERROR!
java.lang.NullPointerException: null
	at org.apache.commons.codec.binary.BaseNCodec.ensureBufferSize(BaseNCodec.java:53)
	at org.apache.commons.codec.binary.Base64.decode(Base64.java:436)
	at org.apache.commons.codec.binary.BaseNCodecInputStream.read(BaseNCodecInputStream.java:162)
	at java.io.FilterInputStream.read(FilterInputStream.java:107)
	at org.apache.commons.codec.binary.Base64InputStreamTest.testCodec101(Base64InputStreamTest.java:103)

testCodec105(org.apache.commons.codec.binary.Base64InputStreamTest)  Time elapsed: 0 sec  <<< ERROR!
java.lang.NullPointerException: null
	at org.apache.commons.codec.binary.BaseNCodec.ensureBufferSize(BaseNCodec.java:53)
	at org.apache.commons.codec.binary.Base64.encode(Base64.java:379)
	at org.apache.commons.codec.binary.BaseNCodecInputStream.read(BaseNCodecInputStream.java:160)
	at org.apache.commons.codec.binary.BaseNCodecInputStream.read(BaseNCodecInputStream.java:97)
	at org.apache.commons.codec.binary.Base64InputStreamTest.testCodec105(Base64InputStreamTest.java:84)

testCodec130(org.apache.commons.codec.binary.Base64InputStreamTest)  Time elapsed: 0 sec  <<< ERROR!
java.lang.NullPointerException: null
	at org.apache.commons.codec.binary.BaseNCodec.ensureBufferSize(BaseNCodec.java:53)
	at org.apache.commons.codec.binary.Base64.encode(Base64.java:379)
	at org.apache.commons.codec.binary.BaseNCodecOutputStream.write(BaseNCodecOutputStream.java:93)
	at java.io.FilterOutputStream.write(FilterOutputStream.java:97)
	at org.apache.commons.codec.binary.Base64InputStreamTest.testCodec130(Base64InputStreamTest.java:62)

testAvailable(org.apache.commons.codec.binary.Base64InputStreamTest)  Time elapsed: 0 sec  <<< ERROR!
java.lang.NullPointerException: null
	at org.apache.commons.codec.binary.BaseNCodec.ensureBufferSize(BaseNCodec.java:53)
	at org.apache.commons.codec.binary.Base64.decode(Base64.java:436)
	at org.apache.commons.codec.binary.BaseNCodecInputStream.read(BaseNCodecInputStream.java:162)
	at org.apache.commons.codec.binary.BaseNCodecInputStream.skip(BaseNCodecInputStream.java:202)
	at org.apache.commons.codec.binary.Base64InputStreamTest.testAvailable(Base64InputStreamTest.java:167)

testBase64EmptyInputStreamPemChuckSize(org.apache.commons.codec.binary.Base64InputStreamTest)  Time elapsed: 0.001 sec  <<< ERROR!
java.lang.NullPointerException: null
	at org.apache.commons.codec.binary.BaseNCodec.ensureBufferSize(BaseNCodec.java:53)
	at org.apache.commons.codec.binary.Base64.encode(Base64.java:342)
	at org.apache.commons.codec.binary.BaseNCodecInputStream.read(BaseNCodecInputStream.java:160)
	at org.apache.commons.codec.binary.BaseNCodecInputStream.read(BaseNCodecInputStream.java:97)
	at org.apache.commons.codec.binary.Base64InputStreamTest.testByteByByte(Base64InputStreamTest.java:362)
	at org.apache.commons.codec.binary.Base64InputStreamTest.testBase64EmptyInputStream(Base64InputStreamTest.java:201)
	at org.apache.commons.codec.binary.Base64InputStreamTest.testBase64EmptyInputStreamPemChuckSize(Base64InputStreamTest.java:195)

testBase64EmptyInputStreamMimeChuckSize(org.apache.commons.codec.binary.Base64InputStreamTest)  Time elapsed: 0 sec  <<< ERROR!
java.lang.NullPointerException: null
	at org.apache.commons.codec.binary.BaseNCodec.ensureBufferSize(BaseNCodec.java:53)
	at org.apache.commons.codec.binary.Base64.encode(Base64.java:342)
	at org.apache.commons.codec.binary.BaseNCodecInputStream.read(BaseNCodecInputStream.java:160)
	at org.apache.commons.codec.binary.BaseNCodecInputStream.read(BaseNCodecInputStream.java:97)
	at org.apache.commons.codec.binary.Base64InputStreamTest.testByteByByte(Base64InputStreamTest.java:362)
	at org.apache.commons.codec.binary.Base64InputStreamTest.testBase64EmptyInputStream(Base64InputStreamTest.java:201)
	at org.apache.commons.codec.binary.Base64InputStreamTest.testBase64EmptyInputStreamMimeChuckSize(Base64InputStreamTest.java:184)

testSkipPastEnd(org.apache.commons.codec.binary.Base64InputStreamTest)  Time elapsed: 0.001 sec  <<< ERROR!
java.lang.NullPointerException: null
	at org.apache.commons.codec.binary.BaseNCodec.ensureBufferSize(BaseNCodec.java:53)
	at org.apache.commons.codec.binary.Base64.decode(Base64.java:436)
	at org.apache.commons.codec.binary.BaseNCodecInputStream.read(BaseNCodecInputStream.java:162)
	at org.apache.commons.codec.binary.BaseNCodecInputStream.skip(BaseNCodecInputStream.java:202)
	at org.apache.commons.codec.binary.Base64InputStreamTest.testSkipPastEnd(Base64InputStreamTest.java:535)

testSkipBig(org.apache.commons.codec.binary.Base64InputStreamTest)  Time elapsed: 0 sec  <<< ERROR!
java.lang.NullPointerException: null
	at org.apache.commons.codec.binary.BaseNCodec.ensureBufferSize(BaseNCodec.java:53)
	at org.apache.commons.codec.binary.Base64.decode(Base64.java:436)
	at org.apache.commons.codec.binary.BaseNCodecInputStream.read(BaseNCodecInputStream.java:162)
	at org.apache.commons.codec.binary.BaseNCodecInputStream.skip(BaseNCodecInputStream.java:202)
	at org.apache.commons.codec.binary.Base64InputStreamTest.testSkipBig(Base64InputStreamTest.java:500)

testBase64InputStreamByteByByte(org.apache.commons.codec.binary.Base64InputStreamTest)  Time elapsed: 0.001 sec  <<< ERROR!
java.lang.NullPointerException: null
	at org.apache.commons.codec.binary.BaseNCodec.ensureBufferSize(BaseNCodec.java:53)
	at org.apache.commons.codec.binary.Base64.encode(Base64.java:379)
	at org.apache.commons.codec.binary.BaseNCodecInputStream.read(BaseNCodecInputStream.java:160)
	at org.apache.commons.codec.binary.BaseNCodecInputStream.read(BaseNCodecInputStream.java:97)
	at org.apache.commons.codec.binary.Base64InputStreamTest.testByteByByte(Base64InputStreamTest.java:359)
	at org.apache.commons.codec.binary.Base64InputStreamTest.testBase64InputStreamByteByByte(Base64InputStreamTest.java:254)

Running org.apache.commons.codec.binary.Base32InputStreamTest
Tests run: 16, Failures: 0, Errors: 11, Skipped: 0, Time elapsed: 0.008 sec <<< FAILURE! - in org.apache.commons.codec.binary.Base32InputStreamTest
testBase32InputStreamByteByByte(org.apache.commons.codec.binary.Base32InputStreamTest)  Time elapsed: 0.001 sec  <<< ERROR!
java.lang.NullPointerException: null
	at org.apache.commons.codec.binary.BaseNCodec.ensureBufferSize(BaseNCodec.java:53)
	at org.apache.commons.codec.binary.Base32.encode(Base32.java:501)
	at org.apache.commons.codec.binary.BaseNCodecInputStream.read(BaseNCodecInputStream.java:160)
	at org.apache.commons.codec.binary.BaseNCodecInputStream.read(BaseNCodecInputStream.java:97)
	at org.apache.commons.codec.binary.Base32InputStreamTest.testByteByByte(Base32InputStreamTest.java:345)
	at org.apache.commons.codec.binary.Base32InputStreamTest.testBase32InputStreamByteByByte(Base32InputStreamTest.java:245)

testSkipToEnd(org.apache.commons.codec.binary.Base32InputStreamTest)  Time elapsed: 0 sec  <<< ERROR!
java.lang.NullPointerException: null
	at org.apache.commons.codec.binary.BaseNCodec.ensureBufferSize(BaseNCodec.java:53)
	at org.apache.commons.codec.binary.Base32.decode(Base32.java:352)
	at org.apache.commons.codec.binary.BaseNCodecInputStream.read(BaseNCodecInputStream.java:162)
	at org.apache.commons.codec.binary.BaseNCodecInputStream.skip(BaseNCodecInputStream.java:202)
	at org.apache.commons.codec.binary.Base32InputStreamTest.testSkipToEnd(Base32InputStreamTest.java:538)

testSkipNone(org.apache.commons.codec.binary.Base32InputStreamTest)  Time elapsed: 0 sec  <<< ERROR!
java.lang.NullPointerException: null
	at org.apache.commons.codec.binary.BaseNCodec.ensureBufferSize(BaseNCodec.java:53)
	at org.apache.commons.codec.binary.Base32.decode(Base32.java:352)
	at org.apache.commons.codec.binary.BaseNCodecInputStream.read(BaseNCodecInputStream.java:162)
	at org.apache.commons.codec.binary.Base32InputStreamTest.testSkipNone(Base32InputStreamTest.java:488)

testBase32EmptyInputStreamPemChuckSize(org.apache.commons.codec.binary.Base32InputStreamTest)  Time elapsed: 0 sec  <<< ERROR!
java.lang.NullPointerException: null
	at org.apache.commons.codec.binary.BaseNCodec.ensureBufferSize(BaseNCodec.java:53)
	at org.apache.commons.codec.binary.Base32.encode(Base32.java:445)
	at org.apache.commons.codec.binary.BaseNCodecInputStream.read(BaseNCodecInputStream.java:160)
	at org.apache.commons.codec.binary.BaseNCodecInputStream.read(BaseNCodecInputStream.java:97)
	at org.apache.commons.codec.binary.Base32InputStreamTest.testByteByByte(Base32InputStreamTest.java:348)
	at org.apache.commons.codec.binary.Base32InputStreamTest.testBase32EmptyInputStream(Base32InputStreamTest.java:191)
	at org.apache.commons.codec.binary.Base32InputStreamTest.testBase32EmptyInputStreamPemChuckSize(Base32InputStreamTest.java:185)

testCodec105(org.apache.commons.codec.binary.Base32InputStreamTest)  Time elapsed: 0.001 sec  <<< ERROR!
java.lang.NullPointerException: null
	at org.apache.commons.codec.binary.BaseNCodec.ensureBufferSize(BaseNCodec.java:53)
	at org.apache.commons.codec.binary.Base32.encode(Base32.java:501)
	at org.apache.commons.codec.binary.BaseNCodecInputStream.read(BaseNCodecInputStream.java:160)
	at org.apache.commons.codec.binary.BaseNCodecInputStream.read(BaseNCodecInputStream.java:97)
	at org.apache.commons.codec.binary.Base32InputStreamTest.testCodec105(Base32InputStreamTest.java:74)

testCodec130(org.apache.commons.codec.binary.Base32InputStreamTest)  Time elapsed: 0 sec  <<< ERROR!
java.lang.NullPointerException: null
	at org.apache.commons.codec.binary.BaseNCodec.ensureBufferSize(BaseNCodec.java:53)
	at org.apache.commons.codec.binary.Base32.encode(Base32.java:501)
	at org.apache.commons.codec.binary.BaseNCodecOutputStream.write(BaseNCodecOutputStream.java:93)
	at java.io.FilterOutputStream.write(FilterOutputStream.java:97)
	at org.apache.commons.codec.binary.Base32InputStreamTest.testCodec130(Base32InputStreamTest.java:52)

testAvailable(org.apache.commons.codec.binary.Base32InputStreamTest)  Time elapsed: 0 sec  <<< ERROR!
java.lang.NullPointerException: null
	at org.apache.commons.codec.binary.BaseNCodec.ensureBufferSize(BaseNCodec.java:53)
	at org.apache.commons.codec.binary.Base32.decode(Base32.java:352)
	at org.apache.commons.codec.binary.BaseNCodecInputStream.read(BaseNCodecInputStream.java:162)
	at org.apache.commons.codec.binary.BaseNCodecInputStream.skip(BaseNCodecInputStream.java:202)
	at org.apache.commons.codec.binary.Base32InputStreamTest.testAvailable(Base32InputStreamTest.java:157)

testBase32EmptyInputStreamMimeChuckSize(org.apache.commons.codec.binary.Base32InputStreamTest)  Time elapsed: 0.001 sec  <<< ERROR!
java.lang.NullPointerException: null
	at org.apache.commons.codec.binary.BaseNCodec.ensureBufferSize(BaseNCodec.java:53)
	at org.apache.commons.codec.binary.Base32.encode(Base32.java:445)
	at org.apache.commons.codec.binary.BaseNCodecInputStream.read(BaseNCodecInputStream.java:160)
	at org.apache.commons.codec.binary.BaseNCodecInputStream.read(BaseNCodecInputStream.java:97)
	at org.apache.commons.codec.binary.Base32InputStreamTest.testByteByByte(Base32InputStreamTest.java:348)
	at org.apache.commons.codec.binary.Base32InputStreamTest.testBase32EmptyInputStream(Base32InputStreamTest.java:191)
	at org.apache.commons.codec.binary.Base32InputStreamTest.testBase32EmptyInputStreamMimeChuckSize(Base32InputStreamTest.java:174)

testSkipPastEnd(org.apache.commons.codec.binary.Base32InputStreamTest)  Time elapsed: 0 sec  <<< ERROR!
java.lang.NullPointerException: null
	at org.apache.commons.codec.binary.BaseNCodec.ensureBufferSize(BaseNCodec.java:53)
	at org.apache.commons.codec.binary.Base32.decode(Base32.java:352)
	at org.apache.commons.codec.binary.BaseNCodecInputStream.read(BaseNCodecInputStream.java:162)
	at org.apache.commons.codec.binary.BaseNCodecInputStream.skip(BaseNCodecInputStream.java:202)
	at org.apache.commons.codec.binary.Base32InputStreamTest.testSkipPastEnd(Base32InputStreamTest.java:521)

testSkipBig(org.apache.commons.codec.binary.Base32InputStreamTest)  Time elapsed: 0 sec  <<< ERROR!
java.lang.NullPointerException: null
	at org.apache.commons.codec.binary.BaseNCodec.ensureBufferSize(BaseNCodec.java:53)
	at org.apache.commons.codec.binary.Base32.decode(Base32.java:352)
	at org.apache.commons.codec.binary.BaseNCodecInputStream.read(BaseNCodecInputStream.java:162)
	at org.apache.commons.codec.binary.BaseNCodecInputStream.skip(BaseNCodecInputStream.java:202)
	at org.apache.commons.codec.binary.Base32InputStreamTest.testSkipBig(Base32InputStreamTest.java:504)

testBase32InputStreamByChunk(org.apache.commons.codec.binary.Base32InputStreamTest)  Time elapsed: 0 sec  <<< ERROR!
java.lang.NullPointerException: null
	at org.apache.commons.codec.binary.BaseNCodec.ensureBufferSize(BaseNCodec.java:53)
	at org.apache.commons.codec.binary.Base32.encode(Base32.java:501)
	at org.apache.commons.codec.binary.BaseNCodecInputStream.read(BaseNCodecInputStream.java:160)
	at org.apache.commons.codec.binary.Base32TestData.fill(Base32TestData.java:74)
	at org.apache.commons.codec.binary.Base32TestData.streamToBytes(Base32TestData.java:51)
	at org.apache.commons.codec.binary.Base32TestData.streamToBytes(Base32TestData.java:46)
	at org.apache.commons.codec.binary.Base32InputStreamTest.testByChunk(Base32InputStreamTest.java:292)
	at org.apache.commons.codec.binary.Base32InputStreamTest.testBase32InputStreamByChunk(Base32InputStreamTest.java:206)

Running org.apache.commons.codec.binary.Base32OutputStreamTest
Tests run: 6, Failures: 0, Errors: 4, Skipped: 0, Time elapsed: 0.001 sec <<< FAILURE! - in org.apache.commons.codec.binary.Base32OutputStreamTest
testBase32EmptyOutputStreamPemChunkSize(org.apache.commons.codec.binary.Base32OutputStreamTest)  Time elapsed: 0 sec  <<< ERROR!
java.lang.NullPointerException: null
	at org.apache.commons.codec.binary.BaseNCodec.ensureBufferSize(BaseNCodec.java:53)
	at org.apache.commons.codec.binary.Base32.encode(Base32.java:445)
	at org.apache.commons.codec.binary.BaseNCodecOutputStream.close(BaseNCodecOutputStream.java:145)
	at org.apache.commons.codec.binary.Base32OutputStreamTest.testByteByByte(Base32OutputStreamTest.java:236)
	at org.apache.commons.codec.binary.Base32OutputStreamTest.testBase32EmptyOutputStream(Base32OutputStreamTest.java:86)
	at org.apache.commons.codec.binary.Base32OutputStreamTest.testBase32EmptyOutputStreamPemChunkSize(Base32OutputStreamTest.java:80)

testBase32EmptyOutputStreamMimeChunkSize(org.apache.commons.codec.binary.Base32OutputStreamTest)  Time elapsed: 0 sec  <<< ERROR!
java.lang.NullPointerException: null
	at org.apache.commons.codec.binary.BaseNCodec.ensureBufferSize(BaseNCodec.java:53)
	at org.apache.commons.codec.binary.Base32.encode(Base32.java:445)
	at org.apache.commons.codec.binary.BaseNCodecOutputStream.close(BaseNCodecOutputStream.java:145)
	at org.apache.commons.codec.binary.Base32OutputStreamTest.testByteByByte(Base32OutputStreamTest.java:236)
	at org.apache.commons.codec.binary.Base32OutputStreamTest.testBase32EmptyOutputStream(Base32OutputStreamTest.java:86)
	at org.apache.commons.codec.binary.Base32OutputStreamTest.testBase32EmptyOutputStreamMimeChunkSize(Base32OutputStreamTest.java:69)

testBase32OutputStreamByChunk(org.apache.commons.codec.binary.Base32OutputStreamTest)  Time elapsed: 0 sec  <<< ERROR!
java.lang.NullPointerException: null
	at org.apache.commons.codec.binary.BaseNCodec.ensureBufferSize(BaseNCodec.java:53)
	at org.apache.commons.codec.binary.Base32.encode(Base32.java:501)
	at org.apache.commons.codec.binary.BaseNCodecOutputStream.write(BaseNCodecOutputStream.java:93)
	at java.io.FilterOutputStream.write(FilterOutputStream.java:97)
	at org.apache.commons.codec.binary.Base32OutputStreamTest.testByChunk(Base32OutputStreamTest.java:183)
	at org.apache.commons.codec.binary.Base32OutputStreamTest.testBase32OutputStreamByChunk(Base32OutputStreamTest.java:101)

testBase32OutputStreamByteByByte(org.apache.commons.codec.binary.Base32OutputStreamTest)  Time elapsed: 0 sec  <<< ERROR!
java.lang.NullPointerException: null
	at org.apache.commons.codec.binary.BaseNCodec.ensureBufferSize(BaseNCodec.java:53)
	at org.apache.commons.codec.binary.Base32.encode(Base32.java:501)
	at org.apache.commons.codec.binary.BaseNCodecOutputStream.write(BaseNCodecOutputStream.java:93)
	at org.apache.commons.codec.binary.BaseNCodecOutputStream.write(BaseNCodecOutputStream.java:62)
	at org.apache.commons.codec.binary.Base32OutputStreamTest.testByteByByte(Base32OutputStreamTest.java:234)
	at org.apache.commons.codec.binary.Base32OutputStreamTest.testBase32OutputStreamByteByByte(Base32OutputStreamTest.java:136)

Running org.apache.commons.codec.binary.BinaryCodecTest
Tests run: 13, Failures: 0, Errors: 0, Skipped: 0, Time elapsed: 0.009 sec - in org.apache.commons.codec.binary.BinaryCodecTest
Running org.apache.commons.codec.binary.BaseNCodecTest
Tests run: 7, Failures: 0, Errors: 0, Skipped: 0, Time elapsed: 0.002 sec - in org.apache.commons.codec.binary.BaseNCodecTest
Running org.apache.commons.codec.binary.StringUtilsTest
Tests run: 17, Failures: 0, Errors: 0, Skipped: 0, Time elapsed: 0.023 sec - in org.apache.commons.codec.binary.StringUtilsTest
Running org.apache.commons.codec.binary.Base64Test
Tests run: 53, Failures: 1, Errors: 38, Skipped: 1, Time elapsed: 0.031 sec <<< FAILURE! - in org.apache.commons.codec.binary.Base64Test
testTriplets(org.apache.commons.codec.binary.Base64Test)  Time elapsed: 0 sec  <<< ERROR!
java.lang.NullPointerException: null
	at org.apache.commons.codec.binary.BaseNCodec.ensureBufferSize(BaseNCodec.java:53)
	at org.apache.commons.codec.binary.Base64.encode(Base64.java:379)
	at org.apache.commons.codec.binary.BaseNCodec.encode(BaseNCodec.java:80)
	at org.apache.commons.codec.binary.Base64.encodeBase64(Base64.java:677)
	at org.apache.commons.codec.binary.Base64.encodeBase64(Base64.java:640)
	at org.apache.commons.codec.binary.Base64.encodeBase64(Base64.java:621)
	at org.apache.commons.codec.binary.Base64.encodeBase64(Base64.java:554)
	at org.apache.commons.codec.binary.Base64Test.testTriplets(Base64Test.java:940)

testStringToByteVariations(org.apache.commons.codec.binary.Base64Test)  Time elapsed: 0 sec  <<< ERROR!
java.lang.NullPointerException: null
	at org.apache.commons.codec.binary.BaseNCodec.ensureBufferSize(BaseNCodec.java:53)
	at org.apache.commons.codec.binary.Base64.decode(Base64.java:436)
	at org.apache.commons.codec.binary.BaseNCodec.decode(BaseNCodec.java:73)
	at org.apache.commons.codec.binary.BaseNCodec.decode(BaseNCodec.java:70)
	at org.apache.commons.codec.binary.Base64Test.testStringToByteVariations(Base64Test.java:1218)

testConstructor_Int_ByteArray_Boolean_UrlSafe(org.apache.commons.codec.binary.Base64Test)  Time elapsed: 0 sec  <<< ERROR!
java.lang.NullPointerException: null
	at org.apache.commons.codec.binary.BaseNCodec.ensureBufferSize(BaseNCodec.java:53)
	at org.apache.commons.codec.binary.Base64.encode(Base64.java:379)
	at org.apache.commons.codec.binary.BaseNCodec.encode(BaseNCodec.java:80)
	at org.apache.commons.codec.binary.Base64Test.testConstructor_Int_ByteArray_Boolean_UrlSafe(Base64Test.java:257)

testSingletonsChunked(org.apache.commons.codec.binary.Base64Test)  Time elapsed: 0 sec  <<< ERROR!
java.lang.NullPointerException: null
	at org.apache.commons.codec.binary.BaseNCodec.ensureBufferSize(BaseNCodec.java:53)
	at org.apache.commons.codec.binary.Base64.encode(Base64.java:379)
	at org.apache.commons.codec.binary.BaseNCodec.encode(BaseNCodec.java:80)
	at org.apache.commons.codec.binary.Base64.encodeBase64(Base64.java:677)
	at org.apache.commons.codec.binary.Base64.encodeBase64(Base64.java:640)
	at org.apache.commons.codec.binary.Base64.encodeBase64(Base64.java:621)
	at org.apache.commons.codec.binary.Base64.encodeBase64Chunked(Base64.java:606)
	at org.apache.commons.codec.binary.Base64Test.testSingletonsChunked(Base64Test.java:831)

testKnownDecodings(org.apache.commons.codec.binary.Base64Test)  Time elapsed: 0.001 sec  <<< ERROR!
java.lang.NullPointerException: null
	at org.apache.commons.codec.binary.BaseNCodec.ensureBufferSize(BaseNCodec.java:53)
	at org.apache.commons.codec.binary.Base64.decode(Base64.java:436)
	at org.apache.commons.codec.binary.BaseNCodec.decode(BaseNCodec.java:73)
	at org.apache.commons.codec.binary.Base64.decodeBase64(Base64.java:706)
	at org.apache.commons.codec.binary.Base64Test.testKnownDecodings(Base64Test.java:431)

testPairs(org.apache.commons.codec.binary.Base64Test)  Time elapsed: 0 sec  <<< ERROR!
java.lang.NullPointerException: null
	at org.apache.commons.codec.binary.BaseNCodec.ensureBufferSize(BaseNCodec.java:53)
	at org.apache.commons.codec.binary.Base64.encode(Base64.java:379)
	at org.apache.commons.codec.binary.BaseNCodec.encode(BaseNCodec.java:80)
	at org.apache.commons.codec.binary.Base64.encodeBase64(Base64.java:677)
	at org.apache.commons.codec.binary.Base64.encodeBase64(Base64.java:640)
	at org.apache.commons.codec.binary.Base64.encodeBase64(Base64.java:621)
	at org.apache.commons.codec.binary.Base64.encodeBase64(Base64.java:554)
	at org.apache.commons.codec.binary.Base64Test.testPairs(Base64Test.java:547)

testUUID(org.apache.commons.codec.binary.Base64Test)  Time elapsed: 0.001 sec  <<< ERROR!
java.lang.NullPointerException: null
	at org.apache.commons.codec.binary.BaseNCodec.ensureBufferSize(BaseNCodec.java:53)
	at org.apache.commons.codec.binary.Base64.encode(Base64.java:379)
	at org.apache.commons.codec.binary.BaseNCodec.encode(BaseNCodec.java:80)
	at org.apache.commons.codec.binary.Base64.encodeBase64(Base64.java:677)
	at org.apache.commons.codec.binary.Base64.encodeBase64(Base64.java:640)
	at org.apache.commons.codec.binary.Base64.encodeBase64(Base64.java:621)
	at org.apache.commons.codec.binary.Base64.encodeBase64(Base64.java:554)
	at org.apache.commons.codec.binary.Base64Test.testUUID(Base64Test.java:1147)

testEncodeDecodeSmall(org.apache.commons.codec.binary.Base64Test)  Time elapsed: 0 sec  <<< ERROR!
java.lang.NullPointerException: null
	at org.apache.commons.codec.binary.BaseNCodec.ensureBufferSize(BaseNCodec.java:53)
	at org.apache.commons.codec.binary.Base64.encode(Base64.java:379)
	at org.apache.commons.codec.binary.BaseNCodec.encode(BaseNCodec.java:80)
	at org.apache.commons.codec.binary.Base64.encodeBase64(Base64.java:677)
	at org.apache.commons.codec.binary.Base64.encodeBase64(Base64.java:640)
	at org.apache.commons.codec.binary.Base64.encodeBase64(Base64.java:621)
	at org.apache.commons.codec.binary.Base64.encodeBase64(Base64.java:554)
	at org.apache.commons.codec.binary.Base64Test.testEncodeDecodeSmall(Base64Test.java:362)

testObjectDecodeWithValidParameter(org.apache.commons.codec.binary.Base64Test)  Time elapsed: 0.001 sec  <<< ERROR!
java.lang.NullPointerException: null
	at org.apache.commons.codec.binary.BaseNCodec.ensureBufferSize(BaseNCodec.java:53)
	at org.apache.commons.codec.binary.Base64.encode(Base64.java:379)
	at org.apache.commons.codec.binary.BaseNCodec.encode(BaseNCodec.java:80)
	at org.apache.commons.codec.binary.Base64.encodeBase64(Base64.java:677)
	at org.apache.commons.codec.binary.Base64.encodeBase64(Base64.java:640)
	at org.apache.commons.codec.binary.Base64.encodeBase64(Base64.java:621)
	at org.apache.commons.codec.binary.Base64.encodeBase64(Base64.java:554)
	at org.apache.commons.codec.binary.Base64Test.testObjectDecodeWithValidParameter(Base64Test.java:504)

testCodeInteger1(org.apache.commons.codec.binary.Base64Test)  Time elapsed: 0.001 sec  <<< ERROR!
java.lang.NullPointerException: null
	at org.apache.commons.codec.binary.BaseNCodec.ensureBufferSize(BaseNCodec.java:53)
	at org.apache.commons.codec.binary.Base64.encode(Base64.java:379)
	at org.apache.commons.codec.binary.BaseNCodec.encode(BaseNCodec.java:80)
	at org.apache.commons.codec.binary.Base64.encodeBase64(Base64.java:677)
	at org.apache.commons.codec.binary.Base64.encodeBase64(Base64.java:640)
	at org.apache.commons.codec.binary.Base64.encodeBase64(Base64.java:621)
	at org.apache.commons.codec.binary.Base64.encodeInteger(Base64.java:738)
	at org.apache.commons.codec.binary.Base64Test.testCodeInteger1(Base64Test.java:149)

testCodeInteger2(org.apache.commons.codec.binary.Base64Test)  Time elapsed: 0 sec  <<< ERROR!
java.lang.NullPointerException: null
	at org.apache.commons.codec.binary.BaseNCodec.ensureBufferSize(BaseNCodec.java:53)
	at org.apache.commons.codec.binary.Base64.encode(Base64.java:379)
	at org.apache.commons.codec.binary.BaseNCodec.encode(BaseNCodec.java:80)
	at org.apache.commons.codec.binary.Base64.encodeBase64(Base64.java:677)
	at org.apache.commons.codec.binary.Base64.encodeBase64(Base64.java:640)
	at org.apache.commons.codec.binary.Base64.encodeBase64(Base64.java:621)
	at org.apache.commons.codec.binary.Base64.encodeInteger(Base64.java:738)
	at org.apache.commons.codec.binary.Base64Test.testCodeInteger2(Base64Test.java:158)

testCodeInteger3(org.apache.commons.codec.binary.Base64Test)  Time elapsed: 0 sec  <<< ERROR!
java.lang.NullPointerException: null
	at org.apache.commons.codec.binary.BaseNCodec.ensureBufferSize(BaseNCodec.java:53)
	at org.apache.commons.codec.binary.Base64.encode(Base64.java:379)
	at org.apache.commons.codec.binary.BaseNCodec.encode(BaseNCodec.java:80)
	at org.apache.commons.codec.binary.Base64.encodeBase64(Base64.java:677)
	at org.apache.commons.codec.binary.Base64.encodeBase64(Base64.java:640)
	at org.apache.commons.codec.binary.Base64.encodeBase64(Base64.java:621)
	at org.apache.commons.codec.binary.Base64.encodeInteger(Base64.java:738)
	at org.apache.commons.codec.binary.Base64Test.testCodeInteger3(Base64Test.java:169)

testCodeInteger4(org.apache.commons.codec.binary.Base64Test)  Time elapsed: 0 sec  <<< ERROR!
java.lang.NullPointerException: null
	at org.apache.commons.codec.binary.BaseNCodec.ensureBufferSize(BaseNCodec.java:53)
	at org.apache.commons.codec.binary.Base64.encode(Base64.java:379)
	at org.apache.commons.codec.binary.BaseNCodec.encode(BaseNCodec.java:80)
	at org.apache.commons.codec.binary.Base64.encodeBase64(Base64.java:677)
	at org.apache.commons.codec.binary.Base64.encodeBase64(Base64.java:640)
	at org.apache.commons.codec.binary.Base64.encodeBase64(Base64.java:621)
	at org.apache.commons.codec.binary.Base64.encodeInteger(Base64.java:738)
	at org.apache.commons.codec.binary.Base64Test.testCodeInteger4(Base64Test.java:186)

testObjectEncode(org.apache.commons.codec.binary.Base64Test)  Time elapsed: 0 sec  <<< ERROR!
java.lang.NullPointerException: null
	at org.apache.commons.codec.binary.BaseNCodec.ensureBufferSize(BaseNCodec.java:53)
	at org.apache.commons.codec.binary.Base64.encode(Base64.java:379)
	at org.apache.commons.codec.binary.BaseNCodec.encode(BaseNCodec.java:80)
	at org.apache.commons.codec.binary.Base64Test.testObjectEncode(Base64Test.java:542)

testUrlSafe(org.apache.commons.codec.binary.Base64Test)  Time elapsed: 0.001 sec  <<< ERROR!
java.lang.NullPointerException: null
	at org.apache.commons.codec.binary.BaseNCodec.ensureBufferSize(BaseNCodec.java:53)
	at org.apache.commons.codec.binary.Base64.encode(Base64.java:379)
	at org.apache.commons.codec.binary.BaseNCodec.encode(BaseNCodec.java:80)
	at org.apache.commons.codec.binary.Base64.encodeBase64(Base64.java:677)
	at org.apache.commons.codec.binary.Base64.encodeBase64(Base64.java:640)
	at org.apache.commons.codec.binary.Base64.encodeBase64URLSafe(Base64.java:582)
	at org.apache.commons.codec.binary.Base64TestData.randomData(Base64TestData.java:204)
	at org.apache.commons.codec.binary.Base64Test.testUrlSafe(Base64Test.java:1081)

testEncodeDecodeRandom(org.apache.commons.codec.binary.Base64Test)  Time elapsed: 0.002 sec  <<< ERROR!
java.lang.NullPointerException: null
	at org.apache.commons.codec.binary.BaseNCodec.ensureBufferSize(BaseNCodec.java:53)
	at org.apache.commons.codec.binary.Base64.encode(Base64.java:379)
	at org.apache.commons.codec.binary.BaseNCodec.encode(BaseNCodec.java:80)
	at org.apache.commons.codec.binary.Base64.encodeBase64(Base64.java:677)
	at org.apache.commons.codec.binary.Base64.encodeBase64(Base64.java:640)
	at org.apache.commons.codec.binary.Base64.encodeBase64(Base64.java:621)
	at org.apache.commons.codec.binary.Base64.encodeBase64(Base64.java:554)
	at org.apache.commons.codec.binary.Base64Test.testEncodeDecodeRandom(Base64Test.java:349)

testDecodeWithWhitespace(org.apache.commons.codec.binary.Base64Test)  Time elapsed: 0 sec  <<< ERROR!
java.lang.NullPointerException: null
	at org.apache.commons.codec.binary.BaseNCodec.ensureBufferSize(BaseNCodec.java:53)
	at org.apache.commons.codec.binary.Base64.encode(Base64.java:379)
	at org.apache.commons.codec.binary.BaseNCodec.encode(BaseNCodec.java:80)
	at org.apache.commons.codec.binary.Base64.encodeBase64(Base64.java:677)
	at org.apache.commons.codec.binary.Base64.encodeBase64(Base64.java:640)
	at org.apache.commons.codec.binary.Base64.encodeBase64(Base64.java:621)
	at org.apache.commons.codec.binary.Base64.encodeBase64(Base64.java:554)
	at org.apache.commons.codec.binary.Base64Test.testDecodeWithWhitespace(Base64Test.java:311)

testDecodePadOnlyChunked(org.apache.commons.codec.binary.Base64Test)  Time elapsed: 0.001 sec  <<< ERROR!
java.lang.NullPointerException: null
	at org.apache.commons.codec.binary.BaseNCodec.ensureBufferSize(BaseNCodec.java:53)
	at org.apache.commons.codec.binary.Base64.decode(Base64.java:436)
	at org.apache.commons.codec.binary.BaseNCodec.decode(BaseNCodec.java:73)
	at org.apache.commons.codec.binary.Base64.decodeBase64(Base64.java:706)
	at org.apache.commons.codec.binary.Base64Test.testDecodePadOnlyChunked(Base64Test.java:297)

testKnownEncodings(org.apache.commons.codec.binary.Base64Test)  Time elapsed: 0 sec  <<< ERROR!
java.lang.NullPointerException: null
	at org.apache.commons.codec.binary.BaseNCodec.ensureBufferSize(BaseNCodec.java:53)
	at org.apache.commons.codec.binary.Base64.encode(Base64.java:379)
	at org.apache.commons.codec.binary.BaseNCodec.encode(BaseNCodec.java:80)
	at org.apache.commons.codec.binary.Base64.encodeBase64(Base64.java:677)
	at org.apache.commons.codec.binary.Base64.encodeBase64(Base64.java:640)
	at org.apache.commons.codec.binary.Base64.encodeBase64(Base64.java:621)
	at org.apache.commons.codec.binary.Base64.encodeBase64(Base64.java:554)
	at org.apache.commons.codec.binary.Base64Test.testKnownEncodings(Base64Test.java:446)

testIgnoringNonBase64InDecode(org.apache.commons.codec.binary.Base64Test)  Time elapsed: 0 sec  <<< ERROR!
java.lang.NullPointerException: null
	at org.apache.commons.codec.binary.BaseNCodec.ensureBufferSize(BaseNCodec.java:53)
	at org.apache.commons.codec.binary.Base64.decode(Base64.java:436)
	at org.apache.commons.codec.binary.BaseNCodec.decode(BaseNCodec.java:73)
	at org.apache.commons.codec.binary.Base64.decodeBase64(Base64.java:706)
	at org.apache.commons.codec.binary.Base64Test.testIgnoringNonBase64InDecode(Base64Test.java:395)

testCodec112(org.apache.commons.codec.binary.Base64Test)  Time elapsed: 0.001 sec  <<< ERROR!
java.lang.NullPointerException: null
	at org.apache.commons.codec.binary.BaseNCodec.ensureBufferSize(BaseNCodec.java:53)
	at org.apache.commons.codec.binary.Base64.encode(Base64.java:379)
	at org.apache.commons.codec.binary.BaseNCodec.encode(BaseNCodec.java:80)
	at org.apache.commons.codec.binary.Base64.encodeBase64(Base64.java:677)
	at org.apache.commons.codec.binary.Base64.encodeBase64(Base64.java:640)
	at org.apache.commons.codec.binary.Base64.encodeBase64(Base64.java:621)
	at org.apache.commons.codec.binary.Base64.encodeBase64(Base64.java:554)
	at org.apache.commons.codec.binary.Base64Test.testCodec112(Base64Test.java:380)

testDecodePadMarkerIndex2(org.apache.commons.codec.binary.Base64Test)  Time elapsed: 0 sec  <<< ERROR!
java.lang.NullPointerException: null
	at org.apache.commons.codec.binary.BaseNCodec.ensureBufferSize(BaseNCodec.java:53)
	at org.apache.commons.codec.binary.Base64.decode(Base64.java:436)
	at org.apache.commons.codec.binary.BaseNCodec.decode(BaseNCodec.java:73)
	at org.apache.commons.codec.binary.Base64.decodeBase64(Base64.java:706)
	at org.apache.commons.codec.binary.Base64Test.testDecodePadMarkerIndex2(Base64Test.java:272)

testDecodePadMarkerIndex3(org.apache.commons.codec.binary.Base64Test)  Time elapsed: 0.001 sec  <<< ERROR!
java.lang.NullPointerException: null
	at org.apache.commons.codec.binary.BaseNCodec.ensureBufferSize(BaseNCodec.java:53)
	at org.apache.commons.codec.binary.Base64.decode(Base64.java:436)
	at org.apache.commons.codec.binary.BaseNCodec.decode(BaseNCodec.java:73)
	at org.apache.commons.codec.binary.Base64.decodeBase64(Base64.java:706)
	at org.apache.commons.codec.binary.Base64Test.testDecodePadMarkerIndex3(Base64Test.java:280)

testSingletons(org.apache.commons.codec.binary.Base64Test)  Time elapsed: 0.001 sec  <<< ERROR!
java.lang.NullPointerException: null
	at org.apache.commons.codec.binary.BaseNCodec.ensureBufferSize(BaseNCodec.java:53)
	at org.apache.commons.codec.binary.Base64.encode(Base64.java:379)
	at org.apache.commons.codec.binary.BaseNCodec.encode(BaseNCodec.java:80)
	at org.apache.commons.codec.binary.Base64.encodeBase64(Base64.java:677)
	at org.apache.commons.codec.binary.Base64.encodeBase64(Base64.java:640)
	at org.apache.commons.codec.binary.Base64.encodeBase64(Base64.java:621)
	at org.apache.commons.codec.binary.Base64.encodeBase64(Base64.java:554)
	at org.apache.commons.codec.binary.Base64Test.testSingletons(Base64Test.java:718)

testTripletsChunked(org.apache.commons.codec.binary.Base64Test)  Time elapsed: 0 sec  <<< ERROR!
java.lang.NullPointerException: null
	at org.apache.commons.codec.binary.BaseNCodec.ensureBufferSize(BaseNCodec.java:53)
	at org.apache.commons.codec.binary.Base64.encode(Base64.java:379)
	at org.apache.commons.codec.binary.BaseNCodec.encode(BaseNCodec.java:80)
	at org.apache.commons.codec.binary.Base64.encodeBase64(Base64.java:677)
	at org.apache.commons.codec.binary.Base64.encodeBase64(Base64.java:640)
	at org.apache.commons.codec.binary.Base64.encodeBase64(Base64.java:621)
	at org.apache.commons.codec.binary.Base64.encodeBase64Chunked(Base64.java:606)
	at org.apache.commons.codec.binary.Base64Test.testTripletsChunked(Base64Test.java:1008)

testCodec68(org.apache.commons.codec.binary.Base64Test)  Time elapsed: 0 sec  <<< ERROR!
java.lang.NullPointerException: null
	at org.apache.commons.codec.binary.BaseNCodec.ensureBufferSize(BaseNCodec.java:53)
	at org.apache.commons.codec.binary.Base64.decode(Base64.java:436)
	at org.apache.commons.codec.binary.BaseNCodec.decode(BaseNCodec.java:73)
	at org.apache.commons.codec.binary.Base64.decodeBase64(Base64.java:706)
	at org.apache.commons.codec.binary.Base64Test.testCodec68(Base64Test.java:141)

testRfc4648Section10DecodeEncode(org.apache.commons.codec.binary.Base64Test)  Time elapsed: 0.001 sec  <<< ERROR!
java.lang.NullPointerException: null
	at org.apache.commons.codec.binary.BaseNCodec.ensureBufferSize(BaseNCodec.java:53)
	at org.apache.commons.codec.binary.Base64.decode(Base64.java:436)
	at org.apache.commons.codec.binary.BaseNCodec.decode(BaseNCodec.java:73)
	at org.apache.commons.codec.binary.BaseNCodec.decode(BaseNCodec.java:70)
	at org.apache.commons.codec.binary.Base64.decodeBase64(Base64.java:692)
	at org.apache.commons.codec.binary.Base64Test.testDecodeEncode(Base64Test.java:680)
	at org.apache.commons.codec.binary.Base64Test.testRfc4648Section10DecodeEncode(Base64Test.java:671)

testDecodePadOnly(org.apache.commons.codec.binary.Base64Test)  Time elapsed: 0.001 sec  <<< ERROR!
java.lang.NullPointerException: null
	at org.apache.commons.codec.binary.BaseNCodec.ensureBufferSize(BaseNCodec.java:53)
	at org.apache.commons.codec.binary.Base64.decode(Base64.java:436)
	at org.apache.commons.codec.binary.BaseNCodec.decode(BaseNCodec.java:73)
	at org.apache.commons.codec.binary.Base64.decodeBase64(Base64.java:706)
	at org.apache.commons.codec.binary.Base64Test.testDecodePadOnly(Base64Test.java:286)

testChunkedEncodeMultipleOf76(org.apache.commons.codec.binary.Base64Test)  Time elapsed: 0 sec  <<< ERROR!
java.lang.NullPointerException: null
	at org.apache.commons.codec.binary.BaseNCodec.ensureBufferSize(BaseNCodec.java:53)
	at org.apache.commons.codec.binary.Base64.encode(Base64.java:379)
	at org.apache.commons.codec.binary.BaseNCodec.encode(BaseNCodec.java:80)
	at org.apache.commons.codec.binary.Base64.encodeBase64(Base64.java:677)
	at org.apache.commons.codec.binary.Base64.encodeBase64(Base64.java:640)
	at org.apache.commons.codec.binary.Base64.encodeBase64(Base64.java:621)
	at org.apache.commons.codec.binary.Base64Test.testChunkedEncodeMultipleOf76(Base64Test.java:127)

testBase64(org.apache.commons.codec.binary.Base64Test)  Time elapsed: 0 sec  <<< ERROR!
java.lang.NullPointerException: null
	at org.apache.commons.codec.binary.BaseNCodec.ensureBufferSize(BaseNCodec.java:53)
	at org.apache.commons.codec.binary.Base64.encode(Base64.java:379)
	at org.apache.commons.codec.binary.BaseNCodec.encode(BaseNCodec.java:80)
	at org.apache.commons.codec.binary.Base64.encodeBase64(Base64.java:677)
	at org.apache.commons.codec.binary.Base64.encodeBase64(Base64.java:640)
	at org.apache.commons.codec.binary.Base64.encodeBase64(Base64.java:621)
	at org.apache.commons.codec.binary.Base64.encodeBase64(Base64.java:554)
	at org.apache.commons.codec.binary.Base64Test.testBase64(Base64Test.java:82)

testNonBase64Test(org.apache.commons.codec.binary.Base64Test)  Time elapsed: 0 sec  <<< FAILURE!
java.lang.AssertionError: Exception was thrown when trying to decode invalid base64 encoded data - RFC 2045 requires that all non base64 character be discarded, an exception should not have been thrown
	at org.junit.Assert.fail(Assert.java:88)
	at org.apache.commons.codec.binary.Base64Test.testNonBase64Test(Base64Test.java:480)

testConstructor_Int_ByteArray_Boolean(org.apache.commons.codec.binary.Base64Test)  Time elapsed: 0 sec  <<< ERROR!
java.lang.NullPointerException: null
	at org.apache.commons.codec.binary.BaseNCodec.ensureBufferSize(BaseNCodec.java:53)
	at org.apache.commons.codec.binary.Base64.encode(Base64.java:379)
	at org.apache.commons.codec.binary.BaseNCodec.encode(BaseNCodec.java:80)
	at org.apache.commons.codec.binary.Base64Test.testConstructor_Int_ByteArray_Boolean(Base64Test.java:246)

testByteToStringVariations(org.apache.commons.codec.binary.Base64Test)  Time elapsed: 0.001 sec  <<< ERROR!
java.lang.NullPointerException: null
	at org.apache.commons.codec.binary.BaseNCodec.ensureBufferSize(BaseNCodec.java:53)
	at org.apache.commons.codec.binary.Base64.encode(Base64.java:379)
	at org.apache.commons.codec.binary.BaseNCodec.encode(BaseNCodec.java:80)
	at org.apache.commons.codec.binary.BaseNCodec.encodeToString(BaseNCodec.java:65)
	at org.apache.commons.codec.binary.Base64Test.testByteToStringVariations(Base64Test.java:1197)

testObjectEncodeWithValidParameter(org.apache.commons.codec.binary.Base64Test)  Time elapsed: 0 sec  <<< ERROR!
java.lang.NullPointerException: null
	at org.apache.commons.codec.binary.BaseNCodec.ensureBufferSize(BaseNCodec.java:53)
	at org.apache.commons.codec.binary.Base64.encode(Base64.java:379)
	at org.apache.commons.codec.binary.BaseNCodec.encode(BaseNCodec.java:80)
	at org.apache.commons.codec.binary.BaseNCodec.encode(BaseNCodec.java:64)
	at org.apache.commons.codec.binary.Base64Test.testObjectEncodeWithValidParameter(Base64Test.java:532)

testRfc4648Section10DecodeWithCrLf(org.apache.commons.codec.binary.Base64Test)  Time elapsed: 0 sec  <<< ERROR!
java.lang.NullPointerException: null
	at org.apache.commons.codec.binary.BaseNCodec.ensureBufferSize(BaseNCodec.java:53)
	at org.apache.commons.codec.binary.Base64.decode(Base64.java:436)
	at org.apache.commons.codec.binary.BaseNCodec.decode(BaseNCodec.java:73)
	at org.apache.commons.codec.binary.BaseNCodec.decode(BaseNCodec.java:70)
	at org.apache.commons.codec.binary.Base64.decodeBase64(Base64.java:692)
	at org.apache.commons.codec.binary.Base64Test.testRfc4648Section10DecodeWithCrLf(Base64Test.java:620)

testRfc4648Section10Decode(org.apache.commons.codec.binary.Base64Test)  Time elapsed: 0 sec  <<< ERROR!
java.lang.NullPointerException: null
	at org.apache.commons.codec.binary.BaseNCodec.ensureBufferSize(BaseNCodec.java:53)
	at org.apache.commons.codec.binary.Base64.decode(Base64.java:436)
	at org.apache.commons.codec.binary.BaseNCodec.decode(BaseNCodec.java:73)
	at org.apache.commons.codec.binary.BaseNCodec.decode(BaseNCodec.java:70)
	at org.apache.commons.codec.binary.Base64.decodeBase64(Base64.java:692)
	at org.apache.commons.codec.binary.Base64Test.testRfc4648Section10Decode(Base64Test.java:595)

testRfc4648Section10Encode(org.apache.commons.codec.binary.Base64Test)  Time elapsed: 0 sec  <<< ERROR!
java.lang.NullPointerException: null
	at org.apache.commons.codec.binary.BaseNCodec.ensureBufferSize(BaseNCodec.java:53)
	at org.apache.commons.codec.binary.Base64.encode(Base64.java:379)
	at org.apache.commons.codec.binary.BaseNCodec.encode(BaseNCodec.java:80)
	at org.apache.commons.codec.binary.Base64.encodeBase64(Base64.java:677)
	at org.apache.commons.codec.binary.Base64.encodeBase64(Base64.java:640)
	at org.apache.commons.codec.binary.Base64.encodeBase64(Base64.java:621)
	at org.apache.commons.codec.binary.Base64.encodeBase64String(Base64.java:569)
	at org.apache.commons.codec.binary.Base64Test.testRfc4648Section10Encode(Base64Test.java:646)

testRfc4648Section10EncodeDecode(org.apache.commons.codec.binary.Base64Test)  Time elapsed: 0 sec  <<< ERROR!
java.lang.NullPointerException: null
	at org.apache.commons.codec.binary.BaseNCodec.ensureBufferSize(BaseNCodec.java:53)
	at org.apache.commons.codec.binary.Base64.encode(Base64.java:379)
	at org.apache.commons.codec.binary.BaseNCodec.encode(BaseNCodec.java:80)
	at org.apache.commons.codec.binary.Base64.encodeBase64(Base64.java:677)
	at org.apache.commons.codec.binary.Base64.encodeBase64(Base64.java:640)
	at org.apache.commons.codec.binary.Base64.encodeBase64(Base64.java:621)
	at org.apache.commons.codec.binary.Base64.encodeBase64String(Base64.java:569)
	at org.apache.commons.codec.binary.Base64Test.testEncodeDecode(Base64Test.java:711)
	at org.apache.commons.codec.binary.Base64Test.testRfc4648Section10EncodeDecode(Base64Test.java:702)

testDecodeWithInnerPad(org.apache.commons.codec.binary.Base64Test)  Time elapsed: 0 sec  <<< ERROR!
java.lang.NullPointerException: null
	at org.apache.commons.codec.binary.BaseNCodec.ensureBufferSize(BaseNCodec.java:53)
	at org.apache.commons.codec.binary.Base64.decode(Base64.java:436)
	at org.apache.commons.codec.binary.BaseNCodec.decode(BaseNCodec.java:73)
	at org.apache.commons.codec.binary.BaseNCodec.decode(BaseNCodec.java:70)
	at org.apache.commons.codec.binary.Base64.decodeBase64(Base64.java:692)
	at org.apache.commons.codec.binary.Base64Test.testDecodeWithInnerPad(Base64Test.java:117)

Running org.apache.commons.codec.binary.HexTest
Tests run: 19, Failures: 0, Errors: 0, Skipped: 0, Time elapsed: 0.179 sec - in org.apache.commons.codec.binary.HexTest
Running org.apache.commons.codec.DecoderExceptionTest
Tests run: 4, Failures: 0, Errors: 0, Skipped: 0, Time elapsed: 0 sec - in org.apache.commons.codec.DecoderExceptionTest
Running org.apache.commons.codec.EncoderExceptionTest
Tests run: 4, Failures: 0, Errors: 0, Skipped: 0, Time elapsed: 0.001 sec - in org.apache.commons.codec.EncoderExceptionTest
Running org.apache.commons.codec.net.BCodecTest
Tests run: 9, Failures: 0, Errors: 4, Skipped: 0, Time elapsed: 0.008 sec <<< FAILURE! - in org.apache.commons.codec.net.BCodecTest
testUTF8RoundTrip(org.apache.commons.codec.net.BCodecTest)  Time elapsed: 0.002 sec  <<< ERROR!
java.lang.NullPointerException: null
	at org.apache.commons.codec.binary.BaseNCodec.ensureBufferSize(BaseNCodec.java:53)
	at org.apache.commons.codec.binary.Base64.encode(Base64.java:379)
	at org.apache.commons.codec.binary.BaseNCodec.encode(BaseNCodec.java:80)
	at org.apache.commons.codec.binary.Base64.encodeBase64(Base64.java:677)
	at org.apache.commons.codec.binary.Base64.encodeBase64(Base64.java:640)
	at org.apache.commons.codec.binary.Base64.encodeBase64(Base64.java:621)
	at org.apache.commons.codec.binary.Base64.encodeBase64(Base64.java:554)
	at org.apache.commons.codec.net.BCodec.doEncoding(BCodec.java:96)
	at org.apache.commons.codec.net.RFC1522Codec.encodeText(RFC1522Codec.java:78)
	at org.apache.commons.codec.net.BCodec.encode(BCodec.java:123)
	at org.apache.commons.codec.net.BCodec.encode(BCodec.java:162)
	at org.apache.commons.codec.net.BCodecTest.testUTF8RoundTrip(BCodecTest.java:69)

testBasicEncodeDecode(org.apache.commons.codec.net.BCodecTest)  Time elapsed: 0 sec  <<< ERROR!
java.lang.NullPointerException: null
	at org.apache.commons.codec.binary.BaseNCodec.ensureBufferSize(BaseNCodec.java:53)
	at org.apache.commons.codec.binary.Base64.encode(Base64.java:379)
	at org.apache.commons.codec.binary.BaseNCodec.encode(BaseNCodec.java:80)
	at org.apache.commons.codec.binary.Base64.encodeBase64(Base64.java:677)
	at org.apache.commons.codec.binary.Base64.encodeBase64(Base64.java:640)
	at org.apache.commons.codec.binary.Base64.encodeBase64(Base64.java:621)
	at org.apache.commons.codec.binary.Base64.encodeBase64(Base64.java:554)
	at org.apache.commons.codec.net.BCodec.doEncoding(BCodec.java:96)
	at org.apache.commons.codec.net.RFC1522Codec.encodeText(RFC1522Codec.java:78)
	at org.apache.commons.codec.net.BCodec.encode(BCodec.java:123)
	at org.apache.commons.codec.net.BCodec.encode(BCodec.java:162)
	at org.apache.commons.codec.net.BCodecTest.testBasicEncodeDecode(BCodecTest.java:80)

testDecodeObjects(org.apache.commons.codec.net.BCodecTest)  Time elapsed: 0 sec  <<< ERROR!
java.lang.NullPointerException: null
	at org.apache.commons.codec.binary.BaseNCodec.ensureBufferSize(BaseNCodec.java:53)
	at org.apache.commons.codec.binary.Base64.decode(Base64.java:436)
	at org.apache.commons.codec.binary.BaseNCodec.decode(BaseNCodec.java:73)
	at org.apache.commons.codec.binary.Base64.decodeBase64(Base64.java:706)
	at org.apache.commons.codec.net.BCodec.doDecoding(BCodec.java:104)
	at org.apache.commons.codec.net.RFC1522Codec.decodeText(RFC1522Codec.java:154)
	at org.apache.commons.codec.net.BCodec.decode(BCodec.java:181)
	at org.apache.commons.codec.net.BCodec.decode(BCodec.java:225)
	at org.apache.commons.codec.net.BCodecTest.testDecodeObjects(BCodecTest.java:137)

testEncodeObjects(org.apache.commons.codec.net.BCodecTest)  Time elapsed: 0 sec  <<< ERROR!
java.lang.NullPointerException: null
	at org.apache.commons.codec.binary.BaseNCodec.ensureBufferSize(BaseNCodec.java:53)
	at org.apache.commons.codec.binary.Base64.encode(Base64.java:379)
	at org.apache.commons.codec.binary.BaseNCodec.encode(BaseNCodec.java:80)
	at org.apache.commons.codec.binary.Base64.encodeBase64(Base64.java:677)
	at org.apache.commons.codec.binary.Base64.encodeBase64(Base64.java:640)
	at org.apache.commons.codec.binary.Base64.encodeBase64(Base64.java:621)
	at org.apache.commons.codec.binary.Base64.encodeBase64(Base64.java:554)
	at org.apache.commons.codec.net.BCodec.doEncoding(BCodec.java:96)
	at org.apache.commons.codec.net.RFC1522Codec.encodeText(RFC1522Codec.java:78)
	at org.apache.commons.codec.net.BCodec.encode(BCodec.java:123)
	at org.apache.commons.codec.net.BCodec.encode(BCodec.java:162)
	at org.apache.commons.codec.net.BCodec.encode(BCodec.java:201)
	at org.apache.commons.codec.net.BCodecTest.testEncodeObjects(BCodecTest.java:112)

Running org.apache.commons.codec.net.QCodecTest
Tests run: 12, Failures: 0, Errors: 0, Skipped: 0, Time elapsed: 0.008 sec - in org.apache.commons.codec.net.QCodecTest
Running org.apache.commons.codec.net.UtilsTest
Tests run: 1, Failures: 0, Errors: 0, Skipped: 0, Time elapsed: 0 sec - in org.apache.commons.codec.net.UtilsTest
Running org.apache.commons.codec.net.RFC1522CodecTest
Tests run: 2, Failures: 0, Errors: 0, Skipped: 0, Time elapsed: 0 sec - in org.apache.commons.codec.net.RFC1522CodecTest
Running org.apache.commons.codec.net.URLCodecTest
Tests run: 16, Failures: 0, Errors: 0, Skipped: 0, Time elapsed: 0.009 sec - in org.apache.commons.codec.net.URLCodecTest
Running org.apache.commons.codec.net.QuotedPrintableCodecTest
Tests run: 21, Failures: 0, Errors: 0, Skipped: 0, Time elapsed: 0.01 sec - in org.apache.commons.codec.net.QuotedPrintableCodecTest
Running org.apache.commons.codec.StringEncoderComparatorTest
Tests run: 3, Failures: 0, Errors: 0, Skipped: 0, Time elapsed: 0.004 sec - in org.apache.commons.codec.StringEncoderComparatorTest
Running org.apache.commons.codec.language.Caverphone1Test
Tests run: 9, Failures: 0, Errors: 0, Skipped: 0, Time elapsed: 0.03 sec - in org.apache.commons.codec.language.Caverphone1Test
Running org.apache.commons.codec.language.NysiisTest
Tests run: 23, Failures: 0, Errors: 0, Skipped: 0, Time elapsed: 0.013 sec - in org.apache.commons.codec.language.NysiisTest
Running org.apache.commons.codec.language.Caverphone2Test
Tests run: 13, Failures: 0, Errors: 0, Skipped: 0, Time elapsed: 0.139 sec - in org.apache.commons.codec.language.Caverphone2Test
Running org.apache.commons.codec.language.DaitchMokotoffSoundexTest
Tests run: 13, Failures: 0, Errors: 0, Skipped: 0, Time elapsed: 0.044 sec - in org.apache.commons.codec.language.DaitchMokotoffSoundexTest
Running org.apache.commons.codec.language.bm.BeiderMorseEncoderTest
Tests run: 22, Failures: 0, Errors: 0, Skipped: 0, Time elapsed: 3.041 sec - in org.apache.commons.codec.language.bm.BeiderMorseEncoderTest
Running org.apache.commons.codec.language.bm.PhoneticEngineTest
Tests run: 8, Failures: 0, Errors: 0, Skipped: 0, Time elapsed: 0.024 sec - in org.apache.commons.codec.language.bm.PhoneticEngineTest
Running org.apache.commons.codec.language.bm.PhoneticEngineRegressionTest
Tests run: 4, Failures: 0, Errors: 0, Skipped: 0, Time elapsed: 0.018 sec - in org.apache.commons.codec.language.bm.PhoneticEngineRegressionTest
Running org.apache.commons.codec.language.bm.RuleTest
Tests run: 3, Failures: 0, Errors: 0, Skipped: 0, Time elapsed: 0.003 sec - in org.apache.commons.codec.language.bm.RuleTest
Running org.apache.commons.codec.language.bm.LanguageGuessingTest
Tests run: 18, Failures: 0, Errors: 0, Skipped: 0, Time elapsed: 0.013 sec - in org.apache.commons.codec.language.bm.LanguageGuessingTest
Running org.apache.commons.codec.language.DoubleMetaphoneTest
Tests run: 16, Failures: 0, Errors: 0, Skipped: 0, Time elapsed: 0.057 sec - in org.apache.commons.codec.language.DoubleMetaphoneTest
Running org.apache.commons.codec.language.SoundexTest
Tests run: 28, Failures: 0, Errors: 0, Skipped: 0, Time elapsed: 0.01 sec - in org.apache.commons.codec.language.SoundexTest
Running org.apache.commons.codec.language.RefinedSoundexTest
Tests run: 10, Failures: 0, Errors: 0, Skipped: 0, Time elapsed: 0.003 sec - in org.apache.commons.codec.language.RefinedSoundexTest
Running org.apache.commons.codec.language.MatchRatingApproachEncoderTest
Tests run: 96, Failures: 0, Errors: 0, Skipped: 0, Time elapsed: 0.034 sec - in org.apache.commons.codec.language.MatchRatingApproachEncoderTest
Running org.apache.commons.codec.language.ColognePhoneticTest
Tests run: 13, Failures: 0, Errors: 0, Skipped: 0, Time elapsed: 0.004 sec - in org.apache.commons.codec.language.ColognePhoneticTest
Running org.apache.commons.codec.language.DoubleMetaphone2Test
Tests run: 6, Failures: 0, Errors: 0, Skipped: 0, Time elapsed: 0.038 sec - in org.apache.commons.codec.language.DoubleMetaphone2Test
Running org.apache.commons.codec.language.MetaphoneTest
Tests run: 34, Failures: 0, Errors: 0, Skipped: 0, Time elapsed: 0.105 sec - in org.apache.commons.codec.language.MetaphoneTest
Running org.apache.commons.codec.CharEncodingTest
Tests run: 7, Failures: 0, Errors: 0, Skipped: 0, Time elapsed: 0 sec - in org.apache.commons.codec.CharEncodingTest

Results :

Failed tests: 
  Base64Test.testNonBase64Test:480 Exception was thrown when trying to decode invalid base64 encoded data - RFC 2045 requires that all non base64 character be discarded, an exception should not have been thrown

Tests in error: 
  Base32Test.testBase32Samples:76 » NullPointer
  Base32Test.testBase32SamplesNonDefaultPadding:151 » NullPointer
  Base32Test.testRandomBytes:120 » NullPointer
  Base32Test.testRandomBytesHex:140 » NullPointer
  Base32Test.testSingleCharEncoding:102 » NullPointer
  Base32Test.testRandomBytesChunked:130 » NullPointer
  Base32Test.testBase32HexSamples:84 » NullPointer
  Base32Test.testBase32Chunked:92 » NullPointer
  Base64OutputStreamTest.testCodec98NPE:55 » NullPointer
  Base64OutputStreamTest.testWriteOutOfBounds:327 » NullPointer
  Base64OutputStreamTest.testBase64OutputStreamByteByByte:144->testByteByByte:245 » NullPointer
  Base64OutputStreamTest.testWriteToNullCoverage:346 » NullPointer
  Base64OutputStreamTest.testBase64EmptyOutputStreamMimeChunkSize:74->testBase64EmptyOutputStream:91->testByteByByte:247 » NullPointer
  Base64OutputStreamTest.testBase64EmptyOutputStreamPemChunkSize:85->testBase64EmptyOutputStream:91->testByteByByte:247 » NullPointer
  Base64OutputStreamTest.testBase64OutputStreamByChunk:106->testByChunk:194 » NullPointer
  Base64Codec13Test.testEncoder:371 » NullPointer
  Base64Codec13Test.testBinaryEncoder:409 » NullPointer
  Base64Codec13Test.testStaticEncodeChunked:482 » NullPointer
  Base64Codec13Test.testDecoder:390 » NullPointer
  Base64Codec13Test.testBinaryDecoder:428 » NullPointer
  Base64Codec13Test.testStaticDecodeChunked:501 » NullPointer
  Base64Codec13Test.testStaticDecode:464 » NullPointer
  Base64Codec13Test.testStaticEncode:446 » NullPointer
  Base64InputStreamTest.testSkipToEnd:552 » NullPointer
  Base64InputStreamTest.testSkipNone:518 » NullPointer
  Base64InputStreamTest.testCodec98NPE:151 » NullPointer
  Base64InputStreamTest.testBase64InputStreamByChunk:216->testByChunk:304 » NullPointer
  Base64InputStreamTest.testInputStreamReader:133 » NullPointer
  Base64InputStreamTest.testCodec101:103 » NullPointer
  Base64InputStreamTest.testCodec105:84 » NullPointer
  Base64InputStreamTest.testCodec130:62 » NullPointer
  Base64InputStreamTest.testAvailable:167 » NullPointer
  Base64InputStreamTest.testBase64EmptyInputStreamPemChuckSize:195->testBase64EmptyInputStream:201->testByteByByte:362 » NullPointer
  Base64InputStreamTest.testBase64EmptyInputStreamMimeChuckSize:184->testBase64EmptyInputStream:201->testByteByByte:362 » NullPointer
  Base64InputStreamTest.testSkipPastEnd:535 » NullPointer
  Base64InputStreamTest.testSkipBig:500 » NullPointer
  Base64InputStreamTest.testBase64InputStreamByteByByte:254->testByteByByte:359 » NullPointer
  Base32InputStreamTest.testBase32InputStreamByteByByte:245->testByteByByte:345 » NullPointer
  Base32InputStreamTest.testSkipToEnd:538 » NullPointer
  Base32InputStreamTest.testSkipNone:488 » NullPointer
  Base32InputStreamTest.testBase32EmptyInputStreamPemChuckSize:185->testBase32EmptyInputStream:191->testByteByByte:348 » NullPointer
  Base32InputStreamTest.testCodec105:74 » NullPointer
  Base32InputStreamTest.testCodec130:52 » NullPointer
  Base32InputStreamTest.testAvailable:157 » NullPointer
  Base32InputStreamTest.testBase32EmptyInputStreamMimeChuckSize:174->testBase32EmptyInputStream:191->testByteByByte:348 » NullPointer
  Base32InputStreamTest.testSkipPastEnd:521 » NullPointer
  Base32InputStreamTest.testSkipBig:504 » NullPointer
  Base32InputStreamTest.testBase32InputStreamByChunk:206->testByChunk:292 » NullPointer
  Base32OutputStreamTest.testBase32EmptyOutputStreamPemChunkSize:80->testBase32EmptyOutputStream:86->testByteByByte:236 » NullPointer
  Base32OutputStreamTest.testBase32EmptyOutputStreamMimeChunkSize:69->testBase32EmptyOutputStream:86->testByteByByte:236 » NullPointer
  Base32OutputStreamTest.testBase32OutputStreamByChunk:101->testByChunk:183 » NullPointer
  Base32OutputStreamTest.testBase32OutputStreamByteByByte:136->testByteByByte:234 » NullPointer
  Base64Test.testTriplets:940 » NullPointer
  Base64Test.testStringToByteVariations:1218 » NullPointer
  Base64Test.testConstructor_Int_ByteArray_Boolean_UrlSafe:257 » NullPointer
  Base64Test.testSingletonsChunked:831 » NullPointer
  Base64Test.testKnownDecodings:431 » NullPointer
  Base64Test.testPairs:547 » NullPointer
  Base64Test.testUUID:1147 » NullPointer
  Base64Test.testEncodeDecodeSmall:362 » NullPointer
  Base64Test.testObjectDecodeWithValidParameter:504 » NullPointer
  Base64Test.testCodeInteger1:149 » NullPointer
  Base64Test.testCodeInteger2:158 » NullPointer
  Base64Test.testCodeInteger3:169 » NullPointer
  Base64Test.testCodeInteger4:186 » NullPointer
  Base64Test.testObjectEncode:542 » NullPointer
  Base64Test.testUrlSafe:1081 » NullPointer
  Base64Test.testEncodeDecodeRandom:349 » NullPointer
  Base64Test.testDecodeWithWhitespace:311 » NullPointer
  Base64Test.testDecodePadOnlyChunked:297 » NullPointer
  Base64Test.testKnownEncodings:446 » NullPointer
  Base64Test.testIgnoringNonBase64InDecode:395 » NullPointer
  Base64Test.testCodec112:380 » NullPointer
  Base64Test.testDecodePadMarkerIndex2:272 » NullPointer
  Base64Test.testDecodePadMarkerIndex3:280 » NullPointer
  Base64Test.testSingletons:718 » NullPointer
  Base64Test.testTripletsChunked:1008 » NullPointer
  Base64Test.testCodec68:141 » NullPointer
  Base64Test.testRfc4648Section10DecodeEncode:671->testDecodeEncode:680 » NullPointer
  Base64Test.testDecodePadOnly:286 » NullPointer
  Base64Test.testChunkedEncodeMultipleOf76:127 » NullPointer
  Base64Test.testBase64:82 » NullPointer
  Base64Test.testConstructor_Int_ByteArray_Boolean:246 » NullPointer
  Base64Test.testByteToStringVariations:1197 » NullPointer
  Base64Test.testObjectEncodeWithValidParameter:532 » NullPointer
  Base64Test.testRfc4648Section10DecodeWithCrLf:620 » NullPointer
  Base64Test.testRfc4648Section10Decode:595 » NullPointer
  Base64Test.testRfc4648Section10Encode:646 » NullPointer
  Base64Test.testRfc4648Section10EncodeDecode:702->testEncodeDecode:711 » NullPointer
  Base64Test.testDecodeWithInnerPad:117 » NullPointer
  BCodecTest.testUTF8RoundTrip:69 » NullPointer
  BCodecTest.testBasicEncodeDecode:80 » NullPointer
  BCodecTest.testDecodeObjects:137 » NullPointer
  BCodecTest.testEncodeObjects:112 » NullPointer

Tests run: 662, Failures: 1, Errors: 94, Skipped: 1

[INFO] ------------------------------------------------------------------------
[INFO] BUILD FAILURE
[INFO] ------------------------------------------------------------------------
[INFO] Total time: 13.304s
[INFO] Finished at: Sun Aug 02 07:21:52 BST 2015
[INFO] Final Memory: 20M/287M
[INFO] ------------------------------------------------------------------------
[ERROR] Failed to execute goal org.apache.maven.plugins:maven-surefire-plugin:2.17:test (default-test) on project commons-codec: There are test failures.
[ERROR] 
[ERROR] Please refer to /home/perham/Study/LittleDarwin/Cases/commons-codec-1.10-src/target/surefire-reports for the individual test results.
[ERROR] -> [Help 1]
[ERROR] 
[ERROR] To see the full stack trace of the errors, re-run Maven with the -e switch.
[ERROR] Re-run Maven using the -X switch to enable full debug logging.
[ERROR] 
[ERROR] For more information about the errors and possible solutions, please read the following articles:
[ERROR] [Help 1] http://cwiki.apache.org/confluence/display/MAVEN/MojoFailureException
