[INFO] Scanning for projects...
[INFO]                                                                         
[INFO] ------------------------------------------------------------------------
[INFO] Building Apache Commons Codec 1.10
[INFO] ------------------------------------------------------------------------
[INFO] 
[INFO] --- maven-enforcer-plugin:1.3.1:enforce (enforce-maven-3) @ commons-codec ---
[INFO] 
[INFO] --- maven-antrun-plugin:1.7:run (javadoc.resources) @ commons-codec ---
[INFO] Executing tasks

main:
[INFO] Executed tasks
[INFO] 
[INFO] --- maven-remote-resources-plugin:1.5:process (default) @ commons-codec ---
[INFO] 
[INFO] --- buildnumber-maven-plugin:1.3:create (default) @ commons-codec ---
[INFO] Executing: /bin/sh -c cd /home/perham/Study/LittleDarwin/Cases/commons-codec-1.10-src && svn --non-interactive info
[INFO] Working directory: /home/perham/Study/LittleDarwin/Cases/commons-codec-1.10-src
[INFO] Storing buildNumber: ?????? at timestamp: 1438496457257
[INFO] Executing: /bin/sh -c cd /home/perham/Study/LittleDarwin/Cases/commons-codec-1.10-src && svn --non-interactive info
[INFO] Working directory: /home/perham/Study/LittleDarwin/Cases/commons-codec-1.10-src
[INFO] Storing buildScmBranch: UNKNOWN_BRANCH
[INFO] 
[INFO] --- maven-resources-plugin:2.7:resources (default-resources) @ commons-codec ---
[INFO] Using 'UTF-8' encoding to copy filtered resources.
[INFO] Copying 128 resources
[INFO] Copying 2 resources to META-INF
[INFO] 
[INFO] --- maven-compiler-plugin:3.2:compile (default-compile) @ commons-codec ---
[INFO] Changes detected - recompiling the module!
[INFO] Compiling 60 source files to /home/perham/Study/LittleDarwin/Cases/commons-codec-1.10-src/target/classes
[INFO] /home/perham/Study/LittleDarwin/Cases/commons-codec-1.10-src/src/main/java/org/apache/commons/codec/digest/Sha2Crypt.java: Some input files use or override a deprecated API.
[INFO] /home/perham/Study/LittleDarwin/Cases/commons-codec-1.10-src/src/main/java/org/apache/commons/codec/digest/Sha2Crypt.java: Recompile with -Xlint:deprecation for details.
[INFO] 
[INFO] --- maven-bundle-plugin:2.5.3:manifest (bundle-manifest) @ commons-codec ---
[INFO] 
[INFO] --- maven-resources-plugin:2.7:testResources (default-testResources) @ commons-codec ---
[INFO] Using 'UTF-8' encoding to copy filtered resources.
[INFO] skip non existing resourceDirectory /home/perham/Study/LittleDarwin/Cases/commons-codec-1.10-src/src/test/resources
[INFO] Copying 2 resources to META-INF
[INFO] 
[INFO] --- maven-compiler-plugin:3.2:testCompile (default-testCompile) @ commons-codec ---
[INFO] Nothing to compile - all classes are up to date
[INFO] 
[INFO] --- maven-surefire-plugin:2.17:test (default-test) @ commons-codec ---
[INFO] Surefire report directory: /home/perham/Study/LittleDarwin/Cases/commons-codec-1.10-src/target/surefire-reports

-------------------------------------------------------
 T E S T S
-------------------------------------------------------
Running org.apache.commons.codec.digest.B64Test
Tests run: 2, Failures: 0, Errors: 0, Skipped: 0, Time elapsed: 0.029 sec - in org.apache.commons.codec.digest.B64Test
Running org.apache.commons.codec.digest.DigestUtilsTest
Tests run: 17, Failures: 0, Errors: 0, Skipped: 0, Time elapsed: 0.668 sec - in org.apache.commons.codec.digest.DigestUtilsTest
Running org.apache.commons.codec.digest.Sha512CryptTest
Tests run: 8, Failures: 0, Errors: 0, Skipped: 0, Time elapsed: 0.513 sec - in org.apache.commons.codec.digest.Sha512CryptTest
Running org.apache.commons.codec.digest.Apr1CryptTest
Tests run: 8, Failures: 0, Errors: 0, Skipped: 0, Time elapsed: 0.083 sec - in org.apache.commons.codec.digest.Apr1CryptTest
Running org.apache.commons.codec.digest.HmacUtilsTest
Tests run: 24, Failures: 0, Errors: 0, Skipped: 0, Time elapsed: 0.048 sec - in org.apache.commons.codec.digest.HmacUtilsTest
Running org.apache.commons.codec.digest.Sha2CryptTest
Tests run: 1, Failures: 0, Errors: 0, Skipped: 0, Time elapsed: 0 sec - in org.apache.commons.codec.digest.Sha2CryptTest
Running org.apache.commons.codec.digest.CryptTest
Tests run: 4, Failures: 0, Errors: 0, Skipped: 0, Time elapsed: 0.093 sec - in org.apache.commons.codec.digest.CryptTest
Running org.apache.commons.codec.digest.Sha256CryptTest
Tests run: 7, Failures: 0, Errors: 0, Skipped: 0, Time elapsed: 0.118 sec - in org.apache.commons.codec.digest.Sha256CryptTest
Running org.apache.commons.codec.digest.Md5CryptTest
Tests run: 7, Failures: 0, Errors: 0, Skipped: 0, Time elapsed: 0.02 sec - in org.apache.commons.codec.digest.Md5CryptTest
Running org.apache.commons.codec.digest.UnixCryptTest
Tests run: 9, Failures: 0, Errors: 0, Skipped: 0, Time elapsed: 0.006 sec - in org.apache.commons.codec.digest.UnixCryptTest
Running org.apache.commons.codec.CharsetsTest
Tests run: 7, Failures: 0, Errors: 0, Skipped: 0, Time elapsed: 0.001 sec - in org.apache.commons.codec.CharsetsTest
Running org.apache.commons.codec.binary.Base32Test
Tests run: 8, Failures: 0, Errors: 4, Skipped: 0, Time elapsed: 5.917 sec <<< FAILURE! - in org.apache.commons.codec.binary.Base32Test
testRandomBytes(org.apache.commons.codec.binary.Base32Test)  Time elapsed: 1.219 sec  <<< ERROR!
java.lang.OutOfMemoryError: Java heap space
	at org.apache.commons.codec.binary.BaseNCodec.resizeBuffer(BaseNCodec.java:49)
	at org.apache.commons.codec.binary.BaseNCodec.ensureBufferSize(BaseNCodec.java:53)
	at org.apache.commons.codec.binary.Base32.encode(Base32.java:445)
	at org.apache.commons.codec.binary.BaseNCodec.encode(BaseNCodec.java:81)
	at org.apache.commons.codec.binary.Base32TestData.randomData(Base32TestData.java:106)
	at org.apache.commons.codec.binary.Base32Test.testRandomBytes(Base32Test.java:120)

testRandomBytesHex(org.apache.commons.codec.binary.Base32Test)  Time elapsed: 1.845 sec  <<< ERROR!
java.lang.OutOfMemoryError: Java heap space
	at org.apache.commons.codec.binary.BaseNCodec.resizeBuffer(BaseNCodec.java:49)
	at org.apache.commons.codec.binary.BaseNCodec.ensureBufferSize(BaseNCodec.java:53)
	at org.apache.commons.codec.binary.Base32.encode(Base32.java:501)
	at org.apache.commons.codec.binary.BaseNCodec.encode(BaseNCodec.java:80)
	at org.apache.commons.codec.binary.Base32TestData.randomData(Base32TestData.java:106)
	at org.apache.commons.codec.binary.Base32Test.testRandomBytesHex(Base32Test.java:140)

testSingleCharEncoding(org.apache.commons.codec.binary.Base32Test)  Time elapsed: 1.68 sec  <<< ERROR!
java.lang.OutOfMemoryError: Java heap space
	at org.apache.commons.codec.binary.BaseNCodec.resizeBuffer(BaseNCodec.java:49)
	at org.apache.commons.codec.binary.BaseNCodec.ensureBufferSize(BaseNCodec.java:53)
	at org.apache.commons.codec.binary.Base32.encode(Base32.java:445)
	at org.apache.commons.codec.binary.BaseNCodec.encode(BaseNCodec.java:81)
	at org.apache.commons.codec.binary.Base32Test.testSingleCharEncoding(Base32Test.java:102)

testRandomBytesChunked(org.apache.commons.codec.binary.Base32Test)  Time elapsed: 1.169 sec  <<< ERROR!
java.lang.OutOfMemoryError: Java heap space
	at org.apache.commons.codec.binary.BaseNCodec.resizeBuffer(BaseNCodec.java:49)
	at org.apache.commons.codec.binary.BaseNCodec.ensureBufferSize(BaseNCodec.java:53)
	at org.apache.commons.codec.binary.Base32.encode(Base32.java:445)
	at org.apache.commons.codec.binary.BaseNCodec.encode(BaseNCodec.java:81)
	at org.apache.commons.codec.binary.Base32TestData.randomData(Base32TestData.java:106)
	at org.apache.commons.codec.binary.Base32Test.testRandomBytesChunked(Base32Test.java:130)

Running org.apache.commons.codec.binary.Base64OutputStreamTest
Tests run: 7, Failures: 0, Errors: 3, Skipped: 0, Time elapsed: 2.286 sec <<< FAILURE! - in org.apache.commons.codec.binary.Base64OutputStreamTest
testCodec98NPE(org.apache.commons.codec.binary.Base64OutputStreamTest)  Time elapsed: 0.506 sec  <<< ERROR!
java.lang.OutOfMemoryError: Java heap space

testBase64OutputStreamByteByByte(org.apache.commons.codec.binary.Base64OutputStreamTest)  Time elapsed: 1.04 sec  <<< ERROR!
java.lang.OutOfMemoryError: Java heap space

testBase64OutputStreamByChunk(org.apache.commons.codec.binary.Base64OutputStreamTest)  Time elapsed: 0.738 sec  <<< ERROR!
java.lang.OutOfMemoryError: Java heap space

Running org.apache.commons.codec.binary.Base64Codec13Test
Tests run: 8, Failures: 0, Errors: 8, Skipped: 0, Time elapsed: 7.024 sec <<< FAILURE! - in org.apache.commons.codec.binary.Base64Codec13Test
testEncoder(org.apache.commons.codec.binary.Base64Codec13Test)  Time elapsed: 0.806 sec  <<< ERROR!
java.lang.OutOfMemoryError: Java heap space

testBinaryEncoder(org.apache.commons.codec.binary.Base64Codec13Test)  Time elapsed: 0.81 sec  <<< ERROR!
java.lang.NegativeArraySizeException: null
	at org.apache.commons.codec.binary.BaseNCodec.resizeBuffer(BaseNCodec.java:49)
	at org.apache.commons.codec.binary.BaseNCodec.ensureBufferSize(BaseNCodec.java:53)
	at org.apache.commons.codec.binary.Base64.encode(Base64.java:379)
	at org.apache.commons.codec.binary.BaseNCodec.encode(BaseNCodec.java:80)
	at org.apache.commons.codec.binary.Base64Codec13Test.testBinaryEncoder(Base64Codec13Test.java:409)

testStaticEncodeChunked(org.apache.commons.codec.binary.Base64Codec13Test)  Time elapsed: 0.896 sec  <<< ERROR!
java.lang.OutOfMemoryError: Java heap space

testDecoder(org.apache.commons.codec.binary.Base64Codec13Test)  Time elapsed: 0.928 sec  <<< ERROR!
java.lang.OutOfMemoryError: Java heap space

testBinaryDecoder(org.apache.commons.codec.binary.Base64Codec13Test)  Time elapsed: 0.921 sec  <<< ERROR!
java.lang.OutOfMemoryError: Java heap space

testStaticDecodeChunked(org.apache.commons.codec.binary.Base64Codec13Test)  Time elapsed: 0.94 sec  <<< ERROR!
java.lang.OutOfMemoryError: Java heap space

testStaticDecode(org.apache.commons.codec.binary.Base64Codec13Test)  Time elapsed: 0.914 sec  <<< ERROR!
java.lang.OutOfMemoryError: Java heap space

testStaticEncode(org.apache.commons.codec.binary.Base64Codec13Test)  Time elapsed: 0.805 sec  <<< ERROR!
java.lang.OutOfMemoryError: Java heap space

Running org.apache.commons.codec.binary.Base64InputStreamTest
Tests run: 19, Failures: 0, Errors: 3, Skipped: 0, Time elapsed: 2.106 sec <<< FAILURE! - in org.apache.commons.codec.binary.Base64InputStreamTest
testCodec98NPE(org.apache.commons.codec.binary.Base64InputStreamTest)  Time elapsed: 0.423 sec  <<< ERROR!
java.lang.OutOfMemoryError: Java heap space

testBase64InputStreamByChunk(org.apache.commons.codec.binary.Base64InputStreamTest)  Time elapsed: 0.737 sec  <<< ERROR!
java.lang.OutOfMemoryError: Java heap space

testBase64InputStreamByteByByte(org.apache.commons.codec.binary.Base64InputStreamTest)  Time elapsed: 0.723 sec  <<< ERROR!
java.lang.OutOfMemoryError: Java heap space

Running org.apache.commons.codec.binary.Base32InputStreamTest
Tests run: 16, Failures: 0, Errors: 3, Skipped: 0, Time elapsed: 1.172 sec <<< FAILURE! - in org.apache.commons.codec.binary.Base32InputStreamTest
testBase32InputStreamByteByByte(org.apache.commons.codec.binary.Base32InputStreamTest)  Time elapsed: 0.409 sec  <<< ERROR!
java.lang.OutOfMemoryError: Java heap space

testCodec130(org.apache.commons.codec.binary.Base32InputStreamTest)  Time elapsed: 0.408 sec  <<< ERROR!
java.lang.OutOfMemoryError: Java heap space

testBase32InputStreamByChunk(org.apache.commons.codec.binary.Base32InputStreamTest)  Time elapsed: 0.345 sec  <<< ERROR!
java.lang.OutOfMemoryError: Java heap space

Running org.apache.commons.codec.binary.Base32OutputStreamTest
Tests run: 6, Failures: 0, Errors: 2, Skipped: 0, Time elapsed: 1.435 sec <<< FAILURE! - in org.apache.commons.codec.binary.Base32OutputStreamTest
testBase32OutputStreamByChunk(org.apache.commons.codec.binary.Base32OutputStreamTest)  Time elapsed: 0.408 sec  <<< ERROR!
java.lang.OutOfMemoryError: Java heap space

testBase32OutputStreamByteByByte(org.apache.commons.codec.binary.Base32OutputStreamTest)  Time elapsed: 1.023 sec  <<< ERROR!
java.lang.OutOfMemoryError: Java heap space

Running org.apache.commons.codec.binary.BinaryCodecTest
Tests run: 13, Failures: 0, Errors: 0, Skipped: 0, Time elapsed: 0.012 sec - in org.apache.commons.codec.binary.BinaryCodecTest
Running org.apache.commons.codec.binary.BaseNCodecTest
Tests run: 7, Failures: 0, Errors: 0, Skipped: 0, Time elapsed: 0.002 sec - in org.apache.commons.codec.binary.BaseNCodecTest
Running org.apache.commons.codec.binary.StringUtilsTest
Tests run: 17, Failures: 0, Errors: 0, Skipped: 0, Time elapsed: 0.025 sec - in org.apache.commons.codec.binary.StringUtilsTest
Running org.apache.commons.codec.binary.Base64Test
Tests run: 53, Failures: 0, Errors: 16, Skipped: 1, Time elapsed: 9.064 sec <<< FAILURE! - in org.apache.commons.codec.binary.Base64Test
testStringToByteVariations(org.apache.commons.codec.binary.Base64Test)  Time elapsed: 1.05 sec  <<< ERROR!
java.lang.OutOfMemoryError: Java heap space

testConstructor_Int_ByteArray_Boolean_UrlSafe(org.apache.commons.codec.binary.Base64Test)  Time elapsed: 0.423 sec  <<< ERROR!
java.lang.OutOfMemoryError: Java heap space

testKnownDecodings(org.apache.commons.codec.binary.Base64Test)  Time elapsed: 0.344 sec  <<< ERROR!
java.lang.OutOfMemoryError: Java heap space

testUUID(org.apache.commons.codec.binary.Base64Test)  Time elapsed: 0.807 sec  <<< ERROR!
java.lang.OutOfMemoryError: Java heap space

testCodeInteger1(org.apache.commons.codec.binary.Base64Test)  Time elapsed: 0.395 sec  <<< ERROR!
java.lang.OutOfMemoryError: Java heap space

testCodeInteger2(org.apache.commons.codec.binary.Base64Test)  Time elapsed: 0.354 sec  <<< ERROR!
java.lang.OutOfMemoryError: Java heap space

testCodeInteger3(org.apache.commons.codec.binary.Base64Test)  Time elapsed: 0.363 sec  <<< ERROR!
java.lang.OutOfMemoryError: Java heap space

testCodeInteger4(org.apache.commons.codec.binary.Base64Test)  Time elapsed: 0.37 sec  <<< ERROR!
java.lang.OutOfMemoryError: Java heap space

testUrlSafe(org.apache.commons.codec.binary.Base64Test)  Time elapsed: 0.712 sec  <<< ERROR!
java.lang.OutOfMemoryError: Java heap space

testEncodeDecodeRandom(org.apache.commons.codec.binary.Base64Test)  Time elapsed: 0.347 sec  <<< ERROR!
java.lang.OutOfMemoryError: Java heap space

testDecodeWithWhitespace(org.apache.commons.codec.binary.Base64Test)  Time elapsed: 0.341 sec  <<< ERROR!
java.lang.OutOfMemoryError: Java heap space

testKnownEncodings(org.apache.commons.codec.binary.Base64Test)  Time elapsed: 0.348 sec  <<< ERROR!
java.lang.OutOfMemoryError: Java heap space

testIgnoringNonBase64InDecode(org.apache.commons.codec.binary.Base64Test)  Time elapsed: 0.36 sec  <<< ERROR!
java.lang.OutOfMemoryError: Java heap space

testChunkedEncodeMultipleOf76(org.apache.commons.codec.binary.Base64Test)  Time elapsed: 0.353 sec  <<< ERROR!
java.lang.OutOfMemoryError: Java heap space

testBase64(org.apache.commons.codec.binary.Base64Test)  Time elapsed: 0.378 sec  <<< ERROR!
java.lang.OutOfMemoryError: Java heap space

testConstructor_Int_ByteArray_Boolean(org.apache.commons.codec.binary.Base64Test)  Time elapsed: 0.359 sec  <<< ERROR!
java.lang.OutOfMemoryError: Java heap space

Running org.apache.commons.codec.binary.HexTest
Tests run: 19, Failures: 0, Errors: 0, Skipped: 0, Time elapsed: 0.196 sec - in org.apache.commons.codec.binary.HexTest
Running org.apache.commons.codec.DecoderExceptionTest
Tests run: 4, Failures: 0, Errors: 0, Skipped: 0, Time elapsed: 0 sec - in org.apache.commons.codec.DecoderExceptionTest
Running org.apache.commons.codec.EncoderExceptionTest
Tests run: 4, Failures: 0, Errors: 0, Skipped: 0, Time elapsed: 0.001 sec - in org.apache.commons.codec.EncoderExceptionTest
Running org.apache.commons.codec.net.BCodecTest
Tests run: 9, Failures: 0, Errors: 1, Skipped: 0, Time elapsed: 0.665 sec <<< FAILURE! - in org.apache.commons.codec.net.BCodecTest
testUTF8RoundTrip(org.apache.commons.codec.net.BCodecTest)  Time elapsed: 0.443 sec  <<< ERROR!
java.lang.OutOfMemoryError: Java heap space

Running org.apache.commons.codec.net.QCodecTest
Tests run: 12, Failures: 0, Errors: 0, Skipped: 0, Time elapsed: 0.006 sec - in org.apache.commons.codec.net.QCodecTest
Running org.apache.commons.codec.net.UtilsTest
Tests run: 1, Failures: 0, Errors: 0, Skipped: 0, Time elapsed: 0 sec - in org.apache.commons.codec.net.UtilsTest
Running org.apache.commons.codec.net.RFC1522CodecTest
Tests run: 2, Failures: 0, Errors: 0, Skipped: 0, Time elapsed: 0 sec - in org.apache.commons.codec.net.RFC1522CodecTest
Running org.apache.commons.codec.net.URLCodecTest
Tests run: 16, Failures: 0, Errors: 0, Skipped: 0, Time elapsed: 0.01 sec - in org.apache.commons.codec.net.URLCodecTest
Running org.apache.commons.codec.net.QuotedPrintableCodecTest
Tests run: 21, Failures: 0, Errors: 0, Skipped: 0, Time elapsed: 0.015 sec - in org.apache.commons.codec.net.QuotedPrintableCodecTest
Running org.apache.commons.codec.StringEncoderComparatorTest
Tests run: 3, Failures: 0, Errors: 0, Skipped: 0, Time elapsed: 0.004 sec - in org.apache.commons.codec.StringEncoderComparatorTest
Running org.apache.commons.codec.language.Caverphone1Test
Tests run: 9, Failures: 0, Errors: 0, Skipped: 0, Time elapsed: 0.025 sec - in org.apache.commons.codec.language.Caverphone1Test
Running org.apache.commons.codec.language.NysiisTest
Tests run: 23, Failures: 0, Errors: 0, Skipped: 0, Time elapsed: 0.021 sec - in org.apache.commons.codec.language.NysiisTest
Running org.apache.commons.codec.language.Caverphone2Test
Tests run: 13, Failures: 0, Errors: 0, Skipped: 0, Time elapsed: 0.14 sec - in org.apache.commons.codec.language.Caverphone2Test
Running org.apache.commons.codec.language.DaitchMokotoffSoundexTest
Tests run: 13, Failures: 0, Errors: 0, Skipped: 0, Time elapsed: 0.043 sec - in org.apache.commons.codec.language.DaitchMokotoffSoundexTest
Running org.apache.commons.codec.language.bm.BeiderMorseEncoderTest
Tests run: 22, Failures: 0, Errors: 0, Skipped: 0, Time elapsed: 3.006 sec - in org.apache.commons.codec.language.bm.BeiderMorseEncoderTest
Running org.apache.commons.codec.language.bm.PhoneticEngineTest
Tests run: 8, Failures: 0, Errors: 0, Skipped: 0, Time elapsed: 0.015 sec - in org.apache.commons.codec.language.bm.PhoneticEngineTest
Running org.apache.commons.codec.language.bm.PhoneticEngineRegressionTest
Tests run: 4, Failures: 0, Errors: 0, Skipped: 0, Time elapsed: 0.01 sec - in org.apache.commons.codec.language.bm.PhoneticEngineRegressionTest
Running org.apache.commons.codec.language.bm.RuleTest
Tests run: 3, Failures: 0, Errors: 0, Skipped: 0, Time elapsed: 0.004 sec - in org.apache.commons.codec.language.bm.RuleTest
Running org.apache.commons.codec.language.bm.LanguageGuessingTest
Tests run: 18, Failures: 0, Errors: 0, Skipped: 0, Time elapsed: 0.015 sec - in org.apache.commons.codec.language.bm.LanguageGuessingTest
Running org.apache.commons.codec.language.DoubleMetaphoneTest
Tests run: 16, Failures: 0, Errors: 0, Skipped: 0, Time elapsed: 0.058 sec - in org.apache.commons.codec.language.DoubleMetaphoneTest
Running org.apache.commons.codec.language.SoundexTest
Tests run: 28, Failures: 0, Errors: 0, Skipped: 0, Time elapsed: 0.011 sec - in org.apache.commons.codec.language.SoundexTest
Running org.apache.commons.codec.language.RefinedSoundexTest
Tests run: 10, Failures: 0, Errors: 0, Skipped: 0, Time elapsed: 0.003 sec - in org.apache.commons.codec.language.RefinedSoundexTest
Running org.apache.commons.codec.language.MatchRatingApproachEncoderTest
Tests run: 96, Failures: 0, Errors: 0, Skipped: 0, Time elapsed: 0.038 sec - in org.apache.commons.codec.language.MatchRatingApproachEncoderTest
Running org.apache.commons.codec.language.ColognePhoneticTest
Tests run: 13, Failures: 0, Errors: 0, Skipped: 0, Time elapsed: 0.003 sec - in org.apache.commons.codec.language.ColognePhoneticTest
Running org.apache.commons.codec.language.DoubleMetaphone2Test
Tests run: 6, Failures: 0, Errors: 0, Skipped: 0, Time elapsed: 0.038 sec - in org.apache.commons.codec.language.DoubleMetaphone2Test
Running org.apache.commons.codec.language.MetaphoneTest
Tests run: 34, Failures: 0, Errors: 0, Skipped: 0, Time elapsed: 0.103 sec - in org.apache.commons.codec.language.MetaphoneTest
Running org.apache.commons.codec.CharEncodingTest
Tests run: 7, Failures: 0, Errors: 0, Skipped: 0, Time elapsed: 0 sec - in org.apache.commons.codec.CharEncodingTest

Results :

Tests in error: 
  Base32Test.testRandomBytes:120 » OutOfMemory Java heap space
  Base32Test.testRandomBytesHex:140 » OutOfMemory Java heap space
  Base32Test.testSingleCharEncoding:102 » OutOfMemory Java heap space
  Base32Test.testRandomBytesChunked:130 » OutOfMemory Java heap space
  Base64OutputStreamTest.testCodec98NPE » OutOfMemory Java heap space
  Base64OutputStreamTest.testBase64OutputStreamByteByByte » OutOfMemory Java hea...
  Base64OutputStreamTest.testBase64OutputStreamByChunk » OutOfMemory Java heap s...
  Base64Codec13Test.testEncoder » OutOfMemory Java heap space
  Base64Codec13Test.testBinaryEncoder:409 » NegativeArraySize
  Base64Codec13Test.testStaticEncodeChunked » OutOfMemory Java heap space
  Base64Codec13Test.testDecoder » OutOfMemory Java heap space
  Base64Codec13Test.testBinaryDecoder » OutOfMemory Java heap space
  Base64Codec13Test.testStaticDecodeChunked » OutOfMemory Java heap space
  Base64Codec13Test.testStaticDecode » OutOfMemory Java heap space
  Base64Codec13Test.testStaticEncode » OutOfMemory Java heap space
  Base64InputStreamTest.testCodec98NPE » OutOfMemory Java heap space
  Base64InputStreamTest.testBase64InputStreamByChunk » OutOfMemory Java heap spa...
  Base64InputStreamTest.testBase64InputStreamByteByByte » OutOfMemory Java heap ...
  Base32InputStreamTest.testBase32InputStreamByteByByte » OutOfMemory Java heap ...
  Base32InputStreamTest.testCodec130 » OutOfMemory Java heap space
  Base32InputStreamTest.testBase32InputStreamByChunk » OutOfMemory Java heap spa...
  Base32OutputStreamTest.testBase32OutputStreamByChunk » OutOfMemory Java heap s...
  Base32OutputStreamTest.testBase32OutputStreamByteByByte » OutOfMemory Java hea...
  Base64Test.testStringToByteVariations » OutOfMemory Java heap space
  Base64Test.testConstructor_Int_ByteArray_Boolean_UrlSafe » OutOfMemory Java he...
  Base64Test.testKnownDecodings » OutOfMemory Java heap space
  Base64Test.testUUID » OutOfMemory Java heap space
  Base64Test.testCodeInteger1 » OutOfMemory Java heap space
  Base64Test.testCodeInteger2 » OutOfMemory Java heap space
  Base64Test.testCodeInteger3 » OutOfMemory Java heap space
  Base64Test.testCodeInteger4 » OutOfMemory Java heap space
  Base64Test.testUrlSafe » OutOfMemory Java heap space
  Base64Test.testEncodeDecodeRandom » OutOfMemory Java heap space
  Base64Test.testDecodeWithWhitespace » OutOfMemory Java heap space
  Base64Test.testKnownEncodings » OutOfMemory Java heap space
  Base64Test.testIgnoringNonBase64InDecode » OutOfMemory Java heap space
  Base64Test.testChunkedEncodeMultipleOf76 » OutOfMemory Java heap space
  Base64Test.testBase64 » OutOfMemory Java heap space
  Base64Test.testConstructor_Int_ByteArray_Boolean » OutOfMemory Java heap space
  BCodecTest.testUTF8RoundTrip » OutOfMemory Java heap space

Tests run: 662, Failures: 0, Errors: 40, Skipped: 1

[INFO] ------------------------------------------------------------------------
[INFO] BUILD FAILURE
[INFO] ------------------------------------------------------------------------
[INFO] Total time: 43.282s
[INFO] Finished at: Sun Aug 02 07:21:37 BST 2015
[INFO] Final Memory: 20M/287M
[INFO] ------------------------------------------------------------------------
[ERROR] Failed to execute goal org.apache.maven.plugins:maven-surefire-plugin:2.17:test (default-test) on project commons-codec: There are test failures.
[ERROR] 
[ERROR] Please refer to /home/perham/Study/LittleDarwin/Cases/commons-codec-1.10-src/target/surefire-reports for the individual test results.
[ERROR] -> [Help 1]
[ERROR] 
[ERROR] To see the full stack trace of the errors, re-run Maven with the -e switch.
[ERROR] Re-run Maven using the -X switch to enable full debug logging.
[ERROR] 
[ERROR] For more information about the errors and possible solutions, please read the following articles:
[ERROR] [Help 1] http://cwiki.apache.org/confluence/display/MAVEN/MojoFailureException
