[INFO] Scanning for projects...
[INFO]                                                                         
[INFO] ------------------------------------------------------------------------
[INFO] Building Apache Commons Codec 1.10
[INFO] ------------------------------------------------------------------------
[INFO] 
[INFO] --- maven-enforcer-plugin:1.3.1:enforce (enforce-maven-3) @ commons-codec ---
[INFO] 
[INFO] --- maven-antrun-plugin:1.7:run (javadoc.resources) @ commons-codec ---
[INFO] Executing tasks

main:
[INFO] Executed tasks
[INFO] 
[INFO] --- maven-remote-resources-plugin:1.5:process (default) @ commons-codec ---
[INFO] 
[INFO] --- buildnumber-maven-plugin:1.3:create (default) @ commons-codec ---
[INFO] Executing: /bin/sh -c cd /home/perham/Study/LittleDarwin/Cases/commons-codec-1.10-src && svn --non-interactive info
[INFO] Working directory: /home/perham/Study/LittleDarwin/Cases/commons-codec-1.10-src
[INFO] Storing buildNumber: ?????? at timestamp: 1438496194770
[INFO] Executing: /bin/sh -c cd /home/perham/Study/LittleDarwin/Cases/commons-codec-1.10-src && svn --non-interactive info
[INFO] Working directory: /home/perham/Study/LittleDarwin/Cases/commons-codec-1.10-src
[INFO] Storing buildScmBranch: UNKNOWN_BRANCH
[INFO] 
[INFO] --- maven-resources-plugin:2.7:resources (default-resources) @ commons-codec ---
[INFO] Using 'UTF-8' encoding to copy filtered resources.
[INFO] Copying 128 resources
[INFO] Copying 2 resources to META-INF
[INFO] 
[INFO] --- maven-compiler-plugin:3.2:compile (default-compile) @ commons-codec ---
[INFO] Changes detected - recompiling the module!
[INFO] Compiling 60 source files to /home/perham/Study/LittleDarwin/Cases/commons-codec-1.10-src/target/classes
[INFO] /home/perham/Study/LittleDarwin/Cases/commons-codec-1.10-src/src/main/java/org/apache/commons/codec/digest/Sha2Crypt.java: Some input files use or override a deprecated API.
[INFO] /home/perham/Study/LittleDarwin/Cases/commons-codec-1.10-src/src/main/java/org/apache/commons/codec/digest/Sha2Crypt.java: Recompile with -Xlint:deprecation for details.
[INFO] 
[INFO] --- maven-bundle-plugin:2.5.3:manifest (bundle-manifest) @ commons-codec ---
[INFO] 
[INFO] --- maven-resources-plugin:2.7:testResources (default-testResources) @ commons-codec ---
[INFO] Using 'UTF-8' encoding to copy filtered resources.
[INFO] skip non existing resourceDirectory /home/perham/Study/LittleDarwin/Cases/commons-codec-1.10-src/src/test/resources
[INFO] Copying 2 resources to META-INF
[INFO] 
[INFO] --- maven-compiler-plugin:3.2:testCompile (default-testCompile) @ commons-codec ---
[INFO] Nothing to compile - all classes are up to date
[INFO] 
[INFO] --- maven-surefire-plugin:2.17:test (default-test) @ commons-codec ---
[INFO] Surefire report directory: /home/perham/Study/LittleDarwin/Cases/commons-codec-1.10-src/target/surefire-reports

-------------------------------------------------------
 T E S T S
-------------------------------------------------------
Running org.apache.commons.codec.digest.B64Test
Tests run: 2, Failures: 0, Errors: 0, Skipped: 0, Time elapsed: 0.029 sec - in org.apache.commons.codec.digest.B64Test
Running org.apache.commons.codec.digest.DigestUtilsTest
Tests run: 17, Failures: 0, Errors: 0, Skipped: 0, Time elapsed: 0.673 sec - in org.apache.commons.codec.digest.DigestUtilsTest
Running org.apache.commons.codec.digest.Sha512CryptTest
Tests run: 8, Failures: 0, Errors: 0, Skipped: 0, Time elapsed: 0.483 sec - in org.apache.commons.codec.digest.Sha512CryptTest
Running org.apache.commons.codec.digest.Apr1CryptTest
Tests run: 8, Failures: 0, Errors: 0, Skipped: 0, Time elapsed: 0.082 sec - in org.apache.commons.codec.digest.Apr1CryptTest
Running org.apache.commons.codec.digest.HmacUtilsTest
Tests run: 24, Failures: 0, Errors: 0, Skipped: 0, Time elapsed: 0.033 sec - in org.apache.commons.codec.digest.HmacUtilsTest
Running org.apache.commons.codec.digest.Sha2CryptTest
Tests run: 1, Failures: 0, Errors: 0, Skipped: 0, Time elapsed: 0 sec - in org.apache.commons.codec.digest.Sha2CryptTest
Running org.apache.commons.codec.digest.CryptTest
Tests run: 4, Failures: 0, Errors: 0, Skipped: 0, Time elapsed: 0.107 sec - in org.apache.commons.codec.digest.CryptTest
Running org.apache.commons.codec.digest.Sha256CryptTest
Tests run: 7, Failures: 0, Errors: 0, Skipped: 0, Time elapsed: 0.117 sec - in org.apache.commons.codec.digest.Sha256CryptTest
Running org.apache.commons.codec.digest.Md5CryptTest
Tests run: 7, Failures: 0, Errors: 0, Skipped: 0, Time elapsed: 0.02 sec - in org.apache.commons.codec.digest.Md5CryptTest
Running org.apache.commons.codec.digest.UnixCryptTest
Tests run: 9, Failures: 0, Errors: 0, Skipped: 0, Time elapsed: 0.007 sec - in org.apache.commons.codec.digest.UnixCryptTest
Running org.apache.commons.codec.CharsetsTest
Tests run: 7, Failures: 0, Errors: 0, Skipped: 0, Time elapsed: 0.001 sec - in org.apache.commons.codec.CharsetsTest
Running org.apache.commons.codec.binary.Base32Test
Tests run: 8, Failures: 1, Errors: 2, Skipped: 0, Time elapsed: 0.018 sec <<< FAILURE! - in org.apache.commons.codec.binary.Base32Test
testRandomBytes(org.apache.commons.codec.binary.Base32Test)  Time elapsed: 0.007 sec  <<< ERROR!
java.lang.ArithmeticException: / by zero
	at org.apache.commons.codec.binary.BaseNCodec.getEncodedLength(BaseNCodec.java:97)
	at org.apache.commons.codec.binary.Base32Test.testRandomBytes(Base32Test.java:121)

testRandomBytesHex(org.apache.commons.codec.binary.Base32Test)  Time elapsed: 0 sec  <<< ERROR!
java.lang.ArithmeticException: / by zero
	at org.apache.commons.codec.binary.BaseNCodec.getEncodedLength(BaseNCodec.java:97)
	at org.apache.commons.codec.binary.Base32Test.testRandomBytesHex(Base32Test.java:141)

testRandomBytesChunked(org.apache.commons.codec.binary.Base32Test)  Time elapsed: 0.009 sec  <<< FAILURE!
java.lang.AssertionError: 1 8 expected:<10> but was:<8>
	at org.junit.Assert.fail(Assert.java:88)
	at org.junit.Assert.failNotEquals(Assert.java:743)
	at org.junit.Assert.assertEquals(Assert.java:118)
	at org.junit.Assert.assertEquals(Assert.java:555)
	at org.apache.commons.codec.binary.Base32Test.testRandomBytesChunked(Base32Test.java:131)

Running org.apache.commons.codec.binary.Base64OutputStreamTest
Tests run: 7, Failures: 0, Errors: 2, Skipped: 0, Time elapsed: 0.062 sec <<< FAILURE! - in org.apache.commons.codec.binary.Base64OutputStreamTest
testBase64OutputStreamByteByByte(org.apache.commons.codec.binary.Base64OutputStreamTest)  Time elapsed: 0.057 sec  <<< ERROR!
java.lang.ArithmeticException: / by zero
	at org.apache.commons.codec.binary.BaseNCodec.getEncodedLength(BaseNCodec.java:97)
	at org.apache.commons.codec.binary.Base64.encodeBase64(Base64.java:669)
	at org.apache.commons.codec.binary.Base64.encodeBase64(Base64.java:640)
	at org.apache.commons.codec.binary.Base64.encodeBase64(Base64.java:621)
	at org.apache.commons.codec.binary.Base64.encodeBase64(Base64.java:554)
	at org.apache.commons.codec.binary.Base64TestData.randomData(Base64TestData.java:204)
	at org.apache.commons.codec.binary.Base64OutputStreamTest.testBase64OutputStreamByteByByte(Base64OutputStreamTest.java:164)

testBase64OutputStreamByChunk(org.apache.commons.codec.binary.Base64OutputStreamTest)  Time elapsed: 0.003 sec  <<< ERROR!
java.lang.ArithmeticException: / by zero
	at org.apache.commons.codec.binary.BaseNCodec.getEncodedLength(BaseNCodec.java:97)
	at org.apache.commons.codec.binary.Base64.encodeBase64(Base64.java:669)
	at org.apache.commons.codec.binary.Base64.encodeBase64(Base64.java:640)
	at org.apache.commons.codec.binary.Base64.encodeBase64(Base64.java:621)
	at org.apache.commons.codec.binary.Base64.encodeBase64(Base64.java:554)
	at org.apache.commons.codec.binary.Base64TestData.randomData(Base64TestData.java:204)
	at org.apache.commons.codec.binary.Base64OutputStreamTest.testBase64OutputStreamByChunk(Base64OutputStreamTest.java:126)

Running org.apache.commons.codec.binary.Base64Codec13Test
Tests run: 8, Failures: 0, Errors: 1, Skipped: 0, Time elapsed: 0.009 sec <<< FAILURE! - in org.apache.commons.codec.binary.Base64Codec13Test
testStaticEncode(org.apache.commons.codec.binary.Base64Codec13Test)  Time elapsed: 0 sec  <<< ERROR!
java.lang.ArithmeticException: / by zero
	at org.apache.commons.codec.binary.BaseNCodec.getEncodedLength(BaseNCodec.java:97)
	at org.apache.commons.codec.binary.Base64.encodeBase64(Base64.java:669)
	at org.apache.commons.codec.binary.Base64.encodeBase64(Base64.java:640)
	at org.apache.commons.codec.binary.Base64.encodeBase64(Base64.java:621)
	at org.apache.commons.codec.binary.Base64.encodeBase64(Base64.java:554)
	at org.apache.commons.codec.binary.Base64Codec13Test.testStaticEncode(Base64Codec13Test.java:446)

Running org.apache.commons.codec.binary.Base64InputStreamTest
Tests run: 19, Failures: 0, Errors: 2, Skipped: 0, Time elapsed: 0.022 sec <<< FAILURE! - in org.apache.commons.codec.binary.Base64InputStreamTest
testBase64InputStreamByChunk(org.apache.commons.codec.binary.Base64InputStreamTest)  Time elapsed: 0.003 sec  <<< ERROR!
java.lang.ArithmeticException: / by zero
	at org.apache.commons.codec.binary.BaseNCodec.getEncodedLength(BaseNCodec.java:97)
	at org.apache.commons.codec.binary.Base64.encodeBase64(Base64.java:669)
	at org.apache.commons.codec.binary.Base64.encodeBase64(Base64.java:640)
	at org.apache.commons.codec.binary.Base64.encodeBase64(Base64.java:621)
	at org.apache.commons.codec.binary.Base64.encodeBase64(Base64.java:554)
	at org.apache.commons.codec.binary.Base64TestData.randomData(Base64TestData.java:204)
	at org.apache.commons.codec.binary.Base64InputStreamTest.testBase64InputStreamByChunk(Base64InputStreamTest.java:236)

testBase64InputStreamByteByByte(org.apache.commons.codec.binary.Base64InputStreamTest)  Time elapsed: 0.01 sec  <<< ERROR!
java.lang.ArithmeticException: / by zero
	at org.apache.commons.codec.binary.BaseNCodec.getEncodedLength(BaseNCodec.java:97)
	at org.apache.commons.codec.binary.Base64.encodeBase64(Base64.java:669)
	at org.apache.commons.codec.binary.Base64.encodeBase64(Base64.java:640)
	at org.apache.commons.codec.binary.Base64.encodeBase64(Base64.java:621)
	at org.apache.commons.codec.binary.Base64.encodeBase64(Base64.java:554)
	at org.apache.commons.codec.binary.Base64TestData.randomData(Base64TestData.java:204)
	at org.apache.commons.codec.binary.Base64InputStreamTest.testBase64InputStreamByteByByte(Base64InputStreamTest.java:274)

Running org.apache.commons.codec.binary.Base32InputStreamTest
Tests run: 16, Failures: 0, Errors: 0, Skipped: 0, Time elapsed: 0.161 sec - in org.apache.commons.codec.binary.Base32InputStreamTest
Running org.apache.commons.codec.binary.Base32OutputStreamTest
Tests run: 6, Failures: 0, Errors: 0, Skipped: 0, Time elapsed: 0.082 sec - in org.apache.commons.codec.binary.Base32OutputStreamTest
Running org.apache.commons.codec.binary.BinaryCodecTest
Tests run: 13, Failures: 0, Errors: 0, Skipped: 0, Time elapsed: 0.01 sec - in org.apache.commons.codec.binary.BinaryCodecTest
Running org.apache.commons.codec.binary.BaseNCodecTest
Tests run: 7, Failures: 0, Errors: 0, Skipped: 0, Time elapsed: 0.002 sec - in org.apache.commons.codec.binary.BaseNCodecTest
Running org.apache.commons.codec.binary.StringUtilsTest
Tests run: 17, Failures: 0, Errors: 0, Skipped: 0, Time elapsed: 0.024 sec - in org.apache.commons.codec.binary.StringUtilsTest
Running org.apache.commons.codec.binary.Base64Test
Tests run: 53, Failures: 0, Errors: 20, Skipped: 1, Time elapsed: 0.03 sec <<< FAILURE! - in org.apache.commons.codec.binary.Base64Test
testTriplets(org.apache.commons.codec.binary.Base64Test)  Time elapsed: 0.001 sec  <<< ERROR!
java.lang.ArithmeticException: / by zero
	at org.apache.commons.codec.binary.BaseNCodec.getEncodedLength(BaseNCodec.java:97)
	at org.apache.commons.codec.binary.Base64.encodeBase64(Base64.java:669)
	at org.apache.commons.codec.binary.Base64.encodeBase64(Base64.java:640)
	at org.apache.commons.codec.binary.Base64.encodeBase64(Base64.java:621)
	at org.apache.commons.codec.binary.Base64.encodeBase64(Base64.java:554)
	at org.apache.commons.codec.binary.Base64Test.testTriplets(Base64Test.java:940)

testPairs(org.apache.commons.codec.binary.Base64Test)  Time elapsed: 0.001 sec  <<< ERROR!
java.lang.ArithmeticException: / by zero
	at org.apache.commons.codec.binary.BaseNCodec.getEncodedLength(BaseNCodec.java:97)
	at org.apache.commons.codec.binary.Base64.encodeBase64(Base64.java:669)
	at org.apache.commons.codec.binary.Base64.encodeBase64(Base64.java:640)
	at org.apache.commons.codec.binary.Base64.encodeBase64(Base64.java:621)
	at org.apache.commons.codec.binary.Base64.encodeBase64(Base64.java:554)
	at org.apache.commons.codec.binary.Base64Test.testPairs(Base64Test.java:547)

testUUID(org.apache.commons.codec.binary.Base64Test)  Time elapsed: 0 sec  <<< ERROR!
java.lang.ArithmeticException: / by zero
	at org.apache.commons.codec.binary.BaseNCodec.getEncodedLength(BaseNCodec.java:97)
	at org.apache.commons.codec.binary.Base64.encodeBase64(Base64.java:669)
	at org.apache.commons.codec.binary.Base64.encodeBase64(Base64.java:640)
	at org.apache.commons.codec.binary.Base64.encodeBase64(Base64.java:621)
	at org.apache.commons.codec.binary.Base64.encodeBase64(Base64.java:554)
	at org.apache.commons.codec.binary.Base64Test.testUUID(Base64Test.java:1147)

testEncodeDecodeSmall(org.apache.commons.codec.binary.Base64Test)  Time elapsed: 0 sec  <<< ERROR!
java.lang.ArithmeticException: / by zero
	at org.apache.commons.codec.binary.BaseNCodec.getEncodedLength(BaseNCodec.java:97)
	at org.apache.commons.codec.binary.Base64.encodeBase64(Base64.java:669)
	at org.apache.commons.codec.binary.Base64.encodeBase64(Base64.java:640)
	at org.apache.commons.codec.binary.Base64.encodeBase64(Base64.java:621)
	at org.apache.commons.codec.binary.Base64.encodeBase64(Base64.java:554)
	at org.apache.commons.codec.binary.Base64Test.testEncodeDecodeSmall(Base64Test.java:362)

testObjectDecodeWithValidParameter(org.apache.commons.codec.binary.Base64Test)  Time elapsed: 0.001 sec  <<< ERROR!
java.lang.ArithmeticException: / by zero
	at org.apache.commons.codec.binary.BaseNCodec.getEncodedLength(BaseNCodec.java:97)
	at org.apache.commons.codec.binary.Base64.encodeBase64(Base64.java:669)
	at org.apache.commons.codec.binary.Base64.encodeBase64(Base64.java:640)
	at org.apache.commons.codec.binary.Base64.encodeBase64(Base64.java:621)
	at org.apache.commons.codec.binary.Base64.encodeBase64(Base64.java:554)
	at org.apache.commons.codec.binary.Base64Test.testObjectDecodeWithValidParameter(Base64Test.java:504)

testCodeInteger1(org.apache.commons.codec.binary.Base64Test)  Time elapsed: 0.001 sec  <<< ERROR!
java.lang.ArithmeticException: / by zero
	at org.apache.commons.codec.binary.BaseNCodec.getEncodedLength(BaseNCodec.java:97)
	at org.apache.commons.codec.binary.Base64.encodeBase64(Base64.java:669)
	at org.apache.commons.codec.binary.Base64.encodeBase64(Base64.java:640)
	at org.apache.commons.codec.binary.Base64.encodeBase64(Base64.java:621)
	at org.apache.commons.codec.binary.Base64.encodeInteger(Base64.java:738)
	at org.apache.commons.codec.binary.Base64Test.testCodeInteger1(Base64Test.java:149)

testCodeInteger2(org.apache.commons.codec.binary.Base64Test)  Time elapsed: 0 sec  <<< ERROR!
java.lang.ArithmeticException: / by zero
	at org.apache.commons.codec.binary.BaseNCodec.getEncodedLength(BaseNCodec.java:97)
	at org.apache.commons.codec.binary.Base64.encodeBase64(Base64.java:669)
	at org.apache.commons.codec.binary.Base64.encodeBase64(Base64.java:640)
	at org.apache.commons.codec.binary.Base64.encodeBase64(Base64.java:621)
	at org.apache.commons.codec.binary.Base64.encodeInteger(Base64.java:738)
	at org.apache.commons.codec.binary.Base64Test.testCodeInteger2(Base64Test.java:158)

testCodeInteger3(org.apache.commons.codec.binary.Base64Test)  Time elapsed: 0.001 sec  <<< ERROR!
java.lang.ArithmeticException: / by zero
	at org.apache.commons.codec.binary.BaseNCodec.getEncodedLength(BaseNCodec.java:97)
	at org.apache.commons.codec.binary.Base64.encodeBase64(Base64.java:669)
	at org.apache.commons.codec.binary.Base64.encodeBase64(Base64.java:640)
	at org.apache.commons.codec.binary.Base64.encodeBase64(Base64.java:621)
	at org.apache.commons.codec.binary.Base64.encodeInteger(Base64.java:738)
	at org.apache.commons.codec.binary.Base64Test.testCodeInteger3(Base64Test.java:169)

testCodeInteger4(org.apache.commons.codec.binary.Base64Test)  Time elapsed: 0 sec  <<< ERROR!
java.lang.ArithmeticException: / by zero
	at org.apache.commons.codec.binary.BaseNCodec.getEncodedLength(BaseNCodec.java:97)
	at org.apache.commons.codec.binary.Base64.encodeBase64(Base64.java:669)
	at org.apache.commons.codec.binary.Base64.encodeBase64(Base64.java:640)
	at org.apache.commons.codec.binary.Base64.encodeBase64(Base64.java:621)
	at org.apache.commons.codec.binary.Base64.encodeInteger(Base64.java:738)
	at org.apache.commons.codec.binary.Base64Test.testCodeInteger4(Base64Test.java:186)

testUrlSafe(org.apache.commons.codec.binary.Base64Test)  Time elapsed: 0.001 sec  <<< ERROR!
java.lang.ArithmeticException: / by zero
	at org.apache.commons.codec.binary.BaseNCodec.getEncodedLength(BaseNCodec.java:97)
	at org.apache.commons.codec.binary.Base64.encodeBase64(Base64.java:669)
	at org.apache.commons.codec.binary.Base64.encodeBase64(Base64.java:640)
	at org.apache.commons.codec.binary.Base64.encodeBase64URLSafe(Base64.java:582)
	at org.apache.commons.codec.binary.Base64TestData.randomData(Base64TestData.java:204)
	at org.apache.commons.codec.binary.Base64Test.testUrlSafe(Base64Test.java:1081)

testEncodeDecodeRandom(org.apache.commons.codec.binary.Base64Test)  Time elapsed: 0.001 sec  <<< ERROR!
java.lang.ArithmeticException: / by zero
	at org.apache.commons.codec.binary.BaseNCodec.getEncodedLength(BaseNCodec.java:97)
	at org.apache.commons.codec.binary.Base64.encodeBase64(Base64.java:669)
	at org.apache.commons.codec.binary.Base64.encodeBase64(Base64.java:640)
	at org.apache.commons.codec.binary.Base64.encodeBase64(Base64.java:621)
	at org.apache.commons.codec.binary.Base64.encodeBase64(Base64.java:554)
	at org.apache.commons.codec.binary.Base64Test.testEncodeDecodeRandom(Base64Test.java:349)

testDecodeWithWhitespace(org.apache.commons.codec.binary.Base64Test)  Time elapsed: 0 sec  <<< ERROR!
java.lang.ArithmeticException: / by zero
	at org.apache.commons.codec.binary.BaseNCodec.getEncodedLength(BaseNCodec.java:97)
	at org.apache.commons.codec.binary.Base64.encodeBase64(Base64.java:669)
	at org.apache.commons.codec.binary.Base64.encodeBase64(Base64.java:640)
	at org.apache.commons.codec.binary.Base64.encodeBase64(Base64.java:621)
	at org.apache.commons.codec.binary.Base64.encodeBase64(Base64.java:554)
	at org.apache.commons.codec.binary.Base64Test.testDecodeWithWhitespace(Base64Test.java:311)

testKnownEncodings(org.apache.commons.codec.binary.Base64Test)  Time elapsed: 0 sec  <<< ERROR!
java.lang.ArithmeticException: / by zero
	at org.apache.commons.codec.binary.BaseNCodec.getEncodedLength(BaseNCodec.java:97)
	at org.apache.commons.codec.binary.Base64.encodeBase64(Base64.java:669)
	at org.apache.commons.codec.binary.Base64.encodeBase64(Base64.java:640)
	at org.apache.commons.codec.binary.Base64.encodeBase64(Base64.java:621)
	at org.apache.commons.codec.binary.Base64.encodeBase64(Base64.java:554)
	at org.apache.commons.codec.binary.Base64Test.testKnownEncodings(Base64Test.java:446)

testCodec112(org.apache.commons.codec.binary.Base64Test)  Time elapsed: 0.001 sec  <<< ERROR!
java.lang.ArithmeticException: / by zero
	at org.apache.commons.codec.binary.BaseNCodec.getEncodedLength(BaseNCodec.java:97)
	at org.apache.commons.codec.binary.Base64.encodeBase64(Base64.java:669)
	at org.apache.commons.codec.binary.Base64.encodeBase64(Base64.java:640)
	at org.apache.commons.codec.binary.Base64.encodeBase64(Base64.java:621)
	at org.apache.commons.codec.binary.Base64.encodeBase64(Base64.java:554)
	at org.apache.commons.codec.binary.Base64Test.testCodec112(Base64Test.java:380)

testSingletons(org.apache.commons.codec.binary.Base64Test)  Time elapsed: 0 sec  <<< ERROR!
java.lang.ArithmeticException: / by zero
	at org.apache.commons.codec.binary.BaseNCodec.getEncodedLength(BaseNCodec.java:97)
	at org.apache.commons.codec.binary.Base64.encodeBase64(Base64.java:669)
	at org.apache.commons.codec.binary.Base64.encodeBase64(Base64.java:640)
	at org.apache.commons.codec.binary.Base64.encodeBase64(Base64.java:621)
	at org.apache.commons.codec.binary.Base64.encodeBase64(Base64.java:554)
	at org.apache.commons.codec.binary.Base64Test.testSingletons(Base64Test.java:718)

testRfc4648Section10DecodeEncode(org.apache.commons.codec.binary.Base64Test)  Time elapsed: 0.001 sec  <<< ERROR!
java.lang.ArithmeticException: / by zero
	at org.apache.commons.codec.binary.BaseNCodec.getEncodedLength(BaseNCodec.java:97)
	at org.apache.commons.codec.binary.Base64.encodeBase64(Base64.java:669)
	at org.apache.commons.codec.binary.Base64.encodeBase64(Base64.java:640)
	at org.apache.commons.codec.binary.Base64.encodeBase64(Base64.java:621)
	at org.apache.commons.codec.binary.Base64.encodeBase64String(Base64.java:569)
	at org.apache.commons.codec.binary.Base64Test.testDecodeEncode(Base64Test.java:681)
	at org.apache.commons.codec.binary.Base64Test.testRfc4648Section10DecodeEncode(Base64Test.java:671)

testBase64(org.apache.commons.codec.binary.Base64Test)  Time elapsed: 0 sec  <<< ERROR!
java.lang.ArithmeticException: / by zero
	at org.apache.commons.codec.binary.BaseNCodec.getEncodedLength(BaseNCodec.java:97)
	at org.apache.commons.codec.binary.Base64.encodeBase64(Base64.java:669)
	at org.apache.commons.codec.binary.Base64.encodeBase64(Base64.java:640)
	at org.apache.commons.codec.binary.Base64.encodeBase64(Base64.java:621)
	at org.apache.commons.codec.binary.Base64.encodeBase64(Base64.java:554)
	at org.apache.commons.codec.binary.Base64Test.testBase64(Base64Test.java:82)

testByteToStringVariations(org.apache.commons.codec.binary.Base64Test)  Time elapsed: 0.001 sec  <<< ERROR!
java.lang.ArithmeticException: / by zero
	at org.apache.commons.codec.binary.BaseNCodec.getEncodedLength(BaseNCodec.java:97)
	at org.apache.commons.codec.binary.Base64.encodeBase64(Base64.java:669)
	at org.apache.commons.codec.binary.Base64.encodeBase64(Base64.java:640)
	at org.apache.commons.codec.binary.Base64.encodeBase64(Base64.java:621)
	at org.apache.commons.codec.binary.Base64.encodeBase64String(Base64.java:569)
	at org.apache.commons.codec.binary.Base64Test.testByteToStringVariations(Base64Test.java:1198)

testRfc4648Section10Encode(org.apache.commons.codec.binary.Base64Test)  Time elapsed: 0 sec  <<< ERROR!
java.lang.ArithmeticException: / by zero
	at org.apache.commons.codec.binary.BaseNCodec.getEncodedLength(BaseNCodec.java:97)
	at org.apache.commons.codec.binary.Base64.encodeBase64(Base64.java:669)
	at org.apache.commons.codec.binary.Base64.encodeBase64(Base64.java:640)
	at org.apache.commons.codec.binary.Base64.encodeBase64(Base64.java:621)
	at org.apache.commons.codec.binary.Base64.encodeBase64String(Base64.java:569)
	at org.apache.commons.codec.binary.Base64Test.testRfc4648Section10Encode(Base64Test.java:646)

testRfc4648Section10EncodeDecode(org.apache.commons.codec.binary.Base64Test)  Time elapsed: 0 sec  <<< ERROR!
java.lang.ArithmeticException: / by zero
	at org.apache.commons.codec.binary.BaseNCodec.getEncodedLength(BaseNCodec.java:97)
	at org.apache.commons.codec.binary.Base64.encodeBase64(Base64.java:669)
	at org.apache.commons.codec.binary.Base64.encodeBase64(Base64.java:640)
	at org.apache.commons.codec.binary.Base64.encodeBase64(Base64.java:621)
	at org.apache.commons.codec.binary.Base64.encodeBase64String(Base64.java:569)
	at org.apache.commons.codec.binary.Base64Test.testEncodeDecode(Base64Test.java:711)
	at org.apache.commons.codec.binary.Base64Test.testRfc4648Section10EncodeDecode(Base64Test.java:702)

Running org.apache.commons.codec.binary.HexTest
Tests run: 19, Failures: 0, Errors: 0, Skipped: 0, Time elapsed: 0.176 sec - in org.apache.commons.codec.binary.HexTest
Running org.apache.commons.codec.DecoderExceptionTest
Tests run: 4, Failures: 0, Errors: 0, Skipped: 0, Time elapsed: 0 sec - in org.apache.commons.codec.DecoderExceptionTest
Running org.apache.commons.codec.EncoderExceptionTest
Tests run: 4, Failures: 0, Errors: 0, Skipped: 0, Time elapsed: 0 sec - in org.apache.commons.codec.EncoderExceptionTest
Running org.apache.commons.codec.net.BCodecTest
Tests run: 9, Failures: 0, Errors: 3, Skipped: 0, Time elapsed: 0.005 sec <<< FAILURE! - in org.apache.commons.codec.net.BCodecTest
testUTF8RoundTrip(org.apache.commons.codec.net.BCodecTest)  Time elapsed: 0.002 sec  <<< ERROR!
java.lang.ArithmeticException: / by zero
	at org.apache.commons.codec.binary.BaseNCodec.getEncodedLength(BaseNCodec.java:97)
	at org.apache.commons.codec.binary.Base64.encodeBase64(Base64.java:669)
	at org.apache.commons.codec.binary.Base64.encodeBase64(Base64.java:640)
	at org.apache.commons.codec.binary.Base64.encodeBase64(Base64.java:621)
	at org.apache.commons.codec.binary.Base64.encodeBase64(Base64.java:554)
	at org.apache.commons.codec.net.BCodec.doEncoding(BCodec.java:96)
	at org.apache.commons.codec.net.RFC1522Codec.encodeText(RFC1522Codec.java:78)
	at org.apache.commons.codec.net.BCodec.encode(BCodec.java:123)
	at org.apache.commons.codec.net.BCodec.encode(BCodec.java:162)
	at org.apache.commons.codec.net.BCodecTest.testUTF8RoundTrip(BCodecTest.java:69)

testBasicEncodeDecode(org.apache.commons.codec.net.BCodecTest)  Time elapsed: 0 sec  <<< ERROR!
java.lang.ArithmeticException: / by zero
	at org.apache.commons.codec.binary.BaseNCodec.getEncodedLength(BaseNCodec.java:97)
	at org.apache.commons.codec.binary.Base64.encodeBase64(Base64.java:669)
	at org.apache.commons.codec.binary.Base64.encodeBase64(Base64.java:640)
	at org.apache.commons.codec.binary.Base64.encodeBase64(Base64.java:621)
	at org.apache.commons.codec.binary.Base64.encodeBase64(Base64.java:554)
	at org.apache.commons.codec.net.BCodec.doEncoding(BCodec.java:96)
	at org.apache.commons.codec.net.RFC1522Codec.encodeText(RFC1522Codec.java:78)
	at org.apache.commons.codec.net.BCodec.encode(BCodec.java:123)
	at org.apache.commons.codec.net.BCodec.encode(BCodec.java:162)
	at org.apache.commons.codec.net.BCodecTest.testBasicEncodeDecode(BCodecTest.java:80)

testEncodeObjects(org.apache.commons.codec.net.BCodecTest)  Time elapsed: 0 sec  <<< ERROR!
java.lang.ArithmeticException: / by zero
	at org.apache.commons.codec.binary.BaseNCodec.getEncodedLength(BaseNCodec.java:97)
	at org.apache.commons.codec.binary.Base64.encodeBase64(Base64.java:669)
	at org.apache.commons.codec.binary.Base64.encodeBase64(Base64.java:640)
	at org.apache.commons.codec.binary.Base64.encodeBase64(Base64.java:621)
	at org.apache.commons.codec.binary.Base64.encodeBase64(Base64.java:554)
	at org.apache.commons.codec.net.BCodec.doEncoding(BCodec.java:96)
	at org.apache.commons.codec.net.RFC1522Codec.encodeText(RFC1522Codec.java:78)
	at org.apache.commons.codec.net.BCodec.encode(BCodec.java:123)
	at org.apache.commons.codec.net.BCodec.encode(BCodec.java:162)
	at org.apache.commons.codec.net.BCodec.encode(BCodec.java:201)
	at org.apache.commons.codec.net.BCodecTest.testEncodeObjects(BCodecTest.java:112)

Running org.apache.commons.codec.net.QCodecTest
Tests run: 12, Failures: 0, Errors: 0, Skipped: 0, Time elapsed: 0.005 sec - in org.apache.commons.codec.net.QCodecTest
Running org.apache.commons.codec.net.UtilsTest
Tests run: 1, Failures: 0, Errors: 0, Skipped: 0, Time elapsed: 0 sec - in org.apache.commons.codec.net.UtilsTest
Running org.apache.commons.codec.net.RFC1522CodecTest
Tests run: 2, Failures: 0, Errors: 0, Skipped: 0, Time elapsed: 0.002 sec - in org.apache.commons.codec.net.RFC1522CodecTest
Running org.apache.commons.codec.net.URLCodecTest
Tests run: 16, Failures: 0, Errors: 0, Skipped: 0, Time elapsed: 0.005 sec - in org.apache.commons.codec.net.URLCodecTest
Running org.apache.commons.codec.net.QuotedPrintableCodecTest
Tests run: 21, Failures: 0, Errors: 0, Skipped: 0, Time elapsed: 0.012 sec - in org.apache.commons.codec.net.QuotedPrintableCodecTest
Running org.apache.commons.codec.StringEncoderComparatorTest
Tests run: 3, Failures: 0, Errors: 0, Skipped: 0, Time elapsed: 0.002 sec - in org.apache.commons.codec.StringEncoderComparatorTest
Running org.apache.commons.codec.language.Caverphone1Test
Tests run: 9, Failures: 0, Errors: 0, Skipped: 0, Time elapsed: 0.029 sec - in org.apache.commons.codec.language.Caverphone1Test
Running org.apache.commons.codec.language.NysiisTest
Tests run: 23, Failures: 0, Errors: 0, Skipped: 0, Time elapsed: 0.017 sec - in org.apache.commons.codec.language.NysiisTest
Running org.apache.commons.codec.language.Caverphone2Test
Tests run: 13, Failures: 0, Errors: 0, Skipped: 0, Time elapsed: 0.126 sec - in org.apache.commons.codec.language.Caverphone2Test
Running org.apache.commons.codec.language.DaitchMokotoffSoundexTest
Tests run: 13, Failures: 0, Errors: 0, Skipped: 0, Time elapsed: 0.052 sec - in org.apache.commons.codec.language.DaitchMokotoffSoundexTest
Running org.apache.commons.codec.language.bm.BeiderMorseEncoderTest
Tests run: 22, Failures: 0, Errors: 0, Skipped: 0, Time elapsed: 3.075 sec - in org.apache.commons.codec.language.bm.BeiderMorseEncoderTest
Running org.apache.commons.codec.language.bm.PhoneticEngineTest
Tests run: 8, Failures: 0, Errors: 0, Skipped: 0, Time elapsed: 0.019 sec - in org.apache.commons.codec.language.bm.PhoneticEngineTest
Running org.apache.commons.codec.language.bm.PhoneticEngineRegressionTest
Tests run: 4, Failures: 0, Errors: 0, Skipped: 0, Time elapsed: 0.016 sec - in org.apache.commons.codec.language.bm.PhoneticEngineRegressionTest
Running org.apache.commons.codec.language.bm.RuleTest
Tests run: 3, Failures: 0, Errors: 0, Skipped: 0, Time elapsed: 0.002 sec - in org.apache.commons.codec.language.bm.RuleTest
Running org.apache.commons.codec.language.bm.LanguageGuessingTest
Tests run: 18, Failures: 0, Errors: 0, Skipped: 0, Time elapsed: 0.012 sec - in org.apache.commons.codec.language.bm.LanguageGuessingTest
Running org.apache.commons.codec.language.DoubleMetaphoneTest
Tests run: 16, Failures: 0, Errors: 0, Skipped: 0, Time elapsed: 0.056 sec - in org.apache.commons.codec.language.DoubleMetaphoneTest
Running org.apache.commons.codec.language.SoundexTest
Tests run: 28, Failures: 0, Errors: 0, Skipped: 0, Time elapsed: 0.001 sec - in org.apache.commons.codec.language.SoundexTest
Running org.apache.commons.codec.language.RefinedSoundexTest
Tests run: 10, Failures: 0, Errors: 0, Skipped: 0, Time elapsed: 0.001 sec - in org.apache.commons.codec.language.RefinedSoundexTest
Running org.apache.commons.codec.language.MatchRatingApproachEncoderTest
Tests run: 96, Failures: 0, Errors: 0, Skipped: 0, Time elapsed: 0.004 sec - in org.apache.commons.codec.language.MatchRatingApproachEncoderTest
Running org.apache.commons.codec.language.ColognePhoneticTest
Tests run: 13, Failures: 0, Errors: 0, Skipped: 0, Time elapsed: 0.001 sec - in org.apache.commons.codec.language.ColognePhoneticTest
Running org.apache.commons.codec.language.DoubleMetaphone2Test
Tests run: 6, Failures: 0, Errors: 0, Skipped: 0, Time elapsed: 0 sec - in org.apache.commons.codec.language.DoubleMetaphone2Test
Running org.apache.commons.codec.language.MetaphoneTest
Tests run: 34, Failures: 0, Errors: 0, Skipped: 0, Time elapsed: 0.002 sec - in org.apache.commons.codec.language.MetaphoneTest
Running org.apache.commons.codec.CharEncodingTest
Tests run: 7, Failures: 0, Errors: 0, Skipped: 0, Time elapsed: 0 sec - in org.apache.commons.codec.CharEncodingTest

Results :

Failed tests: 
  Base32Test.testRandomBytesChunked:131 1 8 expected:<10> but was:<8>

Tests in error: 
  Base32Test.testRandomBytes:121 » Arithmetic / by zero
  Base32Test.testRandomBytesHex:141 » Arithmetic / by zero
  Base64OutputStreamTest.testBase64OutputStreamByteByByte:164 » Arithmetic / by ...
  Base64OutputStreamTest.testBase64OutputStreamByChunk:126 » Arithmetic / by zer...
  Base64Codec13Test.testStaticEncode:446 » Arithmetic / by zero
  Base64InputStreamTest.testBase64InputStreamByChunk:236 » Arithmetic / by zero
  Base64InputStreamTest.testBase64InputStreamByteByByte:274 » Arithmetic / by ze...
  Base64Test.testTriplets:940 » Arithmetic / by zero
  Base64Test.testPairs:547 » Arithmetic / by zero
  Base64Test.testUUID:1147 » Arithmetic / by zero
  Base64Test.testEncodeDecodeSmall:362 » Arithmetic / by zero
  Base64Test.testObjectDecodeWithValidParameter:504 » Arithmetic / by zero
  Base64Test.testCodeInteger1:149 » Arithmetic / by zero
  Base64Test.testCodeInteger2:158 » Arithmetic / by zero
  Base64Test.testCodeInteger3:169 » Arithmetic / by zero
  Base64Test.testCodeInteger4:186 » Arithmetic / by zero
  Base64Test.testUrlSafe:1081 » Arithmetic / by zero
  Base64Test.testEncodeDecodeRandom:349 » Arithmetic / by zero
  Base64Test.testDecodeWithWhitespace:311 » Arithmetic / by zero
  Base64Test.testKnownEncodings:446 » Arithmetic / by zero
  Base64Test.testCodec112:380 » Arithmetic / by zero
  Base64Test.testSingletons:718 » Arithmetic / by zero
  Base64Test.testRfc4648Section10DecodeEncode:671->testDecodeEncode:681 » Arithmetic
  Base64Test.testBase64:82 » Arithmetic / by zero
  Base64Test.testByteToStringVariations:1198 » Arithmetic / by zero
  Base64Test.testRfc4648Section10Encode:646 » Arithmetic / by zero
  Base64Test.testRfc4648Section10EncodeDecode:702->testEncodeDecode:711 » Arithmetic
  BCodecTest.testUTF8RoundTrip:69 » Arithmetic / by zero
  BCodecTest.testBasicEncodeDecode:80 » Arithmetic / by zero
  BCodecTest.testEncodeObjects:112 » Arithmetic / by zero

Tests run: 662, Failures: 1, Errors: 30, Skipped: 1

[INFO] ------------------------------------------------------------------------
[INFO] BUILD FAILURE
[INFO] ------------------------------------------------------------------------
[INFO] Total time: 13.808s
[INFO] Finished at: Sun Aug 02 07:16:45 BST 2015
[INFO] Final Memory: 20M/287M
[INFO] ------------------------------------------------------------------------
[ERROR] Failed to execute goal org.apache.maven.plugins:maven-surefire-plugin:2.17:test (default-test) on project commons-codec: There are test failures.
[ERROR] 
[ERROR] Please refer to /home/perham/Study/LittleDarwin/Cases/commons-codec-1.10-src/target/surefire-reports for the individual test results.
[ERROR] -> [Help 1]
[ERROR] 
[ERROR] To see the full stack trace of the errors, re-run Maven with the -e switch.
[ERROR] Re-run Maven using the -X switch to enable full debug logging.
[ERROR] 
[ERROR] For more information about the errors and possible solutions, please read the following articles:
[ERROR] [Help 1] http://cwiki.apache.org/confluence/display/MAVEN/MojoFailureException
