[INFO] Scanning for projects...
[INFO]                                                                         
[INFO] ------------------------------------------------------------------------
[INFO] Building Apache Commons Codec 1.10
[INFO] ------------------------------------------------------------------------
[INFO] 
[INFO] --- maven-enforcer-plugin:1.3.1:enforce (enforce-maven-3) @ commons-codec ---
[INFO] 
[INFO] --- maven-antrun-plugin:1.7:run (javadoc.resources) @ commons-codec ---
[INFO] Executing tasks

main:
[INFO] Executed tasks
[INFO] 
[INFO] --- maven-remote-resources-plugin:1.5:process (default) @ commons-codec ---
[INFO] 
[INFO] --- buildnumber-maven-plugin:1.3:create (default) @ commons-codec ---
[INFO] Executing: /bin/sh -c cd /home/perham/Study/LittleDarwin/Cases/commons-codec-1.10-src && svn --non-interactive info
[INFO] Working directory: /home/perham/Study/LittleDarwin/Cases/commons-codec-1.10-src
[INFO] Storing buildNumber: ?????? at timestamp: 1438494158486
[INFO] Executing: /bin/sh -c cd /home/perham/Study/LittleDarwin/Cases/commons-codec-1.10-src && svn --non-interactive info
[INFO] Working directory: /home/perham/Study/LittleDarwin/Cases/commons-codec-1.10-src
[INFO] Storing buildScmBranch: UNKNOWN_BRANCH
[INFO] 
[INFO] --- maven-resources-plugin:2.7:resources (default-resources) @ commons-codec ---
[INFO] Using 'UTF-8' encoding to copy filtered resources.
[INFO] Copying 128 resources
[INFO] Copying 2 resources to META-INF
[INFO] 
[INFO] --- maven-compiler-plugin:3.2:compile (default-compile) @ commons-codec ---
[INFO] Changes detected - recompiling the module!
[INFO] Compiling 60 source files to /home/perham/Study/LittleDarwin/Cases/commons-codec-1.10-src/target/classes
[INFO] /home/perham/Study/LittleDarwin/Cases/commons-codec-1.10-src/src/main/java/org/apache/commons/codec/digest/Sha2Crypt.java: Some input files use or override a deprecated API.
[INFO] /home/perham/Study/LittleDarwin/Cases/commons-codec-1.10-src/src/main/java/org/apache/commons/codec/digest/Sha2Crypt.java: Recompile with -Xlint:deprecation for details.
[INFO] 
[INFO] --- maven-bundle-plugin:2.5.3:manifest (bundle-manifest) @ commons-codec ---
[INFO] 
[INFO] --- maven-resources-plugin:2.7:testResources (default-testResources) @ commons-codec ---
[INFO] Using 'UTF-8' encoding to copy filtered resources.
[INFO] skip non existing resourceDirectory /home/perham/Study/LittleDarwin/Cases/commons-codec-1.10-src/src/test/resources
[INFO] Copying 2 resources to META-INF
[INFO] 
[INFO] --- maven-compiler-plugin:3.2:testCompile (default-testCompile) @ commons-codec ---
[INFO] Nothing to compile - all classes are up to date
[INFO] 
[INFO] --- maven-surefire-plugin:2.17:test (default-test) @ commons-codec ---
[INFO] Surefire report directory: /home/perham/Study/LittleDarwin/Cases/commons-codec-1.10-src/target/surefire-reports

-------------------------------------------------------
 T E S T S
-------------------------------------------------------
Running org.apache.commons.codec.digest.B64Test
Tests run: 2, Failures: 0, Errors: 0, Skipped: 0, Time elapsed: 0.024 sec - in org.apache.commons.codec.digest.B64Test
Running org.apache.commons.codec.digest.DigestUtilsTest
Tests run: 17, Failures: 0, Errors: 0, Skipped: 0, Time elapsed: 0.638 sec - in org.apache.commons.codec.digest.DigestUtilsTest
Running org.apache.commons.codec.digest.Sha512CryptTest
Tests run: 8, Failures: 0, Errors: 0, Skipped: 0, Time elapsed: 0.501 sec - in org.apache.commons.codec.digest.Sha512CryptTest
Running org.apache.commons.codec.digest.Apr1CryptTest
Tests run: 8, Failures: 0, Errors: 0, Skipped: 0, Time elapsed: 0.048 sec - in org.apache.commons.codec.digest.Apr1CryptTest
Running org.apache.commons.codec.digest.HmacUtilsTest
Tests run: 24, Failures: 0, Errors: 0, Skipped: 0, Time elapsed: 0.041 sec - in org.apache.commons.codec.digest.HmacUtilsTest
Running org.apache.commons.codec.digest.Sha2CryptTest
Tests run: 1, Failures: 0, Errors: 0, Skipped: 0, Time elapsed: 0 sec - in org.apache.commons.codec.digest.Sha2CryptTest
Running org.apache.commons.codec.digest.CryptTest
Tests run: 4, Failures: 0, Errors: 0, Skipped: 0, Time elapsed: 0.059 sec - in org.apache.commons.codec.digest.CryptTest
Running org.apache.commons.codec.digest.Sha256CryptTest
Tests run: 7, Failures: 0, Errors: 0, Skipped: 0, Time elapsed: 0.132 sec - in org.apache.commons.codec.digest.Sha256CryptTest
Running org.apache.commons.codec.digest.Md5CryptTest
Tests run: 7, Failures: 0, Errors: 0, Skipped: 0, Time elapsed: 0.021 sec - in org.apache.commons.codec.digest.Md5CryptTest
Running org.apache.commons.codec.digest.UnixCryptTest
Tests run: 9, Failures: 0, Errors: 0, Skipped: 0, Time elapsed: 0.007 sec - in org.apache.commons.codec.digest.UnixCryptTest
Running org.apache.commons.codec.CharsetsTest
Tests run: 7, Failures: 0, Errors: 0, Skipped: 0, Time elapsed: 0.001 sec - in org.apache.commons.codec.CharsetsTest
Running org.apache.commons.codec.binary.Base32Test
Tests run: 8, Failures: 0, Errors: 0, Skipped: 0, Time elapsed: 0.004 sec - in org.apache.commons.codec.binary.Base32Test
Running org.apache.commons.codec.binary.Base64OutputStreamTest
Tests run: 7, Failures: 0, Errors: 7, Skipped: 0, Time elapsed: 0.011 sec <<< FAILURE! - in org.apache.commons.codec.binary.Base64OutputStreamTest
testCodec98NPE(org.apache.commons.codec.binary.Base64OutputStreamTest)  Time elapsed: 0.008 sec  <<< ERROR!
java.lang.IllegalArgumentException: lineSeparator must not contain base64 characters: [
]
	at org.apache.commons.codec.binary.Base64.<init>(Base64.java:29)
	at org.apache.commons.codec.binary.Base64.<init>(Base64.java:24)
	at org.apache.commons.codec.binary.Base64OutputStream.<init>(Base64OutputStream.java:69)
	at org.apache.commons.codec.binary.Base64OutputStreamTest.testCodec98NPE(Base64OutputStreamTest.java:54)

testWriteOutOfBounds(org.apache.commons.codec.binary.Base64OutputStreamTest)  Time elapsed: 0 sec  <<< ERROR!
java.lang.IllegalArgumentException: lineSeparator must not contain base64 characters: [
]
	at org.apache.commons.codec.binary.Base64.<init>(Base64.java:29)
	at org.apache.commons.codec.binary.Base64.<init>(Base64.java:24)
	at org.apache.commons.codec.binary.Base64OutputStream.<init>(Base64OutputStream.java:69)
	at org.apache.commons.codec.binary.Base64OutputStream.<init>(Base64OutputStream.java:56)
	at org.apache.commons.codec.binary.Base64OutputStreamTest.testWriteOutOfBounds(Base64OutputStreamTest.java:298)

testBase64OutputStreamByteByByte(org.apache.commons.codec.binary.Base64OutputStreamTest)  Time elapsed: 0.001 sec  <<< ERROR!
java.lang.IllegalArgumentException: lineSeparator must not contain base64 characters: [
]
	at org.apache.commons.codec.binary.Base64.<init>(Base64.java:29)
	at org.apache.commons.codec.binary.Base64.<init>(Base64.java:26)
	at org.apache.commons.codec.binary.Base64OutputStream.<init>(Base64OutputStream.java:90)
	at org.apache.commons.codec.binary.Base64OutputStreamTest.testByteByByte(Base64OutputStreamTest.java:243)
	at org.apache.commons.codec.binary.Base64OutputStreamTest.testBase64OutputStreamByteByByte(Base64OutputStreamTest.java:144)

testWriteToNullCoverage(org.apache.commons.codec.binary.Base64OutputStreamTest)  Time elapsed: 0 sec  <<< ERROR!
java.lang.IllegalArgumentException: lineSeparator must not contain base64 characters: [
]
	at org.apache.commons.codec.binary.Base64.<init>(Base64.java:29)
	at org.apache.commons.codec.binary.Base64.<init>(Base64.java:24)
	at org.apache.commons.codec.binary.Base64OutputStream.<init>(Base64OutputStream.java:69)
	at org.apache.commons.codec.binary.Base64OutputStream.<init>(Base64OutputStream.java:56)
	at org.apache.commons.codec.binary.Base64OutputStreamTest.testWriteToNullCoverage(Base64OutputStreamTest.java:339)

testBase64EmptyOutputStreamMimeChunkSize(org.apache.commons.codec.binary.Base64OutputStreamTest)  Time elapsed: 0.001 sec  <<< ERROR!
java.lang.IllegalArgumentException: lineSeparator must not contain base64 characters: [
]
	at org.apache.commons.codec.binary.Base64.<init>(Base64.java:29)
	at org.apache.commons.codec.binary.Base64.<init>(Base64.java:26)
	at org.apache.commons.codec.binary.Base64OutputStream.<init>(Base64OutputStream.java:90)
	at org.apache.commons.codec.binary.Base64OutputStreamTest.testByteByByte(Base64OutputStreamTest.java:243)
	at org.apache.commons.codec.binary.Base64OutputStreamTest.testBase64EmptyOutputStream(Base64OutputStreamTest.java:91)
	at org.apache.commons.codec.binary.Base64OutputStreamTest.testBase64EmptyOutputStreamMimeChunkSize(Base64OutputStreamTest.java:74)

testBase64EmptyOutputStreamPemChunkSize(org.apache.commons.codec.binary.Base64OutputStreamTest)  Time elapsed: 0 sec  <<< ERROR!
java.lang.IllegalArgumentException: lineSeparator must not contain base64 characters: [
]
	at org.apache.commons.codec.binary.Base64.<init>(Base64.java:29)
	at org.apache.commons.codec.binary.Base64.<init>(Base64.java:26)
	at org.apache.commons.codec.binary.Base64OutputStream.<init>(Base64OutputStream.java:90)
	at org.apache.commons.codec.binary.Base64OutputStreamTest.testByteByByte(Base64OutputStreamTest.java:243)
	at org.apache.commons.codec.binary.Base64OutputStreamTest.testBase64EmptyOutputStream(Base64OutputStreamTest.java:91)
	at org.apache.commons.codec.binary.Base64OutputStreamTest.testBase64EmptyOutputStreamPemChunkSize(Base64OutputStreamTest.java:85)

testBase64OutputStreamByChunk(org.apache.commons.codec.binary.Base64OutputStreamTest)  Time elapsed: 0 sec  <<< ERROR!
java.lang.IllegalArgumentException: lineSeparator must not contain base64 characters: [
]
	at org.apache.commons.codec.binary.Base64.<init>(Base64.java:29)
	at org.apache.commons.codec.binary.Base64.<init>(Base64.java:26)
	at org.apache.commons.codec.binary.Base64OutputStream.<init>(Base64OutputStream.java:90)
	at org.apache.commons.codec.binary.Base64OutputStreamTest.testByChunk(Base64OutputStreamTest.java:193)
	at org.apache.commons.codec.binary.Base64OutputStreamTest.testBase64OutputStreamByChunk(Base64OutputStreamTest.java:106)

Running org.apache.commons.codec.binary.Base64Codec13Test
Tests run: 8, Failures: 0, Errors: 8, Skipped: 0, Time elapsed: 0.002 sec <<< FAILURE! - in org.apache.commons.codec.binary.Base64Codec13Test
testEncoder(org.apache.commons.codec.binary.Base64Codec13Test)  Time elapsed: 0 sec  <<< ERROR!
java.lang.IllegalArgumentException: lineSeparator must not contain base64 characters: [
]
	at org.apache.commons.codec.binary.Base64.<init>(Base64.java:29)
	at org.apache.commons.codec.binary.Base64.<init>(Base64.java:26)
	at org.apache.commons.codec.binary.Base64.<init>(Base64.java:25)
	at org.apache.commons.codec.binary.Base64.<init>(Base64.java:23)
	at org.apache.commons.codec.binary.Base64Codec13Test.testEncoder(Base64Codec13Test.java:366)

testBinaryEncoder(org.apache.commons.codec.binary.Base64Codec13Test)  Time elapsed: 0 sec  <<< ERROR!
java.lang.IllegalArgumentException: lineSeparator must not contain base64 characters: [
]
	at org.apache.commons.codec.binary.Base64.<init>(Base64.java:29)
	at org.apache.commons.codec.binary.Base64.<init>(Base64.java:26)
	at org.apache.commons.codec.binary.Base64.<init>(Base64.java:25)
	at org.apache.commons.codec.binary.Base64.<init>(Base64.java:23)
	at org.apache.commons.codec.binary.Base64Codec13Test.testBinaryEncoder(Base64Codec13Test.java:404)

testStaticEncodeChunked(org.apache.commons.codec.binary.Base64Codec13Test)  Time elapsed: 0 sec  <<< ERROR!
java.lang.IllegalArgumentException: lineSeparator must not contain base64 characters: [
]
	at org.apache.commons.codec.binary.Base64.<init>(Base64.java:29)
	at org.apache.commons.codec.binary.Base64.<init>(Base64.java:24)
	at org.apache.commons.codec.binary.Base64.encodeBase64(Base64.java:114)
	at org.apache.commons.codec.binary.Base64.encodeBase64(Base64.java:112)
	at org.apache.commons.codec.binary.Base64.encodeBase64(Base64.java:111)
	at org.apache.commons.codec.binary.Base64.encodeBase64Chunked(Base64.java:110)
	at org.apache.commons.codec.binary.Base64Codec13Test.testStaticEncodeChunked(Base64Codec13Test.java:482)

testDecoder(org.apache.commons.codec.binary.Base64Codec13Test)  Time elapsed: 0 sec  <<< ERROR!
java.lang.IllegalArgumentException: lineSeparator must not contain base64 characters: [
]
	at org.apache.commons.codec.binary.Base64.<init>(Base64.java:29)
	at org.apache.commons.codec.binary.Base64.<init>(Base64.java:26)
	at org.apache.commons.codec.binary.Base64.<init>(Base64.java:25)
	at org.apache.commons.codec.binary.Base64.<init>(Base64.java:23)
	at org.apache.commons.codec.binary.Base64Codec13Test.testDecoder(Base64Codec13Test.java:385)

testBinaryDecoder(org.apache.commons.codec.binary.Base64Codec13Test)  Time elapsed: 0 sec  <<< ERROR!
java.lang.IllegalArgumentException: lineSeparator must not contain base64 characters: [
]
	at org.apache.commons.codec.binary.Base64.<init>(Base64.java:29)
	at org.apache.commons.codec.binary.Base64.<init>(Base64.java:26)
	at org.apache.commons.codec.binary.Base64.<init>(Base64.java:25)
	at org.apache.commons.codec.binary.Base64.<init>(Base64.java:23)
	at org.apache.commons.codec.binary.Base64Codec13Test.testBinaryDecoder(Base64Codec13Test.java:423)

testStaticDecodeChunked(org.apache.commons.codec.binary.Base64Codec13Test)  Time elapsed: 0 sec  <<< ERROR!
java.lang.IllegalArgumentException: lineSeparator must not contain base64 characters: [
]
	at org.apache.commons.codec.binary.Base64.<init>(Base64.java:29)
	at org.apache.commons.codec.binary.Base64.<init>(Base64.java:26)
	at org.apache.commons.codec.binary.Base64.<init>(Base64.java:25)
	at org.apache.commons.codec.binary.Base64.<init>(Base64.java:23)
	at org.apache.commons.codec.binary.Base64.decodeBase64(Base64.java:119)
	at org.apache.commons.codec.binary.Base64Codec13Test.testStaticDecodeChunked(Base64Codec13Test.java:501)

testStaticDecode(org.apache.commons.codec.binary.Base64Codec13Test)  Time elapsed: 0.001 sec  <<< ERROR!
java.lang.IllegalArgumentException: lineSeparator must not contain base64 characters: [
]
	at org.apache.commons.codec.binary.Base64.<init>(Base64.java:29)
	at org.apache.commons.codec.binary.Base64.<init>(Base64.java:26)
	at org.apache.commons.codec.binary.Base64.<init>(Base64.java:25)
	at org.apache.commons.codec.binary.Base64.<init>(Base64.java:23)
	at org.apache.commons.codec.binary.Base64.decodeBase64(Base64.java:119)
	at org.apache.commons.codec.binary.Base64Codec13Test.testStaticDecode(Base64Codec13Test.java:464)

testStaticEncode(org.apache.commons.codec.binary.Base64Codec13Test)  Time elapsed: 0 sec  <<< ERROR!
java.lang.IllegalArgumentException: lineSeparator must not contain base64 characters: [
]
	at org.apache.commons.codec.binary.Base64.<init>(Base64.java:29)
	at org.apache.commons.codec.binary.Base64.encodeBase64(Base64.java:114)
	at org.apache.commons.codec.binary.Base64.encodeBase64(Base64.java:112)
	at org.apache.commons.codec.binary.Base64.encodeBase64(Base64.java:111)
	at org.apache.commons.codec.binary.Base64.encodeBase64(Base64.java:106)
	at org.apache.commons.codec.binary.Base64Codec13Test.testStaticEncode(Base64Codec13Test.java:446)

Running org.apache.commons.codec.binary.Base64InputStreamTest
Tests run: 19, Failures: 0, Errors: 13, Skipped: 0, Time elapsed: 0.01 sec <<< FAILURE! - in org.apache.commons.codec.binary.Base64InputStreamTest
testSkipToEnd(org.apache.commons.codec.binary.Base64InputStreamTest)  Time elapsed: 0 sec  <<< ERROR!
java.lang.IllegalArgumentException: lineSeparator must not contain base64 characters: [
]
	at org.apache.commons.codec.binary.Base64.<init>(Base64.java:29)
	at org.apache.commons.codec.binary.Base64.<init>(Base64.java:24)
	at org.apache.commons.codec.binary.Base64InputStream.<init>(Base64InputStream.java:65)
	at org.apache.commons.codec.binary.Base64InputStream.<init>(Base64InputStream.java:52)
	at org.apache.commons.codec.binary.Base64InputStreamTest.testSkipToEnd(Base64InputStreamTest.java:550)

testSkipNone(org.apache.commons.codec.binary.Base64InputStreamTest)  Time elapsed: 0.001 sec  <<< ERROR!
java.lang.IllegalArgumentException: lineSeparator must not contain base64 characters: [
]
	at org.apache.commons.codec.binary.Base64.<init>(Base64.java:29)
	at org.apache.commons.codec.binary.Base64.<init>(Base64.java:24)
	at org.apache.commons.codec.binary.Base64InputStream.<init>(Base64InputStream.java:65)
	at org.apache.commons.codec.binary.Base64InputStream.<init>(Base64InputStream.java:52)
	at org.apache.commons.codec.binary.Base64InputStreamTest.testSkipNone(Base64InputStreamTest.java:515)

testCodec98NPE(org.apache.commons.codec.binary.Base64InputStreamTest)  Time elapsed: 0 sec  <<< ERROR!
java.lang.IllegalArgumentException: lineSeparator must not contain base64 characters: [
]
	at org.apache.commons.codec.binary.Base64.<init>(Base64.java:29)
	at org.apache.commons.codec.binary.Base64.<init>(Base64.java:24)
	at org.apache.commons.codec.binary.Base64InputStream.<init>(Base64InputStream.java:65)
	at org.apache.commons.codec.binary.Base64InputStream.<init>(Base64InputStream.java:52)
	at org.apache.commons.codec.binary.Base64InputStreamTest.testCodec98NPE(Base64InputStreamTest.java:148)

testBase64InputStreamByChunk(org.apache.commons.codec.binary.Base64InputStreamTest)  Time elapsed: 0 sec  <<< ERROR!
java.lang.IllegalArgumentException: lineSeparator must not contain base64 characters: [
]
	at org.apache.commons.codec.binary.Base64.<init>(Base64.java:29)
	at org.apache.commons.codec.binary.Base64.<init>(Base64.java:26)
	at org.apache.commons.codec.binary.Base64InputStream.<init>(Base64InputStream.java:86)
	at org.apache.commons.codec.binary.Base64InputStreamTest.testByChunk(Base64InputStreamTest.java:303)
	at org.apache.commons.codec.binary.Base64InputStreamTest.testBase64InputStreamByChunk(Base64InputStreamTest.java:216)

testInputStreamReader(org.apache.commons.codec.binary.Base64InputStreamTest)  Time elapsed: 0.001 sec  <<< ERROR!
java.lang.IllegalArgumentException: lineSeparator must not contain base64 characters: [
]
	at org.apache.commons.codec.binary.Base64.<init>(Base64.java:29)
	at org.apache.commons.codec.binary.Base64.<init>(Base64.java:24)
	at org.apache.commons.codec.binary.Base64InputStream.<init>(Base64InputStream.java:65)
	at org.apache.commons.codec.binary.Base64InputStream.<init>(Base64InputStream.java:52)
	at org.apache.commons.codec.binary.Base64InputStreamTest.testInputStreamReader(Base64InputStreamTest.java:130)

testCodec101(org.apache.commons.codec.binary.Base64InputStreamTest)  Time elapsed: 0 sec  <<< ERROR!
java.lang.IllegalArgumentException: lineSeparator must not contain base64 characters: [
]
	at org.apache.commons.codec.binary.Base64.<init>(Base64.java:29)
	at org.apache.commons.codec.binary.Base64.<init>(Base64.java:24)
	at org.apache.commons.codec.binary.Base64InputStream.<init>(Base64InputStream.java:65)
	at org.apache.commons.codec.binary.Base64InputStream.<init>(Base64InputStream.java:52)
	at org.apache.commons.codec.binary.Base64InputStreamTest.testCodec101(Base64InputStreamTest.java:101)

testCodec130(org.apache.commons.codec.binary.Base64InputStreamTest)  Time elapsed: 0.001 sec  <<< ERROR!
java.lang.IllegalArgumentException: lineSeparator must not contain base64 characters: [
]
	at org.apache.commons.codec.binary.Base64.<init>(Base64.java:29)
	at org.apache.commons.codec.binary.Base64.<init>(Base64.java:24)
	at org.apache.commons.codec.binary.Base64OutputStream.<init>(Base64OutputStream.java:69)
	at org.apache.commons.codec.binary.Base64OutputStream.<init>(Base64OutputStream.java:56)
	at org.apache.commons.codec.binary.Base64InputStreamTest.testCodec130(Base64InputStreamTest.java:60)

testAvailable(org.apache.commons.codec.binary.Base64InputStreamTest)  Time elapsed: 0 sec  <<< ERROR!
java.lang.IllegalArgumentException: lineSeparator must not contain base64 characters: [
]
	at org.apache.commons.codec.binary.Base64.<init>(Base64.java:29)
	at org.apache.commons.codec.binary.Base64.<init>(Base64.java:24)
	at org.apache.commons.codec.binary.Base64InputStream.<init>(Base64InputStream.java:65)
	at org.apache.commons.codec.binary.Base64InputStream.<init>(Base64InputStream.java:52)
	at org.apache.commons.codec.binary.Base64InputStreamTest.testAvailable(Base64InputStreamTest.java:165)

testBase64EmptyInputStreamPemChuckSize(org.apache.commons.codec.binary.Base64InputStreamTest)  Time elapsed: 0.001 sec  <<< ERROR!
java.lang.IllegalArgumentException: lineSeparator must not contain base64 characters: [
]
	at org.apache.commons.codec.binary.Base64.<init>(Base64.java:29)
	at org.apache.commons.codec.binary.Base64.<init>(Base64.java:26)
	at org.apache.commons.codec.binary.Base64InputStream.<init>(Base64InputStream.java:86)
	at org.apache.commons.codec.binary.Base64InputStreamTest.testByteByByte(Base64InputStreamTest.java:356)
	at org.apache.commons.codec.binary.Base64InputStreamTest.testBase64EmptyInputStream(Base64InputStreamTest.java:201)
	at org.apache.commons.codec.binary.Base64InputStreamTest.testBase64EmptyInputStreamPemChuckSize(Base64InputStreamTest.java:195)

testBase64EmptyInputStreamMimeChuckSize(org.apache.commons.codec.binary.Base64InputStreamTest)  Time elapsed: 0 sec  <<< ERROR!
java.lang.IllegalArgumentException: lineSeparator must not contain base64 characters: [
]
	at org.apache.commons.codec.binary.Base64.<init>(Base64.java:29)
	at org.apache.commons.codec.binary.Base64.<init>(Base64.java:26)
	at org.apache.commons.codec.binary.Base64InputStream.<init>(Base64InputStream.java:86)
	at org.apache.commons.codec.binary.Base64InputStreamTest.testByteByByte(Base64InputStreamTest.java:356)
	at org.apache.commons.codec.binary.Base64InputStreamTest.testBase64EmptyInputStream(Base64InputStreamTest.java:201)
	at org.apache.commons.codec.binary.Base64InputStreamTest.testBase64EmptyInputStreamMimeChuckSize(Base64InputStreamTest.java:184)

testSkipPastEnd(org.apache.commons.codec.binary.Base64InputStreamTest)  Time elapsed: 0 sec  <<< ERROR!
java.lang.IllegalArgumentException: lineSeparator must not contain base64 characters: [
]
	at org.apache.commons.codec.binary.Base64.<init>(Base64.java:29)
	at org.apache.commons.codec.binary.Base64.<init>(Base64.java:24)
	at org.apache.commons.codec.binary.Base64InputStream.<init>(Base64InputStream.java:65)
	at org.apache.commons.codec.binary.Base64InputStream.<init>(Base64InputStream.java:52)
	at org.apache.commons.codec.binary.Base64InputStreamTest.testSkipPastEnd(Base64InputStreamTest.java:533)

testSkipBig(org.apache.commons.codec.binary.Base64InputStreamTest)  Time elapsed: 0 sec  <<< ERROR!
java.lang.IllegalArgumentException: lineSeparator must not contain base64 characters: [
]
	at org.apache.commons.codec.binary.Base64.<init>(Base64.java:29)
	at org.apache.commons.codec.binary.Base64.<init>(Base64.java:24)
	at org.apache.commons.codec.binary.Base64InputStream.<init>(Base64InputStream.java:65)
	at org.apache.commons.codec.binary.Base64InputStream.<init>(Base64InputStream.java:52)
	at org.apache.commons.codec.binary.Base64InputStreamTest.testSkipBig(Base64InputStreamTest.java:499)

testBase64InputStreamByteByByte(org.apache.commons.codec.binary.Base64InputStreamTest)  Time elapsed: 0 sec  <<< ERROR!
java.lang.IllegalArgumentException: lineSeparator must not contain base64 characters: [
]
	at org.apache.commons.codec.binary.Base64.<init>(Base64.java:29)
	at org.apache.commons.codec.binary.Base64.<init>(Base64.java:26)
	at org.apache.commons.codec.binary.Base64InputStream.<init>(Base64InputStream.java:86)
	at org.apache.commons.codec.binary.Base64InputStreamTest.testByteByByte(Base64InputStreamTest.java:356)
	at org.apache.commons.codec.binary.Base64InputStreamTest.testBase64InputStreamByteByByte(Base64InputStreamTest.java:254)

Running org.apache.commons.codec.binary.Base32InputStreamTest
Tests run: 16, Failures: 0, Errors: 0, Skipped: 0, Time elapsed: 0.163 sec - in org.apache.commons.codec.binary.Base32InputStreamTest
Running org.apache.commons.codec.binary.Base32OutputStreamTest
Tests run: 6, Failures: 0, Errors: 0, Skipped: 0, Time elapsed: 0.102 sec - in org.apache.commons.codec.binary.Base32OutputStreamTest
Running org.apache.commons.codec.binary.BinaryCodecTest
Tests run: 13, Failures: 0, Errors: 0, Skipped: 0, Time elapsed: 0.01 sec - in org.apache.commons.codec.binary.BinaryCodecTest
Running org.apache.commons.codec.binary.BaseNCodecTest
Tests run: 7, Failures: 0, Errors: 0, Skipped: 0, Time elapsed: 0.003 sec - in org.apache.commons.codec.binary.BaseNCodecTest
Running org.apache.commons.codec.binary.StringUtilsTest
Tests run: 17, Failures: 0, Errors: 0, Skipped: 0, Time elapsed: 0.026 sec - in org.apache.commons.codec.binary.StringUtilsTest
Running org.apache.commons.codec.binary.Base64Test
Tests run: 53, Failures: 1, Errors: 41, Skipped: 1, Time elapsed: 0.035 sec <<< FAILURE! - in org.apache.commons.codec.binary.Base64Test
testTriplets(org.apache.commons.codec.binary.Base64Test)  Time elapsed: 0.001 sec  <<< ERROR!
java.lang.IllegalArgumentException: lineSeparator must not contain base64 characters: [
]
	at org.apache.commons.codec.binary.Base64.<init>(Base64.java:29)
	at org.apache.commons.codec.binary.Base64.encodeBase64(Base64.java:114)
	at org.apache.commons.codec.binary.Base64.encodeBase64(Base64.java:112)
	at org.apache.commons.codec.binary.Base64.encodeBase64(Base64.java:111)
	at org.apache.commons.codec.binary.Base64.encodeBase64(Base64.java:106)
	at org.apache.commons.codec.binary.Base64Test.testTriplets(Base64Test.java:940)

testStringToByteVariations(org.apache.commons.codec.binary.Base64Test)  Time elapsed: 0 sec  <<< ERROR!
java.lang.IllegalArgumentException: lineSeparator must not contain base64 characters: [
]
	at org.apache.commons.codec.binary.Base64.<init>(Base64.java:29)
	at org.apache.commons.codec.binary.Base64.<init>(Base64.java:26)
	at org.apache.commons.codec.binary.Base64.<init>(Base64.java:25)
	at org.apache.commons.codec.binary.Base64.<init>(Base64.java:23)
	at org.apache.commons.codec.binary.Base64Test.testStringToByteVariations(Base64Test.java:1210)

testSingletonsChunked(org.apache.commons.codec.binary.Base64Test)  Time elapsed: 0 sec  <<< ERROR!
java.lang.IllegalArgumentException: lineSeparator must not contain base64 characters: [
]
	at org.apache.commons.codec.binary.Base64.<init>(Base64.java:29)
	at org.apache.commons.codec.binary.Base64.<init>(Base64.java:24)
	at org.apache.commons.codec.binary.Base64.encodeBase64(Base64.java:114)
	at org.apache.commons.codec.binary.Base64.encodeBase64(Base64.java:112)
	at org.apache.commons.codec.binary.Base64.encodeBase64(Base64.java:111)
	at org.apache.commons.codec.binary.Base64.encodeBase64Chunked(Base64.java:110)
	at org.apache.commons.codec.binary.Base64Test.testSingletonsChunked(Base64Test.java:831)

testKnownDecodings(org.apache.commons.codec.binary.Base64Test)  Time elapsed: 0 sec  <<< ERROR!
java.lang.IllegalArgumentException: lineSeparator must not contain base64 characters: [
]
	at org.apache.commons.codec.binary.Base64.<init>(Base64.java:29)
	at org.apache.commons.codec.binary.Base64.<init>(Base64.java:26)
	at org.apache.commons.codec.binary.Base64.<init>(Base64.java:25)
	at org.apache.commons.codec.binary.Base64.<init>(Base64.java:23)
	at org.apache.commons.codec.binary.Base64.decodeBase64(Base64.java:119)
	at org.apache.commons.codec.binary.Base64Test.testKnownDecodings(Base64Test.java:431)

testPairs(org.apache.commons.codec.binary.Base64Test)  Time elapsed: 0 sec  <<< ERROR!
java.lang.IllegalArgumentException: lineSeparator must not contain base64 characters: [
]
	at org.apache.commons.codec.binary.Base64.<init>(Base64.java:29)
	at org.apache.commons.codec.binary.Base64.encodeBase64(Base64.java:114)
	at org.apache.commons.codec.binary.Base64.encodeBase64(Base64.java:112)
	at org.apache.commons.codec.binary.Base64.encodeBase64(Base64.java:111)
	at org.apache.commons.codec.binary.Base64.encodeBase64(Base64.java:106)
	at org.apache.commons.codec.binary.Base64Test.testPairs(Base64Test.java:547)

testUUID(org.apache.commons.codec.binary.Base64Test)  Time elapsed: 0 sec  <<< ERROR!
java.lang.IllegalArgumentException: lineSeparator must not contain base64 characters: [
]
	at org.apache.commons.codec.binary.Base64.<init>(Base64.java:29)
	at org.apache.commons.codec.binary.Base64.encodeBase64(Base64.java:114)
	at org.apache.commons.codec.binary.Base64.encodeBase64(Base64.java:112)
	at org.apache.commons.codec.binary.Base64.encodeBase64(Base64.java:111)
	at org.apache.commons.codec.binary.Base64.encodeBase64(Base64.java:106)
	at org.apache.commons.codec.binary.Base64Test.testUUID(Base64Test.java:1147)

testEncodeDecodeSmall(org.apache.commons.codec.binary.Base64Test)  Time elapsed: 0.001 sec  <<< ERROR!
java.lang.IllegalArgumentException: lineSeparator must not contain base64 characters: [
]
	at org.apache.commons.codec.binary.Base64.<init>(Base64.java:29)
	at org.apache.commons.codec.binary.Base64.<init>(Base64.java:26)
	at org.apache.commons.codec.binary.Base64.<init>(Base64.java:25)
	at org.apache.commons.codec.binary.Base64.<init>(Base64.java:23)
	at org.apache.commons.codec.binary.Base64.decodeBase64(Base64.java:119)
	at org.apache.commons.codec.binary.Base64Test.testEncodeDecodeSmall(Base64Test.java:364)

testConstructors(org.apache.commons.codec.binary.Base64Test)  Time elapsed: 0 sec  <<< ERROR!
java.lang.IllegalArgumentException: lineSeparator must not contain base64 characters: [
]
	at org.apache.commons.codec.binary.Base64.<init>(Base64.java:29)
	at org.apache.commons.codec.binary.Base64.<init>(Base64.java:26)
	at org.apache.commons.codec.binary.Base64.<init>(Base64.java:25)
	at org.apache.commons.codec.binary.Base64.<init>(Base64.java:23)
	at org.apache.commons.codec.binary.Base64Test.testConstructors(Base64Test.java:210)

testObjectDecodeWithValidParameter(org.apache.commons.codec.binary.Base64Test)  Time elapsed: 0.001 sec  <<< ERROR!
java.lang.IllegalArgumentException: lineSeparator must not contain base64 characters: [
]
	at org.apache.commons.codec.binary.Base64.<init>(Base64.java:29)
	at org.apache.commons.codec.binary.Base64.encodeBase64(Base64.java:114)
	at org.apache.commons.codec.binary.Base64.encodeBase64(Base64.java:112)
	at org.apache.commons.codec.binary.Base64.encodeBase64(Base64.java:111)
	at org.apache.commons.codec.binary.Base64.encodeBase64(Base64.java:106)
	at org.apache.commons.codec.binary.Base64Test.testObjectDecodeWithValidParameter(Base64Test.java:504)

testCodeInteger1(org.apache.commons.codec.binary.Base64Test)  Time elapsed: 0.002 sec  <<< ERROR!
java.lang.IllegalArgumentException: lineSeparator must not contain base64 characters: [
]
	at org.apache.commons.codec.binary.Base64.<init>(Base64.java:29)
	at org.apache.commons.codec.binary.Base64.encodeBase64(Base64.java:114)
	at org.apache.commons.codec.binary.Base64.encodeBase64(Base64.java:112)
	at org.apache.commons.codec.binary.Base64.encodeBase64(Base64.java:111)
	at org.apache.commons.codec.binary.Base64.encodeInteger(Base64.java:122)
	at org.apache.commons.codec.binary.Base64Test.testCodeInteger1(Base64Test.java:149)

testCodeInteger2(org.apache.commons.codec.binary.Base64Test)  Time elapsed: 0 sec  <<< ERROR!
java.lang.IllegalArgumentException: lineSeparator must not contain base64 characters: [
]
	at org.apache.commons.codec.binary.Base64.<init>(Base64.java:29)
	at org.apache.commons.codec.binary.Base64.encodeBase64(Base64.java:114)
	at org.apache.commons.codec.binary.Base64.encodeBase64(Base64.java:112)
	at org.apache.commons.codec.binary.Base64.encodeBase64(Base64.java:111)
	at org.apache.commons.codec.binary.Base64.encodeInteger(Base64.java:122)
	at org.apache.commons.codec.binary.Base64Test.testCodeInteger2(Base64Test.java:158)

testCodeInteger3(org.apache.commons.codec.binary.Base64Test)  Time elapsed: 0 sec  <<< ERROR!
java.lang.IllegalArgumentException: lineSeparator must not contain base64 characters: [
]
	at org.apache.commons.codec.binary.Base64.<init>(Base64.java:29)
	at org.apache.commons.codec.binary.Base64.encodeBase64(Base64.java:114)
	at org.apache.commons.codec.binary.Base64.encodeBase64(Base64.java:112)
	at org.apache.commons.codec.binary.Base64.encodeBase64(Base64.java:111)
	at org.apache.commons.codec.binary.Base64.encodeInteger(Base64.java:122)
	at org.apache.commons.codec.binary.Base64Test.testCodeInteger3(Base64Test.java:169)

testCodeInteger4(org.apache.commons.codec.binary.Base64Test)  Time elapsed: 0.001 sec  <<< ERROR!
java.lang.IllegalArgumentException: lineSeparator must not contain base64 characters: [
]
	at org.apache.commons.codec.binary.Base64.<init>(Base64.java:29)
	at org.apache.commons.codec.binary.Base64.encodeBase64(Base64.java:114)
	at org.apache.commons.codec.binary.Base64.encodeBase64(Base64.java:112)
	at org.apache.commons.codec.binary.Base64.encodeBase64(Base64.java:111)
	at org.apache.commons.codec.binary.Base64.encodeInteger(Base64.java:122)
	at org.apache.commons.codec.binary.Base64Test.testCodeInteger4(Base64Test.java:186)

testObjectEncode(org.apache.commons.codec.binary.Base64Test)  Time elapsed: 0 sec  <<< ERROR!
java.lang.IllegalArgumentException: lineSeparator must not contain base64 characters: [
]
	at org.apache.commons.codec.binary.Base64.<init>(Base64.java:29)
	at org.apache.commons.codec.binary.Base64.<init>(Base64.java:26)
	at org.apache.commons.codec.binary.Base64.<init>(Base64.java:25)
	at org.apache.commons.codec.binary.Base64.<init>(Base64.java:23)
	at org.apache.commons.codec.binary.Base64Test.testObjectEncode(Base64Test.java:541)

testUrlSafe(org.apache.commons.codec.binary.Base64Test)  Time elapsed: 0 sec  <<< ERROR!
java.lang.IllegalArgumentException: lineSeparator must not contain base64 characters: [
]
	at org.apache.commons.codec.binary.Base64.<init>(Base64.java:29)
	at org.apache.commons.codec.binary.Base64.<init>(Base64.java:26)
	at org.apache.commons.codec.binary.Base64.<init>(Base64.java:25)
	at org.apache.commons.codec.binary.Base64.<init>(Base64.java:23)
	at org.apache.commons.codec.binary.Base64.decodeBase64(Base64.java:119)
	at org.apache.commons.codec.binary.Base64Test.testUrlSafe(Base64Test.java:1084)

testObjectEncodeWithInvalidParameter(org.apache.commons.codec.binary.Base64Test)  Time elapsed: 0 sec  <<< ERROR!
java.lang.IllegalArgumentException: lineSeparator must not contain base64 characters: [
]
	at org.apache.commons.codec.binary.Base64.<init>(Base64.java:29)
	at org.apache.commons.codec.binary.Base64.<init>(Base64.java:26)
	at org.apache.commons.codec.binary.Base64.<init>(Base64.java:25)
	at org.apache.commons.codec.binary.Base64.<init>(Base64.java:23)
	at org.apache.commons.codec.binary.Base64Test.testObjectEncodeWithInvalidParameter(Base64Test.java:516)

testEncodeDecodeRandom(org.apache.commons.codec.binary.Base64Test)  Time elapsed: 0 sec  <<< ERROR!
java.lang.IllegalArgumentException: lineSeparator must not contain base64 characters: [
]
	at org.apache.commons.codec.binary.Base64.<init>(Base64.java:29)
	at org.apache.commons.codec.binary.Base64.encodeBase64(Base64.java:114)
	at org.apache.commons.codec.binary.Base64.encodeBase64(Base64.java:112)
	at org.apache.commons.codec.binary.Base64.encodeBase64(Base64.java:111)
	at org.apache.commons.codec.binary.Base64.encodeBase64(Base64.java:106)
	at org.apache.commons.codec.binary.Base64Test.testEncodeDecodeRandom(Base64Test.java:349)

testDecodeWithWhitespace(org.apache.commons.codec.binary.Base64Test)  Time elapsed: 0.001 sec  <<< ERROR!
java.lang.IllegalArgumentException: lineSeparator must not contain base64 characters: [
]
	at org.apache.commons.codec.binary.Base64.<init>(Base64.java:29)
	at org.apache.commons.codec.binary.Base64.encodeBase64(Base64.java:114)
	at org.apache.commons.codec.binary.Base64.encodeBase64(Base64.java:112)
	at org.apache.commons.codec.binary.Base64.encodeBase64(Base64.java:111)
	at org.apache.commons.codec.binary.Base64.encodeBase64(Base64.java:106)
	at org.apache.commons.codec.binary.Base64Test.testDecodeWithWhitespace(Base64Test.java:311)

testDecodePadOnlyChunked(org.apache.commons.codec.binary.Base64Test)  Time elapsed: 0 sec  <<< ERROR!
java.lang.IllegalArgumentException: lineSeparator must not contain base64 characters: [
]
	at org.apache.commons.codec.binary.Base64.<init>(Base64.java:29)
	at org.apache.commons.codec.binary.Base64.<init>(Base64.java:26)
	at org.apache.commons.codec.binary.Base64.<init>(Base64.java:25)
	at org.apache.commons.codec.binary.Base64.<init>(Base64.java:23)
	at org.apache.commons.codec.binary.Base64.decodeBase64(Base64.java:119)
	at org.apache.commons.codec.binary.Base64Test.testDecodePadOnlyChunked(Base64Test.java:297)

testKnownEncodings(org.apache.commons.codec.binary.Base64Test)  Time elapsed: 0 sec  <<< ERROR!
java.lang.IllegalArgumentException: lineSeparator must not contain base64 characters: [
]
	at org.apache.commons.codec.binary.Base64.<init>(Base64.java:29)
	at org.apache.commons.codec.binary.Base64.encodeBase64(Base64.java:114)
	at org.apache.commons.codec.binary.Base64.encodeBase64(Base64.java:112)
	at org.apache.commons.codec.binary.Base64.encodeBase64(Base64.java:111)
	at org.apache.commons.codec.binary.Base64.encodeBase64(Base64.java:106)
	at org.apache.commons.codec.binary.Base64Test.testKnownEncodings(Base64Test.java:446)

testIgnoringNonBase64InDecode(org.apache.commons.codec.binary.Base64Test)  Time elapsed: 0 sec  <<< ERROR!
java.lang.IllegalArgumentException: lineSeparator must not contain base64 characters: [
]
	at org.apache.commons.codec.binary.Base64.<init>(Base64.java:29)
	at org.apache.commons.codec.binary.Base64.<init>(Base64.java:26)
	at org.apache.commons.codec.binary.Base64.<init>(Base64.java:25)
	at org.apache.commons.codec.binary.Base64.<init>(Base64.java:23)
	at org.apache.commons.codec.binary.Base64.decodeBase64(Base64.java:119)
	at org.apache.commons.codec.binary.Base64Test.testIgnoringNonBase64InDecode(Base64Test.java:395)

testCodec112(org.apache.commons.codec.binary.Base64Test)  Time elapsed: 0 sec  <<< ERROR!
java.lang.IllegalArgumentException: lineSeparator must not contain base64 characters: [
]
	at org.apache.commons.codec.binary.Base64.<init>(Base64.java:29)
	at org.apache.commons.codec.binary.Base64.encodeBase64(Base64.java:114)
	at org.apache.commons.codec.binary.Base64.encodeBase64(Base64.java:112)
	at org.apache.commons.codec.binary.Base64.encodeBase64(Base64.java:111)
	at org.apache.commons.codec.binary.Base64.encodeBase64(Base64.java:106)
	at org.apache.commons.codec.binary.Base64Test.testCodec112(Base64Test.java:380)

testDecodePadMarkerIndex2(org.apache.commons.codec.binary.Base64Test)  Time elapsed: 0 sec  <<< ERROR!
java.lang.IllegalArgumentException: lineSeparator must not contain base64 characters: [
]
	at org.apache.commons.codec.binary.Base64.<init>(Base64.java:29)
	at org.apache.commons.codec.binary.Base64.<init>(Base64.java:26)
	at org.apache.commons.codec.binary.Base64.<init>(Base64.java:25)
	at org.apache.commons.codec.binary.Base64.<init>(Base64.java:23)
	at org.apache.commons.codec.binary.Base64.decodeBase64(Base64.java:119)
	at org.apache.commons.codec.binary.Base64Test.testDecodePadMarkerIndex2(Base64Test.java:272)

testDecodePadMarkerIndex3(org.apache.commons.codec.binary.Base64Test)  Time elapsed: 0 sec  <<< ERROR!
java.lang.IllegalArgumentException: lineSeparator must not contain base64 characters: [
]
	at org.apache.commons.codec.binary.Base64.<init>(Base64.java:29)
	at org.apache.commons.codec.binary.Base64.<init>(Base64.java:26)
	at org.apache.commons.codec.binary.Base64.<init>(Base64.java:25)
	at org.apache.commons.codec.binary.Base64.<init>(Base64.java:23)
	at org.apache.commons.codec.binary.Base64.decodeBase64(Base64.java:119)
	at org.apache.commons.codec.binary.Base64Test.testDecodePadMarkerIndex3(Base64Test.java:280)

testIsUrlSafe(org.apache.commons.codec.binary.Base64Test)  Time elapsed: 0.001 sec  <<< ERROR!
java.lang.IllegalArgumentException: lineSeparator must not contain base64 characters: [
]
	at org.apache.commons.codec.binary.Base64.<init>(Base64.java:29)
	at org.apache.commons.codec.binary.Base64.<init>(Base64.java:24)
	at org.apache.commons.codec.binary.Base64Test.testIsUrlSafe(Base64Test.java:419)

testEmptyBase64(org.apache.commons.codec.binary.Base64Test)  Time elapsed: 0 sec  <<< ERROR!
java.lang.IllegalArgumentException: lineSeparator must not contain base64 characters: [
]
	at org.apache.commons.codec.binary.Base64.<init>(Base64.java:29)
	at org.apache.commons.codec.binary.Base64.<init>(Base64.java:26)
	at org.apache.commons.codec.binary.Base64.<init>(Base64.java:25)
	at org.apache.commons.codec.binary.Base64.<init>(Base64.java:23)
	at org.apache.commons.codec.binary.Base64.decodeBase64(Base64.java:119)
	at org.apache.commons.codec.binary.Base64Test.testEmptyBase64(Base64Test.java:338)

testSingletons(org.apache.commons.codec.binary.Base64Test)  Time elapsed: 0 sec  <<< ERROR!
java.lang.IllegalArgumentException: lineSeparator must not contain base64 characters: [
]
	at org.apache.commons.codec.binary.Base64.<init>(Base64.java:29)
	at org.apache.commons.codec.binary.Base64.encodeBase64(Base64.java:114)
	at org.apache.commons.codec.binary.Base64.encodeBase64(Base64.java:112)
	at org.apache.commons.codec.binary.Base64.encodeBase64(Base64.java:111)
	at org.apache.commons.codec.binary.Base64.encodeBase64(Base64.java:106)
	at org.apache.commons.codec.binary.Base64Test.testSingletons(Base64Test.java:718)

testTripletsChunked(org.apache.commons.codec.binary.Base64Test)  Time elapsed: 0 sec  <<< ERROR!
java.lang.IllegalArgumentException: lineSeparator must not contain base64 characters: [
]
	at org.apache.commons.codec.binary.Base64.<init>(Base64.java:29)
	at org.apache.commons.codec.binary.Base64.<init>(Base64.java:24)
	at org.apache.commons.codec.binary.Base64.encodeBase64(Base64.java:114)
	at org.apache.commons.codec.binary.Base64.encodeBase64(Base64.java:112)
	at org.apache.commons.codec.binary.Base64.encodeBase64(Base64.java:111)
	at org.apache.commons.codec.binary.Base64.encodeBase64Chunked(Base64.java:110)
	at org.apache.commons.codec.binary.Base64Test.testTripletsChunked(Base64Test.java:1008)

testCodec68(org.apache.commons.codec.binary.Base64Test)  Time elapsed: 0.001 sec  <<< ERROR!
java.lang.IllegalArgumentException: lineSeparator must not contain base64 characters: [
]
	at org.apache.commons.codec.binary.Base64.<init>(Base64.java:29)
	at org.apache.commons.codec.binary.Base64.<init>(Base64.java:26)
	at org.apache.commons.codec.binary.Base64.<init>(Base64.java:25)
	at org.apache.commons.codec.binary.Base64.<init>(Base64.java:23)
	at org.apache.commons.codec.binary.Base64.decodeBase64(Base64.java:119)
	at org.apache.commons.codec.binary.Base64Test.testCodec68(Base64Test.java:141)

testRfc4648Section10DecodeEncode(org.apache.commons.codec.binary.Base64Test)  Time elapsed: 0 sec  <<< ERROR!
java.lang.IllegalArgumentException: lineSeparator must not contain base64 characters: [
]
	at org.apache.commons.codec.binary.Base64.<init>(Base64.java:29)
	at org.apache.commons.codec.binary.Base64.<init>(Base64.java:26)
	at org.apache.commons.codec.binary.Base64.<init>(Base64.java:25)
	at org.apache.commons.codec.binary.Base64.<init>(Base64.java:23)
	at org.apache.commons.codec.binary.Base64.decodeBase64(Base64.java:118)
	at org.apache.commons.codec.binary.Base64Test.testDecodeEncode(Base64Test.java:680)
	at org.apache.commons.codec.binary.Base64Test.testRfc4648Section10DecodeEncode(Base64Test.java:670)

testObjectDecodeWithInvalidParameter(org.apache.commons.codec.binary.Base64Test)  Time elapsed: 0.001 sec  <<< ERROR!
java.lang.IllegalArgumentException: lineSeparator must not contain base64 characters: [
]
	at org.apache.commons.codec.binary.Base64.<init>(Base64.java:29)
	at org.apache.commons.codec.binary.Base64.<init>(Base64.java:26)
	at org.apache.commons.codec.binary.Base64.<init>(Base64.java:25)
	at org.apache.commons.codec.binary.Base64.<init>(Base64.java:23)
	at org.apache.commons.codec.binary.Base64Test.testObjectDecodeWithInvalidParameter(Base64Test.java:489)

testDecodePadOnly(org.apache.commons.codec.binary.Base64Test)  Time elapsed: 0 sec  <<< ERROR!
java.lang.IllegalArgumentException: lineSeparator must not contain base64 characters: [
]
	at org.apache.commons.codec.binary.Base64.<init>(Base64.java:29)
	at org.apache.commons.codec.binary.Base64.<init>(Base64.java:26)
	at org.apache.commons.codec.binary.Base64.<init>(Base64.java:25)
	at org.apache.commons.codec.binary.Base64.<init>(Base64.java:23)
	at org.apache.commons.codec.binary.Base64.decodeBase64(Base64.java:119)
	at org.apache.commons.codec.binary.Base64Test.testDecodePadOnly(Base64Test.java:286)

testChunkedEncodeMultipleOf76(org.apache.commons.codec.binary.Base64Test)  Time elapsed: 0.001 sec  <<< ERROR!
java.lang.IllegalArgumentException: lineSeparator must not contain base64 characters: [
]
	at org.apache.commons.codec.binary.Base64.<init>(Base64.java:29)
	at org.apache.commons.codec.binary.Base64.<init>(Base64.java:24)
	at org.apache.commons.codec.binary.Base64.encodeBase64(Base64.java:114)
	at org.apache.commons.codec.binary.Base64.encodeBase64(Base64.java:112)
	at org.apache.commons.codec.binary.Base64.encodeBase64(Base64.java:111)
	at org.apache.commons.codec.binary.Base64Test.testChunkedEncodeMultipleOf76(Base64Test.java:127)

testBase64(org.apache.commons.codec.binary.Base64Test)  Time elapsed: 0 sec  <<< ERROR!
java.lang.IllegalArgumentException: lineSeparator must not contain base64 characters: [
]
	at org.apache.commons.codec.binary.Base64.<init>(Base64.java:29)
	at org.apache.commons.codec.binary.Base64.encodeBase64(Base64.java:114)
	at org.apache.commons.codec.binary.Base64.encodeBase64(Base64.java:112)
	at org.apache.commons.codec.binary.Base64.encodeBase64(Base64.java:111)
	at org.apache.commons.codec.binary.Base64.encodeBase64(Base64.java:106)
	at org.apache.commons.codec.binary.Base64Test.testBase64(Base64Test.java:82)

testNonBase64Test(org.apache.commons.codec.binary.Base64Test)  Time elapsed: 0 sec  <<< FAILURE!
java.lang.AssertionError: Exception was thrown when trying to decode invalid base64 encoded data - RFC 2045 requires that all non base64 character be discarded, an exception should not have been thrown
	at org.junit.Assert.fail(Assert.java:88)
	at org.apache.commons.codec.binary.Base64Test.testNonBase64Test(Base64Test.java:480)

testByteToStringVariations(org.apache.commons.codec.binary.Base64Test)  Time elapsed: 0 sec  <<< ERROR!
java.lang.IllegalArgumentException: lineSeparator must not contain base64 characters: [
]
	at org.apache.commons.codec.binary.Base64.<init>(Base64.java:29)
	at org.apache.commons.codec.binary.Base64.<init>(Base64.java:26)
	at org.apache.commons.codec.binary.Base64.<init>(Base64.java:25)
	at org.apache.commons.codec.binary.Base64Test.testByteToStringVariations(Base64Test.java:1191)

testObjectEncodeWithValidParameter(org.apache.commons.codec.binary.Base64Test)  Time elapsed: 0 sec  <<< ERROR!
java.lang.IllegalArgumentException: lineSeparator must not contain base64 characters: [
]
	at org.apache.commons.codec.binary.Base64.<init>(Base64.java:29)
	at org.apache.commons.codec.binary.Base64.<init>(Base64.java:26)
	at org.apache.commons.codec.binary.Base64.<init>(Base64.java:25)
	at org.apache.commons.codec.binary.Base64.<init>(Base64.java:23)
	at org.apache.commons.codec.binary.Base64Test.testObjectEncodeWithValidParameter(Base64Test.java:531)

testRfc4648Section10DecodeWithCrLf(org.apache.commons.codec.binary.Base64Test)  Time elapsed: 0 sec  <<< ERROR!
java.lang.IllegalArgumentException: lineSeparator must not contain base64 characters: [
]
	at org.apache.commons.codec.binary.Base64.<init>(Base64.java:29)
	at org.apache.commons.codec.binary.Base64.<init>(Base64.java:26)
	at org.apache.commons.codec.binary.Base64.<init>(Base64.java:25)
	at org.apache.commons.codec.binary.Base64.<init>(Base64.java:23)
	at org.apache.commons.codec.binary.Base64.decodeBase64(Base64.java:118)
	at org.apache.commons.codec.binary.Base64Test.testRfc4648Section10DecodeWithCrLf(Base64Test.java:620)

testRfc4648Section10Decode(org.apache.commons.codec.binary.Base64Test)  Time elapsed: 0 sec  <<< ERROR!
java.lang.IllegalArgumentException: lineSeparator must not contain base64 characters: [
]
	at org.apache.commons.codec.binary.Base64.<init>(Base64.java:29)
	at org.apache.commons.codec.binary.Base64.<init>(Base64.java:26)
	at org.apache.commons.codec.binary.Base64.<init>(Base64.java:25)
	at org.apache.commons.codec.binary.Base64.<init>(Base64.java:23)
	at org.apache.commons.codec.binary.Base64.decodeBase64(Base64.java:118)
	at org.apache.commons.codec.binary.Base64Test.testRfc4648Section10Decode(Base64Test.java:594)

testRfc4648Section10Encode(org.apache.commons.codec.binary.Base64Test)  Time elapsed: 0.001 sec  <<< ERROR!
java.lang.IllegalArgumentException: lineSeparator must not contain base64 characters: [
]
	at org.apache.commons.codec.binary.Base64.<init>(Base64.java:29)
	at org.apache.commons.codec.binary.Base64.encodeBase64(Base64.java:114)
	at org.apache.commons.codec.binary.Base64.encodeBase64(Base64.java:112)
	at org.apache.commons.codec.binary.Base64.encodeBase64(Base64.java:111)
	at org.apache.commons.codec.binary.Base64.encodeBase64String(Base64.java:107)
	at org.apache.commons.codec.binary.Base64Test.testRfc4648Section10Encode(Base64Test.java:646)

testRfc4648Section10EncodeDecode(org.apache.commons.codec.binary.Base64Test)  Time elapsed: 0 sec  <<< ERROR!
java.lang.IllegalArgumentException: lineSeparator must not contain base64 characters: [
]
	at org.apache.commons.codec.binary.Base64.<init>(Base64.java:29)
	at org.apache.commons.codec.binary.Base64.<init>(Base64.java:26)
	at org.apache.commons.codec.binary.Base64.<init>(Base64.java:25)
	at org.apache.commons.codec.binary.Base64.<init>(Base64.java:23)
	at org.apache.commons.codec.binary.Base64.decodeBase64(Base64.java:118)
	at org.apache.commons.codec.binary.Base64Test.testEncodeDecode(Base64Test.java:712)
	at org.apache.commons.codec.binary.Base64Test.testRfc4648Section10EncodeDecode(Base64Test.java:701)

testDecodeWithInnerPad(org.apache.commons.codec.binary.Base64Test)  Time elapsed: 0 sec  <<< ERROR!
java.lang.IllegalArgumentException: lineSeparator must not contain base64 characters: [
]
	at org.apache.commons.codec.binary.Base64.<init>(Base64.java:29)
	at org.apache.commons.codec.binary.Base64.<init>(Base64.java:26)
	at org.apache.commons.codec.binary.Base64.<init>(Base64.java:25)
	at org.apache.commons.codec.binary.Base64.<init>(Base64.java:23)
	at org.apache.commons.codec.binary.Base64.decodeBase64(Base64.java:118)
	at org.apache.commons.codec.binary.Base64Test.testDecodeWithInnerPad(Base64Test.java:117)

Running org.apache.commons.codec.binary.HexTest
Tests run: 19, Failures: 0, Errors: 0, Skipped: 0, Time elapsed: 0.166 sec - in org.apache.commons.codec.binary.HexTest
Running org.apache.commons.codec.DecoderExceptionTest
Tests run: 4, Failures: 0, Errors: 0, Skipped: 0, Time elapsed: 0.001 sec - in org.apache.commons.codec.DecoderExceptionTest
Running org.apache.commons.codec.EncoderExceptionTest
Tests run: 4, Failures: 0, Errors: 0, Skipped: 0, Time elapsed: 0 sec - in org.apache.commons.codec.EncoderExceptionTest
Running org.apache.commons.codec.net.BCodecTest
Tests run: 9, Failures: 0, Errors: 4, Skipped: 0, Time elapsed: 0.011 sec <<< FAILURE! - in org.apache.commons.codec.net.BCodecTest
testUTF8RoundTrip(org.apache.commons.codec.net.BCodecTest)  Time elapsed: 0.01 sec  <<< ERROR!
java.lang.IllegalArgumentException: lineSeparator must not contain base64 characters: [
]
	at org.apache.commons.codec.binary.Base64.<init>(Base64.java:29)
	at org.apache.commons.codec.binary.Base64.encodeBase64(Base64.java:114)
	at org.apache.commons.codec.binary.Base64.encodeBase64(Base64.java:112)
	at org.apache.commons.codec.binary.Base64.encodeBase64(Base64.java:111)
	at org.apache.commons.codec.binary.Base64.encodeBase64(Base64.java:106)
	at org.apache.commons.codec.net.BCodec.doEncoding(BCodec.java:96)
	at org.apache.commons.codec.net.RFC1522Codec.encodeText(RFC1522Codec.java:78)
	at org.apache.commons.codec.net.BCodec.encode(BCodec.java:123)
	at org.apache.commons.codec.net.BCodec.encode(BCodec.java:162)
	at org.apache.commons.codec.net.BCodecTest.testUTF8RoundTrip(BCodecTest.java:69)

testBasicEncodeDecode(org.apache.commons.codec.net.BCodecTest)  Time elapsed: 0 sec  <<< ERROR!
java.lang.IllegalArgumentException: lineSeparator must not contain base64 characters: [
]
	at org.apache.commons.codec.binary.Base64.<init>(Base64.java:29)
	at org.apache.commons.codec.binary.Base64.encodeBase64(Base64.java:114)
	at org.apache.commons.codec.binary.Base64.encodeBase64(Base64.java:112)
	at org.apache.commons.codec.binary.Base64.encodeBase64(Base64.java:111)
	at org.apache.commons.codec.binary.Base64.encodeBase64(Base64.java:106)
	at org.apache.commons.codec.net.BCodec.doEncoding(BCodec.java:96)
	at org.apache.commons.codec.net.RFC1522Codec.encodeText(RFC1522Codec.java:78)
	at org.apache.commons.codec.net.BCodec.encode(BCodec.java:123)
	at org.apache.commons.codec.net.BCodec.encode(BCodec.java:162)
	at org.apache.commons.codec.net.BCodecTest.testBasicEncodeDecode(BCodecTest.java:80)

testDecodeObjects(org.apache.commons.codec.net.BCodecTest)  Time elapsed: 0 sec  <<< ERROR!
java.lang.IllegalArgumentException: lineSeparator must not contain base64 characters: [
]
	at org.apache.commons.codec.binary.Base64.<init>(Base64.java:29)
	at org.apache.commons.codec.binary.Base64.<init>(Base64.java:26)
	at org.apache.commons.codec.binary.Base64.<init>(Base64.java:25)
	at org.apache.commons.codec.binary.Base64.<init>(Base64.java:23)
	at org.apache.commons.codec.binary.Base64.decodeBase64(Base64.java:119)
	at org.apache.commons.codec.net.BCodec.doDecoding(BCodec.java:104)
	at org.apache.commons.codec.net.RFC1522Codec.decodeText(RFC1522Codec.java:154)
	at org.apache.commons.codec.net.BCodec.decode(BCodec.java:181)
	at org.apache.commons.codec.net.BCodec.decode(BCodec.java:225)
	at org.apache.commons.codec.net.BCodecTest.testDecodeObjects(BCodecTest.java:137)

testEncodeObjects(org.apache.commons.codec.net.BCodecTest)  Time elapsed: 0 sec  <<< ERROR!
java.lang.IllegalArgumentException: lineSeparator must not contain base64 characters: [
]
	at org.apache.commons.codec.binary.Base64.<init>(Base64.java:29)
	at org.apache.commons.codec.binary.Base64.encodeBase64(Base64.java:114)
	at org.apache.commons.codec.binary.Base64.encodeBase64(Base64.java:112)
	at org.apache.commons.codec.binary.Base64.encodeBase64(Base64.java:111)
	at org.apache.commons.codec.binary.Base64.encodeBase64(Base64.java:106)
	at org.apache.commons.codec.net.BCodec.doEncoding(BCodec.java:96)
	at org.apache.commons.codec.net.RFC1522Codec.encodeText(RFC1522Codec.java:78)
	at org.apache.commons.codec.net.BCodec.encode(BCodec.java:123)
	at org.apache.commons.codec.net.BCodec.encode(BCodec.java:162)
	at org.apache.commons.codec.net.BCodec.encode(BCodec.java:201)
	at org.apache.commons.codec.net.BCodecTest.testEncodeObjects(BCodecTest.java:112)

Running org.apache.commons.codec.net.QCodecTest
Tests run: 12, Failures: 0, Errors: 0, Skipped: 0, Time elapsed: 0.004 sec - in org.apache.commons.codec.net.QCodecTest
Running org.apache.commons.codec.net.UtilsTest
Tests run: 1, Failures: 0, Errors: 0, Skipped: 0, Time elapsed: 0 sec - in org.apache.commons.codec.net.UtilsTest
Running org.apache.commons.codec.net.RFC1522CodecTest
Tests run: 2, Failures: 0, Errors: 0, Skipped: 0, Time elapsed: 0 sec - in org.apache.commons.codec.net.RFC1522CodecTest
Running org.apache.commons.codec.net.URLCodecTest
Tests run: 16, Failures: 0, Errors: 0, Skipped: 0, Time elapsed: 0.004 sec - in org.apache.commons.codec.net.URLCodecTest
Running org.apache.commons.codec.net.QuotedPrintableCodecTest
Tests run: 21, Failures: 0, Errors: 0, Skipped: 0, Time elapsed: 0.01 sec - in org.apache.commons.codec.net.QuotedPrintableCodecTest
Running org.apache.commons.codec.StringEncoderComparatorTest
Tests run: 3, Failures: 0, Errors: 0, Skipped: 0, Time elapsed: 0.003 sec - in org.apache.commons.codec.StringEncoderComparatorTest
Running org.apache.commons.codec.language.Caverphone1Test
Tests run: 9, Failures: 0, Errors: 0, Skipped: 0, Time elapsed: 0.029 sec - in org.apache.commons.codec.language.Caverphone1Test
Running org.apache.commons.codec.language.NysiisTest
Tests run: 23, Failures: 0, Errors: 0, Skipped: 0, Time elapsed: 0.016 sec - in org.apache.commons.codec.language.NysiisTest
Running org.apache.commons.codec.language.Caverphone2Test
Tests run: 13, Failures: 0, Errors: 0, Skipped: 0, Time elapsed: 0.138 sec - in org.apache.commons.codec.language.Caverphone2Test
Running org.apache.commons.codec.language.DaitchMokotoffSoundexTest
Tests run: 13, Failures: 0, Errors: 0, Skipped: 0, Time elapsed: 0.045 sec - in org.apache.commons.codec.language.DaitchMokotoffSoundexTest
Running org.apache.commons.codec.language.bm.BeiderMorseEncoderTest
Tests run: 22, Failures: 0, Errors: 0, Skipped: 0, Time elapsed: 2.936 sec - in org.apache.commons.codec.language.bm.BeiderMorseEncoderTest
Running org.apache.commons.codec.language.bm.PhoneticEngineTest
Tests run: 8, Failures: 0, Errors: 0, Skipped: 0, Time elapsed: 0.018 sec - in org.apache.commons.codec.language.bm.PhoneticEngineTest
Running org.apache.commons.codec.language.bm.PhoneticEngineRegressionTest
Tests run: 4, Failures: 0, Errors: 0, Skipped: 0, Time elapsed: 0.014 sec - in org.apache.commons.codec.language.bm.PhoneticEngineRegressionTest
Running org.apache.commons.codec.language.bm.RuleTest
Tests run: 3, Failures: 0, Errors: 0, Skipped: 0, Time elapsed: 0.002 sec - in org.apache.commons.codec.language.bm.RuleTest
Running org.apache.commons.codec.language.bm.LanguageGuessingTest
Tests run: 18, Failures: 0, Errors: 0, Skipped: 0, Time elapsed: 0.012 sec - in org.apache.commons.codec.language.bm.LanguageGuessingTest
Running org.apache.commons.codec.language.DoubleMetaphoneTest
Tests run: 16, Failures: 0, Errors: 0, Skipped: 0, Time elapsed: 0.046 sec - in org.apache.commons.codec.language.DoubleMetaphoneTest
Running org.apache.commons.codec.language.SoundexTest
Tests run: 28, Failures: 0, Errors: 0, Skipped: 0, Time elapsed: 0.009 sec - in org.apache.commons.codec.language.SoundexTest
Running org.apache.commons.codec.language.RefinedSoundexTest
Tests run: 10, Failures: 0, Errors: 0, Skipped: 0, Time elapsed: 0.003 sec - in org.apache.commons.codec.language.RefinedSoundexTest
Running org.apache.commons.codec.language.MatchRatingApproachEncoderTest
Tests run: 96, Failures: 0, Errors: 0, Skipped: 0, Time elapsed: 0.034 sec - in org.apache.commons.codec.language.MatchRatingApproachEncoderTest
Running org.apache.commons.codec.language.ColognePhoneticTest
Tests run: 13, Failures: 0, Errors: 0, Skipped: 0, Time elapsed: 0.004 sec - in org.apache.commons.codec.language.ColognePhoneticTest
Running org.apache.commons.codec.language.DoubleMetaphone2Test
Tests run: 6, Failures: 0, Errors: 0, Skipped: 0, Time elapsed: 0.027 sec - in org.apache.commons.codec.language.DoubleMetaphone2Test
Running org.apache.commons.codec.language.MetaphoneTest
Tests run: 34, Failures: 0, Errors: 0, Skipped: 0, Time elapsed: 0.085 sec - in org.apache.commons.codec.language.MetaphoneTest
Running org.apache.commons.codec.CharEncodingTest
Tests run: 7, Failures: 0, Errors: 0, Skipped: 0, Time elapsed: 0.001 sec - in org.apache.commons.codec.CharEncodingTest

Results :

Failed tests: 
  Base64Test.testNonBase64Test:480 Exception was thrown when trying to decode invalid base64 encoded data - RFC 2045 requires that all non base64 character be discarded, an exception should not have been thrown

Tests in error: 
  Base64OutputStreamTest.testCodec98NPE:54 » IllegalArgument lineSeparator must ...
  Base64OutputStreamTest.testWriteOutOfBounds:298 » IllegalArgument lineSeparato...
  Base64OutputStreamTest.testBase64OutputStreamByteByByte:144->testByteByByte:243 » IllegalArgument
  Base64OutputStreamTest.testWriteToNullCoverage:339 » IllegalArgument lineSepar...
  Base64OutputStreamTest.testBase64EmptyOutputStreamMimeChunkSize:74->testBase64EmptyOutputStream:91->testByteByByte:243 » IllegalArgument
  Base64OutputStreamTest.testBase64EmptyOutputStreamPemChunkSize:85->testBase64EmptyOutputStream:91->testByteByByte:243 » IllegalArgument
  Base64OutputStreamTest.testBase64OutputStreamByChunk:106->testByChunk:193 » IllegalArgument
  Base64Codec13Test.testEncoder:366 » IllegalArgument lineSeparator must not con...
  Base64Codec13Test.testBinaryEncoder:404 » IllegalArgument lineSeparator must n...
  Base64Codec13Test.testStaticEncodeChunked:482 » IllegalArgument lineSeparator ...
  Base64Codec13Test.testDecoder:385 » IllegalArgument lineSeparator must not con...
  Base64Codec13Test.testBinaryDecoder:423 » IllegalArgument lineSeparator must n...
  Base64Codec13Test.testStaticDecodeChunked:501 » IllegalArgument lineSeparator ...
  Base64Codec13Test.testStaticDecode:464 » IllegalArgument lineSeparator must no...
  Base64Codec13Test.testStaticEncode:446 » IllegalArgument lineSeparator must no...
  Base64InputStreamTest.testSkipToEnd:550 » IllegalArgument lineSeparator must n...
  Base64InputStreamTest.testSkipNone:515 » IllegalArgument lineSeparator must no...
  Base64InputStreamTest.testCodec98NPE:148 » IllegalArgument lineSeparator must ...
  Base64InputStreamTest.testBase64InputStreamByChunk:216->testByChunk:303 » IllegalArgument
  Base64InputStreamTest.testInputStreamReader:130 » IllegalArgument lineSeparato...
  Base64InputStreamTest.testCodec101:101 » IllegalArgument lineSeparator must no...
  Base64InputStreamTest.testCodec130:60 » IllegalArgument lineSeparator must not...
  Base64InputStreamTest.testAvailable:165 » IllegalArgument lineSeparator must n...
  Base64InputStreamTest.testBase64EmptyInputStreamPemChuckSize:195->testBase64EmptyInputStream:201->testByteByByte:356 » IllegalArgument
  Base64InputStreamTest.testBase64EmptyInputStreamMimeChuckSize:184->testBase64EmptyInputStream:201->testByteByByte:356 » IllegalArgument
  Base64InputStreamTest.testSkipPastEnd:533 » IllegalArgument lineSeparator must...
  Base64InputStreamTest.testSkipBig:499 » IllegalArgument lineSeparator must not...
  Base64InputStreamTest.testBase64InputStreamByteByByte:254->testByteByByte:356 » IllegalArgument
  Base64Test.testTriplets:940 » IllegalArgument lineSeparator must not contain b...
  Base64Test.testStringToByteVariations:1210 » IllegalArgument lineSeparator mus...
  Base64Test.testSingletonsChunked:831 » IllegalArgument lineSeparator must not ...
  Base64Test.testKnownDecodings:431 » IllegalArgument lineSeparator must not con...
  Base64Test.testPairs:547 » IllegalArgument lineSeparator must not contain base...
  Base64Test.testUUID:1147 » IllegalArgument lineSeparator must not contain base...
  Base64Test.testEncodeDecodeSmall:364 » IllegalArgument lineSeparator must not ...
  Base64Test.testConstructors:210 » IllegalArgument lineSeparator must not conta...
  Base64Test.testObjectDecodeWithValidParameter:504 » IllegalArgument lineSepara...
  Base64Test.testCodeInteger1:149 » IllegalArgument lineSeparator must not conta...
  Base64Test.testCodeInteger2:158 » IllegalArgument lineSeparator must not conta...
  Base64Test.testCodeInteger3:169 » IllegalArgument lineSeparator must not conta...
  Base64Test.testCodeInteger4:186 » IllegalArgument lineSeparator must not conta...
  Base64Test.testObjectEncode:541 » IllegalArgument lineSeparator must not conta...
  Base64Test.testUrlSafe:1084 » IllegalArgument lineSeparator must not contain b...
  Base64Test.testObjectEncodeWithInvalidParameter:516 » IllegalArgument lineSepa...
  Base64Test.testEncodeDecodeRandom:349 » IllegalArgument lineSeparator must not...
  Base64Test.testDecodeWithWhitespace:311 » IllegalArgument lineSeparator must n...
  Base64Test.testDecodePadOnlyChunked:297 » IllegalArgument lineSeparator must n...
  Base64Test.testKnownEncodings:446 » IllegalArgument lineSeparator must not con...
  Base64Test.testIgnoringNonBase64InDecode:395 » IllegalArgument lineSeparator m...
  Base64Test.testCodec112:380 » IllegalArgument lineSeparator must not contain b...
  Base64Test.testDecodePadMarkerIndex2:272 » IllegalArgument lineSeparator must ...
  Base64Test.testDecodePadMarkerIndex3:280 » IllegalArgument lineSeparator must ...
  Base64Test.testIsUrlSafe:419 » IllegalArgument lineSeparator must not contain ...
  Base64Test.testEmptyBase64:338 » IllegalArgument lineSeparator must not contai...
  Base64Test.testSingletons:718 » IllegalArgument lineSeparator must not contain...
  Base64Test.testTripletsChunked:1008 » IllegalArgument lineSeparator must not c...
  Base64Test.testCodec68:141 » IllegalArgument lineSeparator must not contain ba...
  Base64Test.testRfc4648Section10DecodeEncode:670->testDecodeEncode:680 » IllegalArgument
  Base64Test.testObjectDecodeWithInvalidParameter:489 » IllegalArgument lineSepa...
  Base64Test.testDecodePadOnly:286 » IllegalArgument lineSeparator must not cont...
  Base64Test.testChunkedEncodeMultipleOf76:127 » IllegalArgument lineSeparator m...
  Base64Test.testBase64:82 » IllegalArgument lineSeparator must not contain base...
  Base64Test.testByteToStringVariations:1191 » IllegalArgument lineSeparator mus...
  Base64Test.testObjectEncodeWithValidParameter:531 » IllegalArgument lineSepara...
  Base64Test.testRfc4648Section10DecodeWithCrLf:620 » IllegalArgument lineSepara...
  Base64Test.testRfc4648Section10Decode:594 » IllegalArgument lineSeparator must...
  Base64Test.testRfc4648Section10Encode:646 » IllegalArgument lineSeparator must...
  Base64Test.testRfc4648Section10EncodeDecode:701->testEncodeDecode:712 » IllegalArgument
  Base64Test.testDecodeWithInnerPad:117 » IllegalArgument lineSeparator must not...
  BCodecTest.testUTF8RoundTrip:69 » IllegalArgument lineSeparator must not conta...
  BCodecTest.testBasicEncodeDecode:80 » IllegalArgument lineSeparator must not c...
  BCodecTest.testDecodeObjects:137 » IllegalArgument lineSeparator must not cont...
  BCodecTest.testEncodeObjects:112 » IllegalArgument lineSeparator must not cont...

Tests run: 662, Failures: 1, Errors: 73, Skipped: 1

[INFO] ------------------------------------------------------------------------
[INFO] BUILD FAILURE
[INFO] ------------------------------------------------------------------------
[INFO] Total time: 13.301s
[INFO] Finished at: Sun Aug 02 06:42:49 BST 2015
[INFO] Final Memory: 20M/287M
[INFO] ------------------------------------------------------------------------
[ERROR] Failed to execute goal org.apache.maven.plugins:maven-surefire-plugin:2.17:test (default-test) on project commons-codec: There are test failures.
[ERROR] 
[ERROR] Please refer to /home/perham/Study/LittleDarwin/Cases/commons-codec-1.10-src/target/surefire-reports for the individual test results.
[ERROR] -> [Help 1]
[ERROR] 
[ERROR] To see the full stack trace of the errors, re-run Maven with the -e switch.
[ERROR] Re-run Maven using the -X switch to enable full debug logging.
[ERROR] 
[ERROR] For more information about the errors and possible solutions, please read the following articles:
[ERROR] [Help 1] http://cwiki.apache.org/confluence/display/MAVEN/MojoFailureException
