[INFO] Scanning for projects...
[INFO]                                                                         
[INFO] ------------------------------------------------------------------------
[INFO] Building Apache Commons Codec 1.10
[INFO] ------------------------------------------------------------------------
[INFO] 
[INFO] --- maven-enforcer-plugin:1.3.1:enforce (enforce-maven-3) @ commons-codec ---
[INFO] 
[INFO] --- maven-antrun-plugin:1.7:run (javadoc.resources) @ commons-codec ---
[INFO] Executing tasks

main:
[INFO] Executed tasks
[INFO] 
[INFO] --- maven-remote-resources-plugin:1.5:process (default) @ commons-codec ---
[INFO] 
[INFO] --- buildnumber-maven-plugin:1.3:create (default) @ commons-codec ---
[INFO] Executing: /bin/sh -c cd /home/perham/Study/LittleDarwin/Cases/commons-codec-1.10-src && svn --non-interactive info
[INFO] Working directory: /home/perham/Study/LittleDarwin/Cases/commons-codec-1.10-src
[INFO] Storing buildNumber: ?????? at timestamp: 1438493418270
[INFO] Executing: /bin/sh -c cd /home/perham/Study/LittleDarwin/Cases/commons-codec-1.10-src && svn --non-interactive info
[INFO] Working directory: /home/perham/Study/LittleDarwin/Cases/commons-codec-1.10-src
[INFO] Storing buildScmBranch: UNKNOWN_BRANCH
[INFO] 
[INFO] --- maven-resources-plugin:2.7:resources (default-resources) @ commons-codec ---
[INFO] Using 'UTF-8' encoding to copy filtered resources.
[INFO] Copying 128 resources
[INFO] Copying 2 resources to META-INF
[INFO] 
[INFO] --- maven-compiler-plugin:3.2:compile (default-compile) @ commons-codec ---
[INFO] Changes detected - recompiling the module!
[INFO] Compiling 60 source files to /home/perham/Study/LittleDarwin/Cases/commons-codec-1.10-src/target/classes
[INFO] /home/perham/Study/LittleDarwin/Cases/commons-codec-1.10-src/src/main/java/org/apache/commons/codec/digest/Sha2Crypt.java: Some input files use or override a deprecated API.
[INFO] /home/perham/Study/LittleDarwin/Cases/commons-codec-1.10-src/src/main/java/org/apache/commons/codec/digest/Sha2Crypt.java: Recompile with -Xlint:deprecation for details.
[INFO] 
[INFO] --- maven-bundle-plugin:2.5.3:manifest (bundle-manifest) @ commons-codec ---
[INFO] 
[INFO] --- maven-resources-plugin:2.7:testResources (default-testResources) @ commons-codec ---
[INFO] Using 'UTF-8' encoding to copy filtered resources.
[INFO] skip non existing resourceDirectory /home/perham/Study/LittleDarwin/Cases/commons-codec-1.10-src/src/test/resources
[INFO] Copying 2 resources to META-INF
[INFO] 
[INFO] --- maven-compiler-plugin:3.2:testCompile (default-testCompile) @ commons-codec ---
[INFO] Nothing to compile - all classes are up to date
[INFO] 
[INFO] --- maven-surefire-plugin:2.17:test (default-test) @ commons-codec ---
[INFO] Surefire report directory: /home/perham/Study/LittleDarwin/Cases/commons-codec-1.10-src/target/surefire-reports

-------------------------------------------------------
 T E S T S
-------------------------------------------------------
Running org.apache.commons.codec.digest.B64Test
Tests run: 2, Failures: 0, Errors: 0, Skipped: 0, Time elapsed: 0.027 sec - in org.apache.commons.codec.digest.B64Test
Running org.apache.commons.codec.digest.DigestUtilsTest
Tests run: 17, Failures: 0, Errors: 0, Skipped: 0, Time elapsed: 0.671 sec - in org.apache.commons.codec.digest.DigestUtilsTest
Running org.apache.commons.codec.digest.Sha512CryptTest
Tests run: 8, Failures: 0, Errors: 0, Skipped: 0, Time elapsed: 0.468 sec - in org.apache.commons.codec.digest.Sha512CryptTest
Running org.apache.commons.codec.digest.Apr1CryptTest
Tests run: 8, Failures: 0, Errors: 0, Skipped: 0, Time elapsed: 0.076 sec - in org.apache.commons.codec.digest.Apr1CryptTest
Running org.apache.commons.codec.digest.HmacUtilsTest
Tests run: 24, Failures: 0, Errors: 0, Skipped: 0, Time elapsed: 0.042 sec - in org.apache.commons.codec.digest.HmacUtilsTest
Running org.apache.commons.codec.digest.Sha2CryptTest
Tests run: 1, Failures: 0, Errors: 0, Skipped: 0, Time elapsed: 0.001 sec - in org.apache.commons.codec.digest.Sha2CryptTest
Running org.apache.commons.codec.digest.CryptTest
Tests run: 4, Failures: 0, Errors: 0, Skipped: 0, Time elapsed: 0.101 sec - in org.apache.commons.codec.digest.CryptTest
Running org.apache.commons.codec.digest.Sha256CryptTest
Tests run: 7, Failures: 0, Errors: 0, Skipped: 0, Time elapsed: 0.106 sec - in org.apache.commons.codec.digest.Sha256CryptTest
Running org.apache.commons.codec.digest.Md5CryptTest
Tests run: 7, Failures: 0, Errors: 0, Skipped: 0, Time elapsed: 0.016 sec - in org.apache.commons.codec.digest.Md5CryptTest
Running org.apache.commons.codec.digest.UnixCryptTest
Tests run: 9, Failures: 0, Errors: 0, Skipped: 0, Time elapsed: 0.009 sec - in org.apache.commons.codec.digest.UnixCryptTest
Running org.apache.commons.codec.CharsetsTest
Tests run: 7, Failures: 0, Errors: 0, Skipped: 0, Time elapsed: 0 sec - in org.apache.commons.codec.CharsetsTest
Running org.apache.commons.codec.binary.Base32Test
Tests run: 8, Failures: 0, Errors: 0, Skipped: 0, Time elapsed: 0.007 sec - in org.apache.commons.codec.binary.Base32Test
Running org.apache.commons.codec.binary.Base64OutputStreamTest
Tests run: 7, Failures: 2, Errors: 0, Skipped: 0, Time elapsed: 0.012 sec <<< FAILURE! - in org.apache.commons.codec.binary.Base64OutputStreamTest
testBase64OutputStreamByteByByte(org.apache.commons.codec.binary.Base64OutputStreamTest)  Time elapsed: 0.008 sec  <<< FAILURE!
java.lang.AssertionError: Streaming byte-by-byte base64 encode
	at org.junit.Assert.fail(Assert.java:88)
	at org.junit.Assert.assertTrue(Assert.java:41)
	at org.apache.commons.codec.binary.Base64OutputStreamTest.testByteByByte(Base64OutputStreamTest.java:249)
	at org.apache.commons.codec.binary.Base64OutputStreamTest.testBase64OutputStreamByteByByte(Base64OutputStreamTest.java:149)

testBase64OutputStreamByChunk(org.apache.commons.codec.binary.Base64OutputStreamTest)  Time elapsed: 0.001 sec  <<< FAILURE!
java.lang.AssertionError: Streaming chunked base64 encode
	at org.junit.Assert.fail(Assert.java:88)
	at org.junit.Assert.assertTrue(Assert.java:41)
	at org.apache.commons.codec.binary.Base64OutputStreamTest.testByChunk(Base64OutputStreamTest.java:197)
	at org.apache.commons.codec.binary.Base64OutputStreamTest.testBase64OutputStreamByChunk(Base64OutputStreamTest.java:111)

Running org.apache.commons.codec.binary.Base64Codec13Test
Tests run: 8, Failures: 4, Errors: 0, Skipped: 0, Time elapsed: 0.014 sec <<< FAILURE! - in org.apache.commons.codec.binary.Base64Codec13Test
testEncoder(org.apache.commons.codec.binary.Base64Codec13Test)  Time elapsed: 0 sec  <<< FAILURE!
java.lang.AssertionError: Encoder test-1
	at org.junit.Assert.fail(Assert.java:88)
	at org.junit.Assert.assertTrue(Assert.java:41)
	at org.apache.commons.codec.binary.Base64Codec13Test.testEncoder(Base64Codec13Test.java:372)

testBinaryEncoder(org.apache.commons.codec.binary.Base64Codec13Test)  Time elapsed: 0 sec  <<< FAILURE!
java.lang.AssertionError: BinaryEncoder test-1
	at org.junit.Assert.fail(Assert.java:88)
	at org.junit.Assert.assertTrue(Assert.java:41)
	at org.apache.commons.codec.binary.Base64Codec13Test.testBinaryEncoder(Base64Codec13Test.java:410)

testStaticEncodeChunked(org.apache.commons.codec.binary.Base64Codec13Test)  Time elapsed: 0.001 sec  <<< FAILURE!
java.lang.AssertionError: static Base64.encodeBase64Chunked() test-1
	at org.junit.Assert.fail(Assert.java:88)
	at org.junit.Assert.assertTrue(Assert.java:41)
	at org.apache.commons.codec.binary.Base64Codec13Test.testStaticEncodeChunked(Base64Codec13Test.java:483)

testStaticEncode(org.apache.commons.codec.binary.Base64Codec13Test)  Time elapsed: 0 sec  <<< FAILURE!
java.lang.AssertionError: static Base64.encodeBase64() test-1
	at org.junit.Assert.fail(Assert.java:88)
	at org.junit.Assert.assertTrue(Assert.java:41)
	at org.apache.commons.codec.binary.Base64Codec13Test.testStaticEncode(Base64Codec13Test.java:447)

Running org.apache.commons.codec.binary.Base64InputStreamTest
Tests run: 19, Failures: 2, Errors: 0, Skipped: 0, Time elapsed: 0.011 sec <<< FAILURE! - in org.apache.commons.codec.binary.Base64InputStreamTest
testBase64InputStreamByChunk(org.apache.commons.codec.binary.Base64InputStreamTest)  Time elapsed: 0.001 sec  <<< FAILURE!
java.lang.AssertionError: Streaming base64 encode
	at org.junit.Assert.fail(Assert.java:88)
	at org.junit.Assert.assertTrue(Assert.java:41)
	at org.apache.commons.codec.binary.Base64InputStreamTest.testByChunk(Base64InputStreamTest.java:308)
	at org.apache.commons.codec.binary.Base64InputStreamTest.testBase64InputStreamByChunk(Base64InputStreamTest.java:221)

testBase64InputStreamByteByByte(org.apache.commons.codec.binary.Base64InputStreamTest)  Time elapsed: 0 sec  <<< FAILURE!
java.lang.AssertionError: Streaming base64 encode
	at org.junit.Assert.fail(Assert.java:88)
	at org.junit.Assert.assertTrue(Assert.java:41)
	at org.apache.commons.codec.binary.Base64InputStreamTest.testByteByByte(Base64InputStreamTest.java:364)
	at org.apache.commons.codec.binary.Base64InputStreamTest.testBase64InputStreamByteByByte(Base64InputStreamTest.java:259)

Running org.apache.commons.codec.binary.Base32InputStreamTest
Tests run: 16, Failures: 0, Errors: 0, Skipped: 0, Time elapsed: 0.142 sec - in org.apache.commons.codec.binary.Base32InputStreamTest
Running org.apache.commons.codec.binary.Base32OutputStreamTest
Tests run: 6, Failures: 0, Errors: 0, Skipped: 0, Time elapsed: 0.091 sec - in org.apache.commons.codec.binary.Base32OutputStreamTest
Running org.apache.commons.codec.binary.BinaryCodecTest
Tests run: 13, Failures: 0, Errors: 0, Skipped: 0, Time elapsed: 0.01 sec - in org.apache.commons.codec.binary.BinaryCodecTest
Running org.apache.commons.codec.binary.BaseNCodecTest
Tests run: 7, Failures: 0, Errors: 0, Skipped: 0, Time elapsed: 0.002 sec - in org.apache.commons.codec.binary.BaseNCodecTest
Running org.apache.commons.codec.binary.StringUtilsTest
Tests run: 17, Failures: 0, Errors: 0, Skipped: 0, Time elapsed: 0.023 sec - in org.apache.commons.codec.binary.StringUtilsTest
Running org.apache.commons.codec.binary.Base64Test
Tests run: 53, Failures: 11, Errors: 1, Skipped: 1, Time elapsed: 0.05 sec <<< FAILURE! - in org.apache.commons.codec.binary.Base64Test
testSingletonsChunked(org.apache.commons.codec.binary.Base64Test)  Time elapsed: 0.001 sec  <<< FAILURE!
org.junit.ComparisonFailure: expected:<[AA]==
> but was:<[]==
>
	at org.junit.Assert.assertEquals(Assert.java:115)
	at org.junit.Assert.assertEquals(Assert.java:144)
	at org.apache.commons.codec.binary.Base64Test.testSingletonsChunked(Base64Test.java:831)

testUUID(org.apache.commons.codec.binary.Base64Test)  Time elapsed: 0 sec  <<< FAILURE!
java.lang.AssertionError: standard encode uuid
	at org.junit.Assert.fail(Assert.java:88)
	at org.junit.Assert.assertTrue(Assert.java:41)
	at org.apache.commons.codec.binary.Base64Test.testUUID(Base64Test.java:1180)

testEncodeDecodeSmall(org.apache.commons.codec.binary.Base64Test)  Time elapsed: 0.001 sec  <<< FAILURE!
java.lang.AssertionError: -95 equals 
	at org.junit.Assert.fail(Assert.java:88)
	at org.junit.Assert.assertTrue(Assert.java:41)
	at org.apache.commons.codec.binary.Base64Test.testEncodeDecodeSmall(Base64Test.java:365)

testCodeInteger3(org.apache.commons.codec.binary.Base64Test)  Time elapsed: 0 sec  <<< FAILURE!
org.junit.ComparisonFailure: expected:<...8uWz1itkYMZF0/aKDK0Y[jg]==> but was:<...8uWz1itkYMZF0/aKDK0Y[]==>
	at org.junit.Assert.assertEquals(Assert.java:115)
	at org.junit.Assert.assertEquals(Assert.java:144)
	at org.apache.commons.codec.binary.Base64Test.testCodeInteger3(Base64Test.java:169)

testUrlSafe(org.apache.commons.codec.binary.Base64Test)  Time elapsed: 0 sec  <<< FAILURE!
java.lang.AssertionError: url-safe i=1
	at org.junit.Assert.fail(Assert.java:88)
	at org.junit.Assert.assertTrue(Assert.java:41)
	at org.apache.commons.codec.binary.Base64Test.testUrlSafe(Base64Test.java:1085)

testKnownEncodings(org.apache.commons.codec.binary.Base64Test)  Time elapsed: 0.001 sec  <<< FAILURE!
org.junit.ComparisonFailure: expected:<...ciB0aGUgbGF6eSBkb2dz[Lg]==> but was:<...ciB0aGUgbGF6eSBkb2dz[]==>
	at org.junit.Assert.assertEquals(Assert.java:115)
	at org.junit.Assert.assertEquals(Assert.java:144)
	at org.apache.commons.codec.binary.Base64Test.testKnownEncodings(Base64Test.java:446)

testCodec112(org.apache.commons.codec.binary.Base64Test)  Time elapsed: 0.004 sec  <<< ERROR!
java.lang.IllegalArgumentException: Input array too big, the output array would be bigger (4) than the specified maximum size of 2
	at org.apache.commons.codec.binary.Base64.encodeBase64(Base64.java:116)
	at org.apache.commons.codec.binary.Base64Test.testCodec112(Base64Test.java:381)

testSingletons(org.apache.commons.codec.binary.Base64Test)  Time elapsed: 0.001 sec  <<< FAILURE!
org.junit.ComparisonFailure: expected:<[AA]==> but was:<[]==>
	at org.junit.Assert.assertEquals(Assert.java:115)
	at org.junit.Assert.assertEquals(Assert.java:144)
	at org.apache.commons.codec.binary.Base64Test.testSingletons(Base64Test.java:718)

testRfc4648Section10DecodeEncode(org.apache.commons.codec.binary.Base64Test)  Time elapsed: 0 sec  <<< FAILURE!
org.junit.ComparisonFailure: expected:<[Zg]==> but was:<[]==>
	at org.junit.Assert.assertEquals(Assert.java:115)
	at org.junit.Assert.assertEquals(Assert.java:144)
	at org.apache.commons.codec.binary.Base64Test.testDecodeEncode(Base64Test.java:682)
	at org.apache.commons.codec.binary.Base64Test.testRfc4648Section10DecodeEncode(Base64Test.java:671)

testByteToStringVariations(org.apache.commons.codec.binary.Base64Test)  Time elapsed: 0 sec  <<< FAILURE!
org.junit.ComparisonFailure: byteToString UUID expected:<K/fMJwH+Q5e0nr7tWsxw[kA]==> but was:<K/fMJwH+Q5e0nr7tWsxw[]==>
	at org.junit.Assert.assertEquals(Assert.java:115)
	at org.apache.commons.codec.binary.Base64Test.testByteToStringVariations(Base64Test.java:1203)

testRfc4648Section10Encode(org.apache.commons.codec.binary.Base64Test)  Time elapsed: 0 sec  <<< FAILURE!
org.junit.ComparisonFailure: expected:<[Zg]==> but was:<[]==>
	at org.junit.Assert.assertEquals(Assert.java:115)
	at org.junit.Assert.assertEquals(Assert.java:144)
	at org.apache.commons.codec.binary.Base64Test.testRfc4648Section10Encode(Base64Test.java:646)

testRfc4648Section10EncodeDecode(org.apache.commons.codec.binary.Base64Test)  Time elapsed: 0 sec  <<< FAILURE!
org.junit.ComparisonFailure: expected:<[f]> but was:<[]>
	at org.junit.Assert.assertEquals(Assert.java:115)
	at org.junit.Assert.assertEquals(Assert.java:144)
	at org.apache.commons.codec.binary.Base64Test.testEncodeDecode(Base64Test.java:713)
	at org.apache.commons.codec.binary.Base64Test.testRfc4648Section10EncodeDecode(Base64Test.java:702)

Running org.apache.commons.codec.binary.HexTest
Tests run: 19, Failures: 0, Errors: 0, Skipped: 0, Time elapsed: 0.182 sec - in org.apache.commons.codec.binary.HexTest
Running org.apache.commons.codec.DecoderExceptionTest
Tests run: 4, Failures: 0, Errors: 0, Skipped: 0, Time elapsed: 0.001 sec - in org.apache.commons.codec.DecoderExceptionTest
Running org.apache.commons.codec.EncoderExceptionTest
Tests run: 4, Failures: 0, Errors: 0, Skipped: 0, Time elapsed: 0 sec - in org.apache.commons.codec.EncoderExceptionTest
Running org.apache.commons.codec.net.BCodecTest
Tests run: 9, Failures: 0, Errors: 0, Skipped: 0, Time elapsed: 0.004 sec - in org.apache.commons.codec.net.BCodecTest
Running org.apache.commons.codec.net.QCodecTest
Tests run: 12, Failures: 0, Errors: 0, Skipped: 0, Time elapsed: 0.006 sec - in org.apache.commons.codec.net.QCodecTest
Running org.apache.commons.codec.net.UtilsTest
Tests run: 1, Failures: 0, Errors: 0, Skipped: 0, Time elapsed: 0 sec - in org.apache.commons.codec.net.UtilsTest
Running org.apache.commons.codec.net.RFC1522CodecTest
Tests run: 2, Failures: 0, Errors: 0, Skipped: 0, Time elapsed: 0 sec - in org.apache.commons.codec.net.RFC1522CodecTest
Running org.apache.commons.codec.net.URLCodecTest
Tests run: 16, Failures: 0, Errors: 0, Skipped: 0, Time elapsed: 0.008 sec - in org.apache.commons.codec.net.URLCodecTest
Running org.apache.commons.codec.net.QuotedPrintableCodecTest
Tests run: 21, Failures: 0, Errors: 0, Skipped: 0, Time elapsed: 0.01 sec - in org.apache.commons.codec.net.QuotedPrintableCodecTest
Running org.apache.commons.codec.StringEncoderComparatorTest
Tests run: 3, Failures: 0, Errors: 0, Skipped: 0, Time elapsed: 0.005 sec - in org.apache.commons.codec.StringEncoderComparatorTest
Running org.apache.commons.codec.language.Caverphone1Test
Tests run: 9, Failures: 0, Errors: 0, Skipped: 0, Time elapsed: 0.03 sec - in org.apache.commons.codec.language.Caverphone1Test
Running org.apache.commons.codec.language.NysiisTest
Tests run: 23, Failures: 0, Errors: 0, Skipped: 0, Time elapsed: 0.016 sec - in org.apache.commons.codec.language.NysiisTest
Running org.apache.commons.codec.language.Caverphone2Test
Tests run: 13, Failures: 0, Errors: 0, Skipped: 0, Time elapsed: 0.131 sec - in org.apache.commons.codec.language.Caverphone2Test
Running org.apache.commons.codec.language.DaitchMokotoffSoundexTest
Tests run: 13, Failures: 0, Errors: 0, Skipped: 0, Time elapsed: 0.047 sec - in org.apache.commons.codec.language.DaitchMokotoffSoundexTest
Running org.apache.commons.codec.language.bm.BeiderMorseEncoderTest
Tests run: 22, Failures: 0, Errors: 0, Skipped: 0, Time elapsed: 2.958 sec - in org.apache.commons.codec.language.bm.BeiderMorseEncoderTest
Running org.apache.commons.codec.language.bm.PhoneticEngineTest
Tests run: 8, Failures: 0, Errors: 0, Skipped: 0, Time elapsed: 0.02 sec - in org.apache.commons.codec.language.bm.PhoneticEngineTest
Running org.apache.commons.codec.language.bm.PhoneticEngineRegressionTest
Tests run: 4, Failures: 0, Errors: 0, Skipped: 0, Time elapsed: 0.013 sec - in org.apache.commons.codec.language.bm.PhoneticEngineRegressionTest
Running org.apache.commons.codec.language.bm.RuleTest
Tests run: 3, Failures: 0, Errors: 0, Skipped: 0, Time elapsed: 0.002 sec - in org.apache.commons.codec.language.bm.RuleTest
Running org.apache.commons.codec.language.bm.LanguageGuessingTest
Tests run: 18, Failures: 0, Errors: 0, Skipped: 0, Time elapsed: 0.015 sec - in org.apache.commons.codec.language.bm.LanguageGuessingTest
Running org.apache.commons.codec.language.DoubleMetaphoneTest
Tests run: 16, Failures: 0, Errors: 0, Skipped: 0, Time elapsed: 0.055 sec - in org.apache.commons.codec.language.DoubleMetaphoneTest
Running org.apache.commons.codec.language.SoundexTest
Tests run: 28, Failures: 0, Errors: 0, Skipped: 0, Time elapsed: 0.013 sec - in org.apache.commons.codec.language.SoundexTest
Running org.apache.commons.codec.language.RefinedSoundexTest
Tests run: 10, Failures: 0, Errors: 0, Skipped: 0, Time elapsed: 0.001 sec - in org.apache.commons.codec.language.RefinedSoundexTest
Running org.apache.commons.codec.language.MatchRatingApproachEncoderTest
Tests run: 96, Failures: 0, Errors: 0, Skipped: 0, Time elapsed: 0.037 sec - in org.apache.commons.codec.language.MatchRatingApproachEncoderTest
Running org.apache.commons.codec.language.ColognePhoneticTest
Tests run: 13, Failures: 0, Errors: 0, Skipped: 0, Time elapsed: 0.002 sec - in org.apache.commons.codec.language.ColognePhoneticTest
Running org.apache.commons.codec.language.DoubleMetaphone2Test
Tests run: 6, Failures: 0, Errors: 0, Skipped: 0, Time elapsed: 0.025 sec - in org.apache.commons.codec.language.DoubleMetaphone2Test
Running org.apache.commons.codec.language.MetaphoneTest
Tests run: 34, Failures: 0, Errors: 0, Skipped: 0, Time elapsed: 0.124 sec - in org.apache.commons.codec.language.MetaphoneTest
Running org.apache.commons.codec.CharEncodingTest
Tests run: 7, Failures: 0, Errors: 0, Skipped: 0, Time elapsed: 0.001 sec - in org.apache.commons.codec.CharEncodingTest

Results :

Failed tests: 
  Base64OutputStreamTest.testBase64OutputStreamByteByByte:149->testByteByByte:249 Streaming byte-by-byte base64 encode
  Base64OutputStreamTest.testBase64OutputStreamByChunk:111->testByChunk:197 Streaming chunked base64 encode
  Base64Codec13Test.testEncoder:372 Encoder test-1
  Base64Codec13Test.testBinaryEncoder:410 BinaryEncoder test-1
  Base64Codec13Test.testStaticEncodeChunked:483 static Base64.encodeBase64Chunked() test-1
  Base64Codec13Test.testStaticEncode:447 static Base64.encodeBase64() test-1
  Base64InputStreamTest.testBase64InputStreamByChunk:221->testByChunk:308 Streaming base64 encode
  Base64InputStreamTest.testBase64InputStreamByteByByte:259->testByteByByte:364 Streaming base64 encode
  Base64Test.testSingletonsChunked:831 expected:<[AA]==
> but was:<[]==
>
  Base64Test.testUUID:1180 standard encode uuid
  Base64Test.testEncodeDecodeSmall:365 -95 equals 
  Base64Test.testCodeInteger3:169 expected:<...8uWz1itkYMZF0/aKDK0Y[jg]==> but was:<...8uWz1itkYMZF0/aKDK0Y[]==>
  Base64Test.testUrlSafe:1085 url-safe i=1
  Base64Test.testKnownEncodings:446 expected:<...ciB0aGUgbGF6eSBkb2dz[Lg]==> but was:<...ciB0aGUgbGF6eSBkb2dz[]==>
  Base64Test.testSingletons:718 expected:<[AA]==> but was:<[]==>
  Base64Test.testRfc4648Section10DecodeEncode:671->testDecodeEncode:682 expected:<[Zg]==> but was:<[]==>
  Base64Test.testByteToStringVariations:1203 byteToString UUID expected:<K/fMJwH+Q5e0nr7tWsxw[kA]==> but was:<K/fMJwH+Q5e0nr7tWsxw[]==>
  Base64Test.testRfc4648Section10Encode:646 expected:<[Zg]==> but was:<[]==>
  Base64Test.testRfc4648Section10EncodeDecode:702->testEncodeDecode:713 expected:<[f]> but was:<[]>

Tests in error: 
  Base64Test.testCodec112:381 » IllegalArgument Input array too big, the output ...

Tests run: 662, Failures: 19, Errors: 1, Skipped: 1

[INFO] ------------------------------------------------------------------------
[INFO] BUILD FAILURE
[INFO] ------------------------------------------------------------------------
[INFO] Total time: 13.544s
[INFO] Finished at: Sun Aug 02 06:30:29 BST 2015
[INFO] Final Memory: 20M/287M
[INFO] ------------------------------------------------------------------------
[ERROR] Failed to execute goal org.apache.maven.plugins:maven-surefire-plugin:2.17:test (default-test) on project commons-codec: There are test failures.
[ERROR] 
[ERROR] Please refer to /home/perham/Study/LittleDarwin/Cases/commons-codec-1.10-src/target/surefire-reports for the individual test results.
[ERROR] -> [Help 1]
[ERROR] 
[ERROR] To see the full stack trace of the errors, re-run Maven with the -e switch.
[ERROR] Re-run Maven using the -X switch to enable full debug logging.
[ERROR] 
[ERROR] For more information about the errors and possible solutions, please read the following articles:
[ERROR] [Help 1] http://cwiki.apache.org/confluence/display/MAVEN/MojoFailureException
