[INFO] Scanning for projects...
[INFO]                                                                         
[INFO] ------------------------------------------------------------------------
[INFO] Building Apache Commons Codec 1.10
[INFO] ------------------------------------------------------------------------
[INFO] 
[INFO] --- maven-enforcer-plugin:1.3.1:enforce (enforce-maven-3) @ commons-codec ---
[INFO] 
[INFO] --- maven-antrun-plugin:1.7:run (javadoc.resources) @ commons-codec ---
[INFO] Executing tasks

main:
[INFO] Executed tasks
[INFO] 
[INFO] --- maven-remote-resources-plugin:1.5:process (default) @ commons-codec ---
[INFO] 
[INFO] --- buildnumber-maven-plugin:1.3:create (default) @ commons-codec ---
[INFO] Executing: /bin/sh -c cd /home/perham/Study/LittleDarwin/Cases/commons-codec-1.10-src && svn --non-interactive info
[INFO] Working directory: /home/perham/Study/LittleDarwin/Cases/commons-codec-1.10-src
[INFO] Storing buildNumber: ?????? at timestamp: 1438493309080
[INFO] Executing: /bin/sh -c cd /home/perham/Study/LittleDarwin/Cases/commons-codec-1.10-src && svn --non-interactive info
[INFO] Working directory: /home/perham/Study/LittleDarwin/Cases/commons-codec-1.10-src
[INFO] Storing buildScmBranch: UNKNOWN_BRANCH
[INFO] 
[INFO] --- maven-resources-plugin:2.7:resources (default-resources) @ commons-codec ---
[INFO] Using 'UTF-8' encoding to copy filtered resources.
[INFO] Copying 128 resources
[INFO] Copying 2 resources to META-INF
[INFO] 
[INFO] --- maven-compiler-plugin:3.2:compile (default-compile) @ commons-codec ---
[INFO] Changes detected - recompiling the module!
[INFO] Compiling 60 source files to /home/perham/Study/LittleDarwin/Cases/commons-codec-1.10-src/target/classes
[INFO] /home/perham/Study/LittleDarwin/Cases/commons-codec-1.10-src/src/main/java/org/apache/commons/codec/digest/Sha2Crypt.java: Some input files use or override a deprecated API.
[INFO] /home/perham/Study/LittleDarwin/Cases/commons-codec-1.10-src/src/main/java/org/apache/commons/codec/digest/Sha2Crypt.java: Recompile with -Xlint:deprecation for details.
[INFO] 
[INFO] --- maven-bundle-plugin:2.5.3:manifest (bundle-manifest) @ commons-codec ---
[INFO] 
[INFO] --- maven-resources-plugin:2.7:testResources (default-testResources) @ commons-codec ---
[INFO] Using 'UTF-8' encoding to copy filtered resources.
[INFO] skip non existing resourceDirectory /home/perham/Study/LittleDarwin/Cases/commons-codec-1.10-src/src/test/resources
[INFO] Copying 2 resources to META-INF
[INFO] 
[INFO] --- maven-compiler-plugin:3.2:testCompile (default-testCompile) @ commons-codec ---
[INFO] Nothing to compile - all classes are up to date
[INFO] 
[INFO] --- maven-surefire-plugin:2.17:test (default-test) @ commons-codec ---
[INFO] Surefire report directory: /home/perham/Study/LittleDarwin/Cases/commons-codec-1.10-src/target/surefire-reports

-------------------------------------------------------
 T E S T S
-------------------------------------------------------
Running org.apache.commons.codec.digest.B64Test
Tests run: 2, Failures: 0, Errors: 0, Skipped: 0, Time elapsed: 0.025 sec - in org.apache.commons.codec.digest.B64Test
Running org.apache.commons.codec.digest.DigestUtilsTest
Tests run: 17, Failures: 0, Errors: 0, Skipped: 0, Time elapsed: 0.677 sec - in org.apache.commons.codec.digest.DigestUtilsTest
Running org.apache.commons.codec.digest.Sha512CryptTest
Tests run: 8, Failures: 0, Errors: 0, Skipped: 0, Time elapsed: 0.493 sec - in org.apache.commons.codec.digest.Sha512CryptTest
Running org.apache.commons.codec.digest.Apr1CryptTest
Tests run: 8, Failures: 0, Errors: 0, Skipped: 0, Time elapsed: 0.071 sec - in org.apache.commons.codec.digest.Apr1CryptTest
Running org.apache.commons.codec.digest.HmacUtilsTest
Tests run: 24, Failures: 0, Errors: 0, Skipped: 0, Time elapsed: 0.043 sec - in org.apache.commons.codec.digest.HmacUtilsTest
Running org.apache.commons.codec.digest.Sha2CryptTest
Tests run: 1, Failures: 0, Errors: 0, Skipped: 0, Time elapsed: 0 sec - in org.apache.commons.codec.digest.Sha2CryptTest
Running org.apache.commons.codec.digest.CryptTest
Tests run: 4, Failures: 0, Errors: 0, Skipped: 0, Time elapsed: 0.089 sec - in org.apache.commons.codec.digest.CryptTest
Running org.apache.commons.codec.digest.Sha256CryptTest
Tests run: 7, Failures: 0, Errors: 0, Skipped: 0, Time elapsed: 0.11 sec - in org.apache.commons.codec.digest.Sha256CryptTest
Running org.apache.commons.codec.digest.Md5CryptTest
Tests run: 7, Failures: 0, Errors: 0, Skipped: 0, Time elapsed: 0.015 sec - in org.apache.commons.codec.digest.Md5CryptTest
Running org.apache.commons.codec.digest.UnixCryptTest
Tests run: 9, Failures: 0, Errors: 0, Skipped: 0, Time elapsed: 0.011 sec - in org.apache.commons.codec.digest.UnixCryptTest
Running org.apache.commons.codec.CharsetsTest
Tests run: 7, Failures: 0, Errors: 0, Skipped: 0, Time elapsed: 0.001 sec - in org.apache.commons.codec.CharsetsTest
Running org.apache.commons.codec.binary.Base32Test
Tests run: 8, Failures: 0, Errors: 0, Skipped: 0, Time elapsed: 0.007 sec - in org.apache.commons.codec.binary.Base32Test
Running org.apache.commons.codec.binary.Base64OutputStreamTest
Tests run: 7, Failures: 0, Errors: 2, Skipped: 0, Time elapsed: 0.013 sec <<< FAILURE! - in org.apache.commons.codec.binary.Base64OutputStreamTest
testBase64OutputStreamByteByByte(org.apache.commons.codec.binary.Base64OutputStreamTest)  Time elapsed: 0.006 sec  <<< ERROR!
java.lang.ArrayIndexOutOfBoundsException: 1
	at org.apache.commons.codec.binary.Base64.encode(Base64.java:64)
	at org.apache.commons.codec.binary.BaseNCodecOutputStream.write(BaseNCodecOutputStream.java:93)
	at org.apache.commons.codec.binary.BaseNCodecOutputStream.write(BaseNCodecOutputStream.java:62)
	at org.apache.commons.codec.binary.Base64OutputStreamTest.testByteByByte(Base64OutputStreamTest.java:245)
	at org.apache.commons.codec.binary.Base64OutputStreamTest.testBase64OutputStreamByteByByte(Base64OutputStreamTest.java:144)

testBase64OutputStreamByChunk(org.apache.commons.codec.binary.Base64OutputStreamTest)  Time elapsed: 0.001 sec  <<< ERROR!
java.lang.ArrayIndexOutOfBoundsException: 11
	at org.apache.commons.codec.binary.Base64.encode(Base64.java:64)
	at org.apache.commons.codec.binary.BaseNCodecOutputStream.write(BaseNCodecOutputStream.java:93)
	at java.io.FilterOutputStream.write(FilterOutputStream.java:97)
	at org.apache.commons.codec.binary.Base64OutputStreamTest.testByChunk(Base64OutputStreamTest.java:194)
	at org.apache.commons.codec.binary.Base64OutputStreamTest.testBase64OutputStreamByChunk(Base64OutputStreamTest.java:106)

Running org.apache.commons.codec.binary.Base64Codec13Test
Tests run: 8, Failures: 0, Errors: 4, Skipped: 0, Time elapsed: 0.014 sec <<< FAILURE! - in org.apache.commons.codec.binary.Base64Codec13Test
testEncoder(org.apache.commons.codec.binary.Base64Codec13Test)  Time elapsed: 0 sec  <<< ERROR!
java.lang.ArrayIndexOutOfBoundsException: 1
	at org.apache.commons.codec.binary.Base64.encode(Base64.java:64)
	at org.apache.commons.codec.binary.BaseNCodec.encode(BaseNCodec.java:430)
	at org.apache.commons.codec.binary.BaseNCodec.encode(BaseNCodec.java:338)
	at org.apache.commons.codec.binary.Base64Codec13Test.testEncoder(Base64Codec13Test.java:371)

testBinaryEncoder(org.apache.commons.codec.binary.Base64Codec13Test)  Time elapsed: 0.001 sec  <<< ERROR!
java.lang.ArrayIndexOutOfBoundsException: 1
	at org.apache.commons.codec.binary.Base64.encode(Base64.java:64)
	at org.apache.commons.codec.binary.BaseNCodec.encode(BaseNCodec.java:430)
	at org.apache.commons.codec.binary.Base64Codec13Test.testBinaryEncoder(Base64Codec13Test.java:409)

testStaticEncodeChunked(org.apache.commons.codec.binary.Base64Codec13Test)  Time elapsed: 0 sec  <<< ERROR!
java.lang.ArrayIndexOutOfBoundsException: 1
	at org.apache.commons.codec.binary.Base64.encode(Base64.java:64)
	at org.apache.commons.codec.binary.BaseNCodec.encode(BaseNCodec.java:430)
	at org.apache.commons.codec.binary.Base64.encodeBase64(Base64.java:117)
	at org.apache.commons.codec.binary.Base64.encodeBase64(Base64.java:112)
	at org.apache.commons.codec.binary.Base64.encodeBase64(Base64.java:111)
	at org.apache.commons.codec.binary.Base64.encodeBase64Chunked(Base64.java:110)
	at org.apache.commons.codec.binary.Base64Codec13Test.testStaticEncodeChunked(Base64Codec13Test.java:482)

testStaticEncode(org.apache.commons.codec.binary.Base64Codec13Test)  Time elapsed: 0 sec  <<< ERROR!
java.lang.ArrayIndexOutOfBoundsException: 1
	at org.apache.commons.codec.binary.Base64.encode(Base64.java:64)
	at org.apache.commons.codec.binary.BaseNCodec.encode(BaseNCodec.java:430)
	at org.apache.commons.codec.binary.Base64.encodeBase64(Base64.java:117)
	at org.apache.commons.codec.binary.Base64.encodeBase64(Base64.java:112)
	at org.apache.commons.codec.binary.Base64.encodeBase64(Base64.java:111)
	at org.apache.commons.codec.binary.Base64.encodeBase64(Base64.java:106)
	at org.apache.commons.codec.binary.Base64Codec13Test.testStaticEncode(Base64Codec13Test.java:446)

Running org.apache.commons.codec.binary.Base64InputStreamTest
Tests run: 19, Failures: 0, Errors: 4, Skipped: 0, Time elapsed: 0.013 sec <<< FAILURE! - in org.apache.commons.codec.binary.Base64InputStreamTest
testBase64InputStreamByChunk(org.apache.commons.codec.binary.Base64InputStreamTest)  Time elapsed: 0.001 sec  <<< ERROR!
java.lang.ArrayIndexOutOfBoundsException: 4096
	at org.apache.commons.codec.binary.Base64.encode(Base64.java:64)
	at org.apache.commons.codec.binary.BaseNCodecInputStream.read(BaseNCodecInputStream.java:160)
	at org.apache.commons.codec.binary.Base64TestData.fill(Base64TestData.java:172)
	at org.apache.commons.codec.binary.Base64TestData.streamToBytes(Base64TestData.java:149)
	at org.apache.commons.codec.binary.Base64TestData.streamToBytes(Base64TestData.java:144)
	at org.apache.commons.codec.binary.Base64InputStreamTest.testByChunk(Base64InputStreamTest.java:304)
	at org.apache.commons.codec.binary.Base64InputStreamTest.testBase64InputStreamByChunk(Base64InputStreamTest.java:216)

testCodec105(org.apache.commons.codec.binary.Base64InputStreamTest)  Time elapsed: 0.001 sec  <<< ERROR!
java.lang.ArrayIndexOutOfBoundsException: 4096
	at org.apache.commons.codec.binary.Base64.encode(Base64.java:64)
	at org.apache.commons.codec.binary.BaseNCodecInputStream.read(BaseNCodecInputStream.java:160)
	at org.apache.commons.codec.binary.BaseNCodecInputStream.read(BaseNCodecInputStream.java:97)
	at org.apache.commons.codec.binary.Base64InputStreamTest.testCodec105(Base64InputStreamTest.java:84)

testCodec130(org.apache.commons.codec.binary.Base64InputStreamTest)  Time elapsed: 0.001 sec  <<< ERROR!
java.lang.ArrayIndexOutOfBoundsException: 11
	at org.apache.commons.codec.binary.Base64.encode(Base64.java:64)
	at org.apache.commons.codec.binary.BaseNCodecOutputStream.write(BaseNCodecOutputStream.java:93)
	at java.io.FilterOutputStream.write(FilterOutputStream.java:97)
	at org.apache.commons.codec.binary.Base64InputStreamTest.testCodec130(Base64InputStreamTest.java:62)

testBase64InputStreamByteByByte(org.apache.commons.codec.binary.Base64InputStreamTest)  Time elapsed: 0.001 sec  <<< ERROR!
java.lang.ArrayIndexOutOfBoundsException: 4096
	at org.apache.commons.codec.binary.Base64.encode(Base64.java:64)
	at org.apache.commons.codec.binary.BaseNCodecInputStream.read(BaseNCodecInputStream.java:160)
	at org.apache.commons.codec.binary.BaseNCodecInputStream.read(BaseNCodecInputStream.java:97)
	at org.apache.commons.codec.binary.Base64InputStreamTest.testByteByByte(Base64InputStreamTest.java:359)
	at org.apache.commons.codec.binary.Base64InputStreamTest.testBase64InputStreamByteByByte(Base64InputStreamTest.java:254)

Running org.apache.commons.codec.binary.Base32InputStreamTest
Tests run: 16, Failures: 0, Errors: 0, Skipped: 0, Time elapsed: 0.134 sec - in org.apache.commons.codec.binary.Base32InputStreamTest
Running org.apache.commons.codec.binary.Base32OutputStreamTest
Tests run: 6, Failures: 0, Errors: 0, Skipped: 0, Time elapsed: 0.1 sec - in org.apache.commons.codec.binary.Base32OutputStreamTest
Running org.apache.commons.codec.binary.BinaryCodecTest
Tests run: 13, Failures: 0, Errors: 0, Skipped: 0, Time elapsed: 0.009 sec - in org.apache.commons.codec.binary.BinaryCodecTest
Running org.apache.commons.codec.binary.BaseNCodecTest
Tests run: 7, Failures: 0, Errors: 0, Skipped: 0, Time elapsed: 0.002 sec - in org.apache.commons.codec.binary.BaseNCodecTest
Running org.apache.commons.codec.binary.StringUtilsTest
Tests run: 17, Failures: 0, Errors: 0, Skipped: 0, Time elapsed: 0.023 sec - in org.apache.commons.codec.binary.StringUtilsTest
Running org.apache.commons.codec.binary.Base64Test
Tests run: 53, Failures: 0, Errors: 27, Skipped: 1, Time elapsed: 0.029 sec <<< FAILURE! - in org.apache.commons.codec.binary.Base64Test
testTriplets(org.apache.commons.codec.binary.Base64Test)  Time elapsed: 0.001 sec  <<< ERROR!
java.lang.ArrayIndexOutOfBoundsException: 3
	at org.apache.commons.codec.binary.Base64.encode(Base64.java:64)
	at org.apache.commons.codec.binary.BaseNCodec.encode(BaseNCodec.java:430)
	at org.apache.commons.codec.binary.Base64.encodeBase64(Base64.java:117)
	at org.apache.commons.codec.binary.Base64.encodeBase64(Base64.java:112)
	at org.apache.commons.codec.binary.Base64.encodeBase64(Base64.java:111)
	at org.apache.commons.codec.binary.Base64.encodeBase64(Base64.java:106)
	at org.apache.commons.codec.binary.Base64Test.testTriplets(Base64Test.java:940)

testConstructor_Int_ByteArray_Boolean_UrlSafe(org.apache.commons.codec.binary.Base64Test)  Time elapsed: 0 sec  <<< ERROR!
java.lang.ArrayIndexOutOfBoundsException: null

testSingletonsChunked(org.apache.commons.codec.binary.Base64Test)  Time elapsed: 0 sec  <<< ERROR!
java.lang.ArrayIndexOutOfBoundsException: 1
	at org.apache.commons.codec.binary.Base64.encode(Base64.java:64)
	at org.apache.commons.codec.binary.BaseNCodec.encode(BaseNCodec.java:430)
	at org.apache.commons.codec.binary.Base64.encodeBase64(Base64.java:117)
	at org.apache.commons.codec.binary.Base64.encodeBase64(Base64.java:112)
	at org.apache.commons.codec.binary.Base64.encodeBase64(Base64.java:111)
	at org.apache.commons.codec.binary.Base64.encodeBase64Chunked(Base64.java:110)
	at org.apache.commons.codec.binary.Base64Test.testSingletonsChunked(Base64Test.java:831)

testPairs(org.apache.commons.codec.binary.Base64Test)  Time elapsed: 0 sec  <<< ERROR!
java.lang.ArrayIndexOutOfBoundsException: 2
	at org.apache.commons.codec.binary.Base64.encode(Base64.java:64)
	at org.apache.commons.codec.binary.BaseNCodec.encode(BaseNCodec.java:430)
	at org.apache.commons.codec.binary.Base64.encodeBase64(Base64.java:117)
	at org.apache.commons.codec.binary.Base64.encodeBase64(Base64.java:112)
	at org.apache.commons.codec.binary.Base64.encodeBase64(Base64.java:111)
	at org.apache.commons.codec.binary.Base64.encodeBase64(Base64.java:106)
	at org.apache.commons.codec.binary.Base64Test.testPairs(Base64Test.java:547)

testUUID(org.apache.commons.codec.binary.Base64Test)  Time elapsed: 0.001 sec  <<< ERROR!
java.lang.ArrayIndexOutOfBoundsException: 16
	at org.apache.commons.codec.binary.Base64.encode(Base64.java:64)
	at org.apache.commons.codec.binary.BaseNCodec.encode(BaseNCodec.java:430)
	at org.apache.commons.codec.binary.Base64.encodeBase64(Base64.java:117)
	at org.apache.commons.codec.binary.Base64.encodeBase64(Base64.java:112)
	at org.apache.commons.codec.binary.Base64.encodeBase64(Base64.java:111)
	at org.apache.commons.codec.binary.Base64.encodeBase64(Base64.java:106)
	at org.apache.commons.codec.binary.Base64Test.testUUID(Base64Test.java:1147)

testEncodeDecodeSmall(org.apache.commons.codec.binary.Base64Test)  Time elapsed: 0 sec  <<< ERROR!
java.lang.ArrayIndexOutOfBoundsException: 1
	at org.apache.commons.codec.binary.Base64.encode(Base64.java:64)
	at org.apache.commons.codec.binary.BaseNCodec.encode(BaseNCodec.java:430)
	at org.apache.commons.codec.binary.Base64.encodeBase64(Base64.java:117)
	at org.apache.commons.codec.binary.Base64.encodeBase64(Base64.java:112)
	at org.apache.commons.codec.binary.Base64.encodeBase64(Base64.java:111)
	at org.apache.commons.codec.binary.Base64.encodeBase64(Base64.java:106)
	at org.apache.commons.codec.binary.Base64Test.testEncodeDecodeSmall(Base64Test.java:362)

testObjectDecodeWithValidParameter(org.apache.commons.codec.binary.Base64Test)  Time elapsed: 0 sec  <<< ERROR!
java.lang.ArrayIndexOutOfBoundsException: 12
	at org.apache.commons.codec.binary.Base64.encode(Base64.java:64)
	at org.apache.commons.codec.binary.BaseNCodec.encode(BaseNCodec.java:430)
	at org.apache.commons.codec.binary.Base64.encodeBase64(Base64.java:117)
	at org.apache.commons.codec.binary.Base64.encodeBase64(Base64.java:112)
	at org.apache.commons.codec.binary.Base64.encodeBase64(Base64.java:111)
	at org.apache.commons.codec.binary.Base64.encodeBase64(Base64.java:106)
	at org.apache.commons.codec.binary.Base64Test.testObjectDecodeWithValidParameter(Base64Test.java:504)

testCodeInteger1(org.apache.commons.codec.binary.Base64Test)  Time elapsed: 0.003 sec  <<< ERROR!
java.lang.ArrayIndexOutOfBoundsException: 20
	at org.apache.commons.codec.binary.Base64.encode(Base64.java:64)
	at org.apache.commons.codec.binary.BaseNCodec.encode(BaseNCodec.java:430)
	at org.apache.commons.codec.binary.Base64.encodeBase64(Base64.java:117)
	at org.apache.commons.codec.binary.Base64.encodeBase64(Base64.java:112)
	at org.apache.commons.codec.binary.Base64.encodeBase64(Base64.java:111)
	at org.apache.commons.codec.binary.Base64.encodeInteger(Base64.java:122)
	at org.apache.commons.codec.binary.Base64Test.testCodeInteger1(Base64Test.java:149)

testCodeInteger2(org.apache.commons.codec.binary.Base64Test)  Time elapsed: 0 sec  <<< ERROR!
java.lang.ArrayIndexOutOfBoundsException: 20
	at org.apache.commons.codec.binary.Base64.encode(Base64.java:64)
	at org.apache.commons.codec.binary.BaseNCodec.encode(BaseNCodec.java:430)
	at org.apache.commons.codec.binary.Base64.encodeBase64(Base64.java:117)
	at org.apache.commons.codec.binary.Base64.encodeBase64(Base64.java:112)
	at org.apache.commons.codec.binary.Base64.encodeBase64(Base64.java:111)
	at org.apache.commons.codec.binary.Base64.encodeInteger(Base64.java:122)
	at org.apache.commons.codec.binary.Base64Test.testCodeInteger2(Base64Test.java:158)

testCodeInteger3(org.apache.commons.codec.binary.Base64Test)  Time elapsed: 0 sec  <<< ERROR!
java.lang.ArrayIndexOutOfBoundsException: 64
	at org.apache.commons.codec.binary.Base64.encode(Base64.java:64)
	at org.apache.commons.codec.binary.BaseNCodec.encode(BaseNCodec.java:430)
	at org.apache.commons.codec.binary.Base64.encodeBase64(Base64.java:117)
	at org.apache.commons.codec.binary.Base64.encodeBase64(Base64.java:112)
	at org.apache.commons.codec.binary.Base64.encodeBase64(Base64.java:111)
	at org.apache.commons.codec.binary.Base64.encodeInteger(Base64.java:122)
	at org.apache.commons.codec.binary.Base64Test.testCodeInteger3(Base64Test.java:169)

testCodeInteger4(org.apache.commons.codec.binary.Base64Test)  Time elapsed: 0 sec  <<< ERROR!
java.lang.ArrayIndexOutOfBoundsException: 128
	at org.apache.commons.codec.binary.Base64.encode(Base64.java:64)
	at org.apache.commons.codec.binary.BaseNCodec.encode(BaseNCodec.java:430)
	at org.apache.commons.codec.binary.Base64.encodeBase64(Base64.java:117)
	at org.apache.commons.codec.binary.Base64.encodeBase64(Base64.java:112)
	at org.apache.commons.codec.binary.Base64.encodeBase64(Base64.java:111)
	at org.apache.commons.codec.binary.Base64.encodeInteger(Base64.java:122)
	at org.apache.commons.codec.binary.Base64Test.testCodeInteger4(Base64Test.java:186)

testObjectEncode(org.apache.commons.codec.binary.Base64Test)  Time elapsed: 0 sec  <<< ERROR!
java.lang.ArrayIndexOutOfBoundsException: 11
	at org.apache.commons.codec.binary.Base64.encode(Base64.java:64)
	at org.apache.commons.codec.binary.BaseNCodec.encode(BaseNCodec.java:430)
	at org.apache.commons.codec.binary.Base64Test.testObjectEncode(Base64Test.java:542)

testUrlSafe(org.apache.commons.codec.binary.Base64Test)  Time elapsed: 0 sec  <<< ERROR!
java.lang.ArrayIndexOutOfBoundsException: 1
	at org.apache.commons.codec.binary.Base64.encode(Base64.java:64)
	at org.apache.commons.codec.binary.BaseNCodec.encode(BaseNCodec.java:430)
	at org.apache.commons.codec.binary.Base64.encodeBase64(Base64.java:117)
	at org.apache.commons.codec.binary.Base64.encodeBase64(Base64.java:112)
	at org.apache.commons.codec.binary.Base64.encodeBase64URLSafe(Base64.java:108)
	at org.apache.commons.codec.binary.Base64TestData.randomData(Base64TestData.java:204)
	at org.apache.commons.codec.binary.Base64Test.testUrlSafe(Base64Test.java:1081)

testEncodeDecodeRandom(org.apache.commons.codec.binary.Base64Test)  Time elapsed: 0.001 sec  <<< ERROR!
java.lang.ArrayIndexOutOfBoundsException: 90
	at org.apache.commons.codec.binary.Base64.encode(Base64.java:64)
	at org.apache.commons.codec.binary.BaseNCodec.encode(BaseNCodec.java:430)
	at org.apache.commons.codec.binary.Base64.encodeBase64(Base64.java:117)
	at org.apache.commons.codec.binary.Base64.encodeBase64(Base64.java:112)
	at org.apache.commons.codec.binary.Base64.encodeBase64(Base64.java:111)
	at org.apache.commons.codec.binary.Base64.encodeBase64(Base64.java:106)
	at org.apache.commons.codec.binary.Base64Test.testEncodeDecodeRandom(Base64Test.java:349)

testDecodeWithWhitespace(org.apache.commons.codec.binary.Base64Test)  Time elapsed: 0 sec  <<< ERROR!
java.lang.ArrayIndexOutOfBoundsException: 24
	at org.apache.commons.codec.binary.Base64.encode(Base64.java:64)
	at org.apache.commons.codec.binary.BaseNCodec.encode(BaseNCodec.java:430)
	at org.apache.commons.codec.binary.Base64.encodeBase64(Base64.java:117)
	at org.apache.commons.codec.binary.Base64.encodeBase64(Base64.java:112)
	at org.apache.commons.codec.binary.Base64.encodeBase64(Base64.java:111)
	at org.apache.commons.codec.binary.Base64.encodeBase64(Base64.java:106)
	at org.apache.commons.codec.binary.Base64Test.testDecodeWithWhitespace(Base64Test.java:311)

testKnownEncodings(org.apache.commons.codec.binary.Base64Test)  Time elapsed: 0 sec  <<< ERROR!
java.lang.ArrayIndexOutOfBoundsException: null

testCodec112(org.apache.commons.codec.binary.Base64Test)  Time elapsed: 0 sec  <<< ERROR!
java.lang.ArrayIndexOutOfBoundsException: null

testSingletons(org.apache.commons.codec.binary.Base64Test)  Time elapsed: 0 sec  <<< ERROR!
java.lang.ArrayIndexOutOfBoundsException: null

testTripletsChunked(org.apache.commons.codec.binary.Base64Test)  Time elapsed: 0 sec  <<< ERROR!
java.lang.ArrayIndexOutOfBoundsException: null

testRfc4648Section10DecodeEncode(org.apache.commons.codec.binary.Base64Test)  Time elapsed: 0 sec  <<< ERROR!
java.lang.ArrayIndexOutOfBoundsException: null

testChunkedEncodeMultipleOf76(org.apache.commons.codec.binary.Base64Test)  Time elapsed: 0 sec  <<< ERROR!
java.lang.ArrayIndexOutOfBoundsException: null

testBase64(org.apache.commons.codec.binary.Base64Test)  Time elapsed: 0 sec  <<< ERROR!
java.lang.ArrayIndexOutOfBoundsException: null

testConstructor_Int_ByteArray_Boolean(org.apache.commons.codec.binary.Base64Test)  Time elapsed: 0 sec  <<< ERROR!
java.lang.ArrayIndexOutOfBoundsException: null

testByteToStringVariations(org.apache.commons.codec.binary.Base64Test)  Time elapsed: 0.001 sec  <<< ERROR!
java.lang.ArrayIndexOutOfBoundsException: null

testObjectEncodeWithValidParameter(org.apache.commons.codec.binary.Base64Test)  Time elapsed: 0 sec  <<< ERROR!
java.lang.ArrayIndexOutOfBoundsException: null

testRfc4648Section10Encode(org.apache.commons.codec.binary.Base64Test)  Time elapsed: 0 sec  <<< ERROR!
java.lang.ArrayIndexOutOfBoundsException: null

testRfc4648Section10EncodeDecode(org.apache.commons.codec.binary.Base64Test)  Time elapsed: 0.001 sec  <<< ERROR!
java.lang.ArrayIndexOutOfBoundsException: null

Running org.apache.commons.codec.binary.HexTest
Tests run: 19, Failures: 0, Errors: 0, Skipped: 0, Time elapsed: 0.17 sec - in org.apache.commons.codec.binary.HexTest
Running org.apache.commons.codec.DecoderExceptionTest
Tests run: 4, Failures: 0, Errors: 0, Skipped: 0, Time elapsed: 0 sec - in org.apache.commons.codec.DecoderExceptionTest
Running org.apache.commons.codec.EncoderExceptionTest
Tests run: 4, Failures: 0, Errors: 0, Skipped: 0, Time elapsed: 0.001 sec - in org.apache.commons.codec.EncoderExceptionTest
Running org.apache.commons.codec.net.BCodecTest
Tests run: 9, Failures: 0, Errors: 3, Skipped: 0, Time elapsed: 0.005 sec <<< FAILURE! - in org.apache.commons.codec.net.BCodecTest
testUTF8RoundTrip(org.apache.commons.codec.net.BCodecTest)  Time elapsed: 0.001 sec  <<< ERROR!
java.lang.ArrayIndexOutOfBoundsException: null

testBasicEncodeDecode(org.apache.commons.codec.net.BCodecTest)  Time elapsed: 0 sec  <<< ERROR!
java.lang.ArrayIndexOutOfBoundsException: null

testEncodeObjects(org.apache.commons.codec.net.BCodecTest)  Time elapsed: 0 sec  <<< ERROR!
java.lang.ArrayIndexOutOfBoundsException: null

Running org.apache.commons.codec.net.QCodecTest
Tests run: 12, Failures: 0, Errors: 0, Skipped: 0, Time elapsed: 0.005 sec - in org.apache.commons.codec.net.QCodecTest
Running org.apache.commons.codec.net.UtilsTest
Tests run: 1, Failures: 0, Errors: 0, Skipped: 0, Time elapsed: 0 sec - in org.apache.commons.codec.net.UtilsTest
Running org.apache.commons.codec.net.RFC1522CodecTest
Tests run: 2, Failures: 0, Errors: 0, Skipped: 0, Time elapsed: 0.002 sec - in org.apache.commons.codec.net.RFC1522CodecTest
Running org.apache.commons.codec.net.URLCodecTest
Tests run: 16, Failures: 0, Errors: 0, Skipped: 0, Time elapsed: 0.005 sec - in org.apache.commons.codec.net.URLCodecTest
Running org.apache.commons.codec.net.QuotedPrintableCodecTest
Tests run: 21, Failures: 0, Errors: 0, Skipped: 0, Time elapsed: 0.01 sec - in org.apache.commons.codec.net.QuotedPrintableCodecTest
Running org.apache.commons.codec.StringEncoderComparatorTest
Tests run: 3, Failures: 0, Errors: 0, Skipped: 0, Time elapsed: 0.004 sec - in org.apache.commons.codec.StringEncoderComparatorTest
Running org.apache.commons.codec.language.Caverphone1Test
Tests run: 9, Failures: 0, Errors: 0, Skipped: 0, Time elapsed: 0.03 sec - in org.apache.commons.codec.language.Caverphone1Test
Running org.apache.commons.codec.language.NysiisTest
Tests run: 23, Failures: 0, Errors: 0, Skipped: 0, Time elapsed: 0.017 sec - in org.apache.commons.codec.language.NysiisTest
Running org.apache.commons.codec.language.Caverphone2Test
Tests run: 13, Failures: 0, Errors: 0, Skipped: 0, Time elapsed: 0.128 sec - in org.apache.commons.codec.language.Caverphone2Test
Running org.apache.commons.codec.language.DaitchMokotoffSoundexTest
Tests run: 13, Failures: 0, Errors: 0, Skipped: 0, Time elapsed: 0.048 sec - in org.apache.commons.codec.language.DaitchMokotoffSoundexTest
Running org.apache.commons.codec.language.bm.BeiderMorseEncoderTest
Tests run: 22, Failures: 0, Errors: 0, Skipped: 0, Time elapsed: 2.93 sec - in org.apache.commons.codec.language.bm.BeiderMorseEncoderTest
Running org.apache.commons.codec.language.bm.PhoneticEngineTest
Tests run: 8, Failures: 0, Errors: 0, Skipped: 0, Time elapsed: 0.016 sec - in org.apache.commons.codec.language.bm.PhoneticEngineTest
Running org.apache.commons.codec.language.bm.PhoneticEngineRegressionTest
Tests run: 4, Failures: 0, Errors: 0, Skipped: 0, Time elapsed: 0.014 sec - in org.apache.commons.codec.language.bm.PhoneticEngineRegressionTest
Running org.apache.commons.codec.language.bm.RuleTest
Tests run: 3, Failures: 0, Errors: 0, Skipped: 0, Time elapsed: 0.002 sec - in org.apache.commons.codec.language.bm.RuleTest
Running org.apache.commons.codec.language.bm.LanguageGuessingTest
Tests run: 18, Failures: 0, Errors: 0, Skipped: 0, Time elapsed: 0.012 sec - in org.apache.commons.codec.language.bm.LanguageGuessingTest
Running org.apache.commons.codec.language.DoubleMetaphoneTest
Tests run: 16, Failures: 0, Errors: 0, Skipped: 0, Time elapsed: 0.046 sec - in org.apache.commons.codec.language.DoubleMetaphoneTest
Running org.apache.commons.codec.language.SoundexTest
Tests run: 28, Failures: 0, Errors: 0, Skipped: 0, Time elapsed: 0.01 sec - in org.apache.commons.codec.language.SoundexTest
Running org.apache.commons.codec.language.RefinedSoundexTest
Tests run: 10, Failures: 0, Errors: 0, Skipped: 0, Time elapsed: 0.002 sec - in org.apache.commons.codec.language.RefinedSoundexTest
Running org.apache.commons.codec.language.MatchRatingApproachEncoderTest
Tests run: 96, Failures: 0, Errors: 0, Skipped: 0, Time elapsed: 0.032 sec - in org.apache.commons.codec.language.MatchRatingApproachEncoderTest
Running org.apache.commons.codec.language.ColognePhoneticTest
Tests run: 13, Failures: 0, Errors: 0, Skipped: 0, Time elapsed: 0.003 sec - in org.apache.commons.codec.language.ColognePhoneticTest
Running org.apache.commons.codec.language.DoubleMetaphone2Test
Tests run: 6, Failures: 0, Errors: 0, Skipped: 0, Time elapsed: 0.027 sec - in org.apache.commons.codec.language.DoubleMetaphone2Test
Running org.apache.commons.codec.language.MetaphoneTest
Tests run: 34, Failures: 0, Errors: 0, Skipped: 0, Time elapsed: 0.091 sec - in org.apache.commons.codec.language.MetaphoneTest
Running org.apache.commons.codec.CharEncodingTest
Tests run: 7, Failures: 0, Errors: 0, Skipped: 0, Time elapsed: 0.001 sec - in org.apache.commons.codec.CharEncodingTest

Results :

Tests in error: 
  Base64OutputStreamTest.testBase64OutputStreamByteByByte:144->testByteByByte:245 » ArrayIndexOutOfBounds
  Base64OutputStreamTest.testBase64OutputStreamByChunk:106->testByChunk:194 » ArrayIndexOutOfBounds
  Base64Codec13Test.testEncoder:371 » ArrayIndexOutOfBounds 1
  Base64Codec13Test.testBinaryEncoder:409 » ArrayIndexOutOfBounds 1
  Base64Codec13Test.testStaticEncodeChunked:482 » ArrayIndexOutOfBounds 1
  Base64Codec13Test.testStaticEncode:446 » ArrayIndexOutOfBounds 1
  Base64InputStreamTest.testBase64InputStreamByChunk:216->testByChunk:304 » ArrayIndexOutOfBounds
  Base64InputStreamTest.testCodec105:84 » ArrayIndexOutOfBounds 4096
  Base64InputStreamTest.testCodec130:62 » ArrayIndexOutOfBounds 11
  Base64InputStreamTest.testBase64InputStreamByteByByte:254->testByteByByte:359 » ArrayIndexOutOfBounds
  Base64Test.testTriplets:940 » ArrayIndexOutOfBounds 3
  Base64Test.testConstructor_Int_ByteArray_Boolean_UrlSafe » ArrayIndexOutOfBounds
  Base64Test.testSingletonsChunked:831 » ArrayIndexOutOfBounds 1
  Base64Test.testPairs:547 » ArrayIndexOutOfBounds 2
  Base64Test.testUUID:1147 » ArrayIndexOutOfBounds 16
  Base64Test.testEncodeDecodeSmall:362 » ArrayIndexOutOfBounds 1
  Base64Test.testObjectDecodeWithValidParameter:504 » ArrayIndexOutOfBounds 12
  Base64Test.testCodeInteger1:149 » ArrayIndexOutOfBounds 20
  Base64Test.testCodeInteger2:158 » ArrayIndexOutOfBounds 20
  Base64Test.testCodeInteger3:169 » ArrayIndexOutOfBounds 64
  Base64Test.testCodeInteger4:186 » ArrayIndexOutOfBounds 128
  Base64Test.testObjectEncode:542 » ArrayIndexOutOfBounds 11
  Base64Test.testUrlSafe:1081 » ArrayIndexOutOfBounds 1
  Base64Test.testEncodeDecodeRandom:349 » ArrayIndexOutOfBounds 90
  Base64Test.testDecodeWithWhitespace:311 » ArrayIndexOutOfBounds 24
  Base64Test.testKnownEncodings » ArrayIndexOutOfBounds
  Base64Test.testCodec112 » ArrayIndexOutOfBounds
  Base64Test.testSingletons » ArrayIndexOutOfBounds
  Base64Test.testTripletsChunked » ArrayIndexOutOfBounds
  Base64Test.testRfc4648Section10DecodeEncode » ArrayIndexOutOfBounds
  Base64Test.testChunkedEncodeMultipleOf76 » ArrayIndexOutOfBounds
  Base64Test.testBase64 » ArrayIndexOutOfBounds
  Base64Test.testConstructor_Int_ByteArray_Boolean » ArrayIndexOutOfBounds
  Base64Test.testByteToStringVariations » ArrayIndexOutOfBounds
  Base64Test.testObjectEncodeWithValidParameter » ArrayIndexOutOfBounds
  Base64Test.testRfc4648Section10Encode » ArrayIndexOutOfBounds
  Base64Test.testRfc4648Section10EncodeDecode » ArrayIndexOutOfBounds
  BCodecTest.testUTF8RoundTrip » ArrayIndexOutOfBounds
  BCodecTest.testBasicEncodeDecode » ArrayIndexOutOfBounds
  BCodecTest.testEncodeObjects » ArrayIndexOutOfBounds

Tests run: 662, Failures: 0, Errors: 40, Skipped: 1

[INFO] ------------------------------------------------------------------------
[INFO] BUILD FAILURE
[INFO] ------------------------------------------------------------------------
[INFO] Total time: 13.295s
[INFO] Finished at: Sun Aug 02 06:28:39 BST 2015
[INFO] Final Memory: 20M/287M
[INFO] ------------------------------------------------------------------------
[ERROR] Failed to execute goal org.apache.maven.plugins:maven-surefire-plugin:2.17:test (default-test) on project commons-codec: There are test failures.
[ERROR] 
[ERROR] Please refer to /home/perham/Study/LittleDarwin/Cases/commons-codec-1.10-src/target/surefire-reports for the individual test results.
[ERROR] -> [Help 1]
[ERROR] 
[ERROR] To see the full stack trace of the errors, re-run Maven with the -e switch.
[ERROR] Re-run Maven using the -X switch to enable full debug logging.
[ERROR] 
[ERROR] For more information about the errors and possible solutions, please read the following articles:
[ERROR] [Help 1] http://cwiki.apache.org/confluence/display/MAVEN/MojoFailureException
