[INFO] Scanning for projects...
[INFO]                                                                         
[INFO] ------------------------------------------------------------------------
[INFO] Building Apache Commons Codec 1.10
[INFO] ------------------------------------------------------------------------
[INFO] 
[INFO] --- maven-enforcer-plugin:1.3.1:enforce (enforce-maven-3) @ commons-codec ---
[INFO] 
[INFO] --- maven-antrun-plugin:1.7:run (javadoc.resources) @ commons-codec ---
[INFO] Executing tasks

main:
[INFO] Executed tasks
[INFO] 
[INFO] --- maven-remote-resources-plugin:1.5:process (default) @ commons-codec ---
[INFO] 
[INFO] --- buildnumber-maven-plugin:1.3:create (default) @ commons-codec ---
[INFO] Executing: /bin/sh -c cd /home/perham/Study/LittleDarwin/Cases/commons-codec-1.10-src && svn --non-interactive info
[INFO] Working directory: /home/perham/Study/LittleDarwin/Cases/commons-codec-1.10-src
[INFO] Storing buildNumber: ?????? at timestamp: 1438493246372
[INFO] Executing: /bin/sh -c cd /home/perham/Study/LittleDarwin/Cases/commons-codec-1.10-src && svn --non-interactive info
[INFO] Working directory: /home/perham/Study/LittleDarwin/Cases/commons-codec-1.10-src
[INFO] Storing buildScmBranch: UNKNOWN_BRANCH
[INFO] 
[INFO] --- maven-resources-plugin:2.7:resources (default-resources) @ commons-codec ---
[INFO] Using 'UTF-8' encoding to copy filtered resources.
[INFO] Copying 128 resources
[INFO] Copying 2 resources to META-INF
[INFO] 
[INFO] --- maven-compiler-plugin:3.2:compile (default-compile) @ commons-codec ---
[INFO] Changes detected - recompiling the module!
[INFO] Compiling 60 source files to /home/perham/Study/LittleDarwin/Cases/commons-codec-1.10-src/target/classes
[INFO] /home/perham/Study/LittleDarwin/Cases/commons-codec-1.10-src/src/main/java/org/apache/commons/codec/digest/Sha2Crypt.java: Some input files use or override a deprecated API.
[INFO] /home/perham/Study/LittleDarwin/Cases/commons-codec-1.10-src/src/main/java/org/apache/commons/codec/digest/Sha2Crypt.java: Recompile with -Xlint:deprecation for details.
[INFO] 
[INFO] --- maven-bundle-plugin:2.5.3:manifest (bundle-manifest) @ commons-codec ---
[INFO] 
[INFO] --- maven-resources-plugin:2.7:testResources (default-testResources) @ commons-codec ---
[INFO] Using 'UTF-8' encoding to copy filtered resources.
[INFO] skip non existing resourceDirectory /home/perham/Study/LittleDarwin/Cases/commons-codec-1.10-src/src/test/resources
[INFO] Copying 2 resources to META-INF
[INFO] 
[INFO] --- maven-compiler-plugin:3.2:testCompile (default-testCompile) @ commons-codec ---
[INFO] Nothing to compile - all classes are up to date
[INFO] 
[INFO] --- maven-surefire-plugin:2.17:test (default-test) @ commons-codec ---
[INFO] Surefire report directory: /home/perham/Study/LittleDarwin/Cases/commons-codec-1.10-src/target/surefire-reports

-------------------------------------------------------
 T E S T S
-------------------------------------------------------
Running org.apache.commons.codec.digest.B64Test
Tests run: 2, Failures: 0, Errors: 0, Skipped: 0, Time elapsed: 0.023 sec - in org.apache.commons.codec.digest.B64Test
Running org.apache.commons.codec.digest.DigestUtilsTest
Tests run: 17, Failures: 0, Errors: 0, Skipped: 0, Time elapsed: 0.67 sec - in org.apache.commons.codec.digest.DigestUtilsTest
Running org.apache.commons.codec.digest.Sha512CryptTest
Tests run: 8, Failures: 0, Errors: 0, Skipped: 0, Time elapsed: 0.47 sec - in org.apache.commons.codec.digest.Sha512CryptTest
Running org.apache.commons.codec.digest.Apr1CryptTest
Tests run: 8, Failures: 0, Errors: 0, Skipped: 0, Time elapsed: 0.07 sec - in org.apache.commons.codec.digest.Apr1CryptTest
Running org.apache.commons.codec.digest.HmacUtilsTest
Tests run: 24, Failures: 0, Errors: 0, Skipped: 0, Time elapsed: 0.033 sec - in org.apache.commons.codec.digest.HmacUtilsTest
Running org.apache.commons.codec.digest.Sha2CryptTest
Tests run: 1, Failures: 0, Errors: 0, Skipped: 0, Time elapsed: 0 sec - in org.apache.commons.codec.digest.Sha2CryptTest
Running org.apache.commons.codec.digest.CryptTest
Tests run: 4, Failures: 0, Errors: 0, Skipped: 0, Time elapsed: 0.082 sec - in org.apache.commons.codec.digest.CryptTest
Running org.apache.commons.codec.digest.Sha256CryptTest
Tests run: 7, Failures: 0, Errors: 0, Skipped: 0, Time elapsed: 0.11 sec - in org.apache.commons.codec.digest.Sha256CryptTest
Running org.apache.commons.codec.digest.Md5CryptTest
Tests run: 7, Failures: 0, Errors: 0, Skipped: 0, Time elapsed: 0.019 sec - in org.apache.commons.codec.digest.Md5CryptTest
Running org.apache.commons.codec.digest.UnixCryptTest
Tests run: 9, Failures: 0, Errors: 0, Skipped: 0, Time elapsed: 0.007 sec - in org.apache.commons.codec.digest.UnixCryptTest
Running org.apache.commons.codec.CharsetsTest
Tests run: 7, Failures: 0, Errors: 0, Skipped: 0, Time elapsed: 0.001 sec - in org.apache.commons.codec.CharsetsTest
Running org.apache.commons.codec.binary.Base32Test
Tests run: 8, Failures: 0, Errors: 0, Skipped: 0, Time elapsed: 0.012 sec - in org.apache.commons.codec.binary.Base32Test
Running org.apache.commons.codec.binary.Base64OutputStreamTest
Tests run: 7, Failures: 2, Errors: 0, Skipped: 0, Time elapsed: 0.006 sec <<< FAILURE! - in org.apache.commons.codec.binary.Base64OutputStreamTest
testBase64OutputStreamByteByByte(org.apache.commons.codec.binary.Base64OutputStreamTest)  Time elapsed: 0.005 sec  <<< FAILURE!
java.lang.AssertionError: Streaming byte-by-byte base64 encode
	at org.junit.Assert.fail(Assert.java:88)
	at org.junit.Assert.assertTrue(Assert.java:41)
	at org.apache.commons.codec.binary.Base64OutputStreamTest.testByteByByte(Base64OutputStreamTest.java:249)
	at org.apache.commons.codec.binary.Base64OutputStreamTest.testBase64OutputStreamByteByByte(Base64OutputStreamTest.java:144)

testBase64OutputStreamByChunk(org.apache.commons.codec.binary.Base64OutputStreamTest)  Time elapsed: 0 sec  <<< FAILURE!
java.lang.AssertionError: Streaming chunked base64 encode
	at org.junit.Assert.fail(Assert.java:88)
	at org.junit.Assert.assertTrue(Assert.java:41)
	at org.apache.commons.codec.binary.Base64OutputStreamTest.testByChunk(Base64OutputStreamTest.java:197)
	at org.apache.commons.codec.binary.Base64OutputStreamTest.testBase64OutputStreamByChunk(Base64OutputStreamTest.java:106)

Running org.apache.commons.codec.binary.Base64Codec13Test
Tests run: 8, Failures: 4, Errors: 0, Skipped: 0, Time elapsed: 0.015 sec <<< FAILURE! - in org.apache.commons.codec.binary.Base64Codec13Test
testEncoder(org.apache.commons.codec.binary.Base64Codec13Test)  Time elapsed: 0 sec  <<< FAILURE!
java.lang.AssertionError: Encoder test-3
	at org.junit.Assert.fail(Assert.java:88)
	at org.junit.Assert.assertTrue(Assert.java:41)
	at org.apache.commons.codec.binary.Base64Codec13Test.testEncoder(Base64Codec13Test.java:372)

testBinaryEncoder(org.apache.commons.codec.binary.Base64Codec13Test)  Time elapsed: 0.001 sec  <<< FAILURE!
java.lang.AssertionError: BinaryEncoder test-3
	at org.junit.Assert.fail(Assert.java:88)
	at org.junit.Assert.assertTrue(Assert.java:41)
	at org.apache.commons.codec.binary.Base64Codec13Test.testBinaryEncoder(Base64Codec13Test.java:410)

testStaticEncodeChunked(org.apache.commons.codec.binary.Base64Codec13Test)  Time elapsed: 0 sec  <<< FAILURE!
java.lang.AssertionError: static Base64.encodeBase64Chunked() test-3
	at org.junit.Assert.fail(Assert.java:88)
	at org.junit.Assert.assertTrue(Assert.java:41)
	at org.apache.commons.codec.binary.Base64Codec13Test.testStaticEncodeChunked(Base64Codec13Test.java:483)

testStaticEncode(org.apache.commons.codec.binary.Base64Codec13Test)  Time elapsed: 0 sec  <<< FAILURE!
java.lang.AssertionError: static Base64.encodeBase64() test-3
	at org.junit.Assert.fail(Assert.java:88)
	at org.junit.Assert.assertTrue(Assert.java:41)
	at org.apache.commons.codec.binary.Base64Codec13Test.testStaticEncode(Base64Codec13Test.java:447)

Running org.apache.commons.codec.binary.Base64InputStreamTest
Tests run: 19, Failures: 3, Errors: 0, Skipped: 0, Time elapsed: 0.011 sec <<< FAILURE! - in org.apache.commons.codec.binary.Base64InputStreamTest
testBase64InputStreamByChunk(org.apache.commons.codec.binary.Base64InputStreamTest)  Time elapsed: 0 sec  <<< FAILURE!
java.lang.AssertionError: Streaming base64 encode
	at org.junit.Assert.fail(Assert.java:88)
	at org.junit.Assert.assertTrue(Assert.java:41)
	at org.apache.commons.codec.binary.Base64InputStreamTest.testByChunk(Base64InputStreamTest.java:308)
	at org.apache.commons.codec.binary.Base64InputStreamTest.testBase64InputStreamByChunk(Base64InputStreamTest.java:216)

testCodec130(org.apache.commons.codec.binary.Base64InputStreamTest)  Time elapsed: 0.002 sec  <<< FAILURE!
org.junit.ComparisonFailure: expected:<[ello World]> but was:<[��W&�]>
	at org.junit.Assert.assertEquals(Assert.java:115)
	at org.junit.Assert.assertEquals(Assert.java:144)
	at org.apache.commons.codec.binary.Base64InputStreamTest.testCodec130(Base64InputStreamTest.java:73)

testBase64InputStreamByteByByte(org.apache.commons.codec.binary.Base64InputStreamTest)  Time elapsed: 0 sec  <<< FAILURE!
java.lang.AssertionError: Streaming base64 encode
	at org.junit.Assert.fail(Assert.java:88)
	at org.junit.Assert.assertTrue(Assert.java:41)
	at org.apache.commons.codec.binary.Base64InputStreamTest.testByteByByte(Base64InputStreamTest.java:364)
	at org.apache.commons.codec.binary.Base64InputStreamTest.testBase64InputStreamByteByByte(Base64InputStreamTest.java:254)

Running org.apache.commons.codec.binary.Base32InputStreamTest
Tests run: 16, Failures: 0, Errors: 0, Skipped: 0, Time elapsed: 0.144 sec - in org.apache.commons.codec.binary.Base32InputStreamTest
Running org.apache.commons.codec.binary.Base32OutputStreamTest
Tests run: 6, Failures: 0, Errors: 0, Skipped: 0, Time elapsed: 0.1 sec - in org.apache.commons.codec.binary.Base32OutputStreamTest
Running org.apache.commons.codec.binary.BinaryCodecTest
Tests run: 13, Failures: 0, Errors: 0, Skipped: 0, Time elapsed: 0.01 sec - in org.apache.commons.codec.binary.BinaryCodecTest
Running org.apache.commons.codec.binary.BaseNCodecTest
Tests run: 7, Failures: 0, Errors: 0, Skipped: 0, Time elapsed: 0.002 sec - in org.apache.commons.codec.binary.BaseNCodecTest
Running org.apache.commons.codec.binary.StringUtilsTest
Tests run: 17, Failures: 0, Errors: 0, Skipped: 0, Time elapsed: 0.024 sec - in org.apache.commons.codec.binary.StringUtilsTest
Running org.apache.commons.codec.binary.Base64Test
Tests run: 53, Failures: 23, Errors: 0, Skipped: 1, Time elapsed: 0.037 sec <<< FAILURE! - in org.apache.commons.codec.binary.Base64Test
testTriplets(org.apache.commons.codec.binary.Base64Test)  Time elapsed: 0 sec  <<< FAILURE!
org.junit.ComparisonFailure: expected:<AA[AA]> but was:<AA[]>
	at org.junit.Assert.assertEquals(Assert.java:115)
	at org.junit.Assert.assertEquals(Assert.java:144)
	at org.apache.commons.codec.binary.Base64Test.testTriplets(Base64Test.java:940)

testConstructor_Int_ByteArray_Boolean_UrlSafe(org.apache.commons.codec.binary.Base64Test)  Time elapsed: 0.002 sec  <<< FAILURE!
org.junit.ComparisonFailure: new Base64(64, \t, true) expected:<9[NKvdIAct2SmOtWvSevDhaw5vkKIjYW9	xc_yplrQ7fcE9J54RAEbjhvYNT4eXJ_-	qTsepDNy12_yCgAvR9c_l8AsTGM1-uAd	iuzcLq2wq529Js8G76-ELm_vvOidMjQL	iHu9OgviDEvugdTzYyCGVe3dgIHddUTR	UeK--fbngQXIYMZt9S1cR7Pn_QWMeKZo	AWterHba_mr_jk0q3q1GM84TS8WFb1C_	Qf9H_BRJNsSa3bNnp4D7UatCJ-wcM9k5	1xB4ch0xkDWI9ktOKSPjWMxygG5fk9b1	tavnDvaSEnZwbVlM9lvTWigA0HAiOVnp	_M7q5BIQCTJkEuLzoa5MzvBYQlatQAp5	ZfEu92fT8PFPmbxbnVWgyIIQCq1WCui9	Bt7A2JKE4ul2TC-nmqQXlgjAoZKa_QOf	DicDmCY89A1ti85srdcAopiawHfO1ON-	-Y0UgYr4YbCg_ci3ltR-QKzEbRk5PLfE	ljsdVEVJtwAbVJRbY_Cy2pmvd2l1cv3c	aSxm-xVVKOvGDzB6YwQp0l33q55NCPPs	DUS1E0F1FnzYiyEf4l9d7dRCy2WpAIEs	HCTluRDh4BBHfUyqRFL4SzSt5xQEK-f4	rKAwingfI2bjXqXJkmCa7ZZRoxY3cOVG	_AHlot0kkNFwukBZKj_iY06_r6ijpRWq	3ZXFZrqVj]Au2A	> but was:<9[IPNKwUvdLiIAp6ctz12SiQmOGstWyYvSPeevufDhrzaws65voykKjbIj33YWTa9	xA7c_FHypWclrZhQ7onfc3JE93BJ5fT4R9zAEdjbjy1hv4ZYNnET4WJeXMLJ_5p-	qBpTsPpepW8DNVYy1c02_1wyC-kgA6CvRUd9cSr_lt88AEdsTV4GMCn1-EwuAiYd	ivxuzn-cLM8q2jewqlI52tP9J7Cs8vqG71s6-WAELKvm_UovvyaOi-OdMUfjQ0JL	iLkHu6p9OwUgvQqiDKzEv_Augo0dTPZzYGEyCP5GVrle3QQdgciIHnpdd4VUTPGR	UbXeKbh--U3fbJIng_sQXM3IYByMZ7xt9HWS1LUcRdQ7Prwn_IlQWxOMeq-KZJSo	AviWtdserXyHbIEa__hmr4p_j80k0g9q35hq1ayGM9984ALTSaZ8WeyFbZx1CxC_	Qoqf92UH_ylBRnSJNn4sS0oa3uUbNvOnpkB4D9V7Ut9atinCJrw-wiJcMl-9kp25	1IUxBGA4cUxh0eaxk3ODWnwI95EktmWOKwCSP0xjWwIMxDjygwAG5R8fk9H9bVi1	thMavm4nDc4vaNoSE1RnZNYwbiUVlVPM9EclvJWTWd6igWeA0MxHAA8iOM5Vnmqp	_WGM7UDq59rBIdNQCoeTJaAkEtAuLL5zogOa5e-MzVjvB5MYQlOlaaTtQrRApXa5	Z4VfEanu9UK2fi1T8jJPFC2PmXebxp0bnO-VW-bgyEdIIkIQCaZq1MKWC3KuiOS9	BJ1t7O0A2JKJKvoE4UNulzV2TGCC-KAnmjRqQBqXlJmgjHQAoHNZKOma_uIQOsvf	DnqicYdDmfyCYuV89HjA1H8tiDJ85VfsrFHdcbPAoNCpi65awJSHfdPO1NDONOK-	-S7Y0VXUgoYYrBV4Y7YbC8wg_nqcimr3lm3tRyp-QsgKzdREbfNRk0F5PLyLfsUE	lepjs1QdV3fEV1LJtiywA3ubVNQJRxhbYxa_C_Xy2qxpm6vvdL92l3q1ccev35Ic	aOiSx7Im-_GxV2lVKdaOvYVGDD1zBRe6Y2CwQb9p088l3_93qGR5593NCiuPPWcs	DWwUShM1EyW0FNX1F8bnzHnYijoyE_jf4s_l9bBd7yJdRWRCyih2WcypAiOIEkBs	H-dCTgalu8sRDoMh4ZIBBdgHfoZUycLqReQFLZZ4Sl4zSmzt5vQxQFhEKb9-ff_4	rb1KAo6wifengxVfIsa2b5ljXzAqXs7JkPvmC6fa7X4ZZndRokaxYlu3cg8OV-uG	_6YAHZilo8at0OpkkNdNFuhwuGlkBqrZKNUj_gSiYYc06gF_r_z6iWAjpXJRW1qq	3CLZXdZFZ_VrqXeVjtO]Au2A	>
	at org.junit.Assert.assertEquals(Assert.java:115)
	at org.apache.commons.codec.binary.Base64Test.testConstructor_Int_ByteArray_Boolean_UrlSafe(Base64Test.java:264)

testUUID(org.apache.commons.codec.binary.Base64Test)  Time elapsed: 0 sec  <<< FAILURE!
java.lang.AssertionError: standard encode uuid
	at org.junit.Assert.fail(Assert.java:88)
	at org.junit.Assert.assertTrue(Assert.java:41)
	at org.apache.commons.codec.binary.Base64Test.testUUID(Base64Test.java:1180)

testEncodeDecodeSmall(org.apache.commons.codec.binary.Base64Test)  Time elapsed: 0.001 sec  <<< FAILURE!
java.lang.AssertionError: -32,-67,-58 equals -32
	at org.junit.Assert.fail(Assert.java:88)
	at org.junit.Assert.assertTrue(Assert.java:41)
	at org.apache.commons.codec.binary.Base64Test.testEncodeDecodeSmall(Base64Test.java:365)

testObjectDecodeWithValidParameter(org.apache.commons.codec.binary.Base64Test)  Time elapsed: 0 sec  <<< FAILURE!
org.junit.ComparisonFailure: dest string does not equal original expected:<[Hello World!]> but was:<[J��W&�]>
	at org.junit.Assert.assertEquals(Assert.java:115)
	at org.apache.commons.codec.binary.Base64Test.testObjectDecodeWithValidParameter(Base64Test.java:511)

testCodeInteger1(org.apache.commons.codec.binary.Base64Test)  Time elapsed: 0.001 sec  <<< FAILURE!
org.junit.ComparisonFailure: expected:<l[i7dzDacuo67Jg7mtqEm2TR]uOMU=> but was:<l[dzcu7Jmtm2]uOMU=>
	at org.junit.Assert.assertEquals(Assert.java:115)
	at org.junit.Assert.assertEquals(Assert.java:144)
	at org.apache.commons.codec.binary.Base64Test.testCodeInteger1(Base64Test.java:149)

testCodeInteger2(org.apache.commons.codec.binary.Base64Test)  Time elapsed: 0 sec  <<< FAILURE!
org.junit.ComparisonFailure: expected:<9[B5ypLY9pMOmtxCeTDHgwdN]FeGs=> but was:<9[yp9pmteTgw]FeGs=>
	at org.junit.Assert.assertEquals(Assert.java:115)
	at org.junit.Assert.assertEquals(Assert.java:144)
	at org.apache.commons.codec.binary.Base64Test.testCodeInteger2(Base64Test.java:158)

testCodeInteger3(org.apache.commons.codec.binary.Base64Test)  Time elapsed: 0.001 sec  <<< FAILURE!
org.junit.ComparisonFailure: expected:<F[KIhdgaG5LGKiEtF1vHy4f3y700zaD6QwDS3IrNVGzNp2rY+1LFWTK6D44AyiC1n8uWz1itkYMZF0/aKDK0]Yjg==> but was:<F[hdG5KiF1y4y7zaQw3IVGp2+1WTD4yin8z1kYF0KD]Yjg==>
	at org.junit.Assert.assertEquals(Assert.java:115)
	at org.junit.Assert.assertEquals(Assert.java:144)
	at org.apache.commons.codec.binary.Base64Test.testCodeInteger3(Base64Test.java:169)

testCodeInteger4(org.apache.commons.codec.binary.Base64Test)  Time elapsed: 0 sec  <<< FAILURE!
org.junit.ComparisonFailure: expected:<c[tA8YGxrtngg/zKVvqEOefnwmViFztcnPBYPlJsvh6yKI4iDm68fnp4Mi3RrJ6bZAygFrUIQLxLjV+OJtgJAEto0xAs+Mehuq1DkSFEpP3oDzCTOsrOiS1DwQe4oIb7zVk/9l7aPtJMHW0LVlMdwZNFNNJoqMcT2ZfCPrfv]YvQ0=> but was:<c[8Yrtg/VvOewmFznPPlvhKIDmfnMirJZAFrQLjVJtAE0x+MuqkSpPDzOsiSwQoIzV9lPtHWVlwZNNqM2ZPr]YvQ0=>
	at org.junit.Assert.assertEquals(Assert.java:115)
	at org.junit.Assert.assertEquals(Assert.java:144)
	at org.apache.commons.codec.binary.Base64Test.testCodeInteger4(Base64Test.java:186)

testObjectEncode(org.apache.commons.codec.binary.Base64Test)  Time elapsed: 0 sec  <<< FAILURE!
org.junit.ComparisonFailure: expected:<S[GVsbG8gV29]ybGQ=> but was:<S[sbgV]ybGQ=>
	at org.junit.Assert.assertEquals(Assert.java:115)
	at org.junit.Assert.assertEquals(Assert.java:144)
	at org.apache.commons.codec.binary.Base64Test.testObjectEncode(Base64Test.java:542)

testUrlSafe(org.apache.commons.codec.binary.Base64Test)  Time elapsed: 0 sec  <<< FAILURE!
java.lang.AssertionError: url-safe i=3
	at org.junit.Assert.fail(Assert.java:88)
	at org.junit.Assert.assertTrue(Assert.java:41)
	at org.apache.commons.codec.binary.Base64Test.testUrlSafe(Base64Test.java:1085)

testEncodeDecodeRandom(org.apache.commons.codec.binary.Base64Test)  Time elapsed: 0 sec  <<< FAILURE!
java.lang.AssertionError: null
	at org.junit.Assert.fail(Assert.java:86)
	at org.junit.Assert.assertTrue(Assert.java:41)
	at org.junit.Assert.assertTrue(Assert.java:52)
	at org.apache.commons.codec.binary.Base64Test.testEncodeDecodeRandom(Base64Test.java:352)

testDecodeWithWhitespace(org.apache.commons.codec.binary.Base64Test)  Time elapsed: 0.001 sec  <<< FAILURE!
org.junit.ComparisonFailure: Dest string doesn't equal the original expected:<[I am a late night coder.]> but was:<[J�"`nv�bFn]>
	at org.junit.Assert.assertEquals(Assert.java:115)
	at org.apache.commons.codec.binary.Base64Test.testDecodeWithWhitespace(Base64Test.java:324)

testKnownEncodings(org.apache.commons.codec.binary.Base64Test)  Time elapsed: 0 sec  <<< FAILURE!
org.junit.ComparisonFailure: expected:<V[GhlIHF1aWNrIGJyb3duIGZveCBqdW1wZWQgb3ZlciB0aGUgbGF6eSBkb2d]zLg==> but was:<V[lI1arIybuIveqdwZgblc0agb6ekb]zLg==>
	at org.junit.Assert.assertEquals(Assert.java:115)
	at org.junit.Assert.assertEquals(Assert.java:144)
	at org.apache.commons.codec.binary.Base64Test.testKnownEncodings(Base64Test.java:446)

testTripletsChunked(org.apache.commons.codec.binary.Base64Test)  Time elapsed: 0.001 sec  <<< FAILURE!
org.junit.ComparisonFailure: expected:<AA[AA]
> but was:<AA[]
>
	at org.junit.Assert.assertEquals(Assert.java:115)
	at org.junit.Assert.assertEquals(Assert.java:144)
	at org.apache.commons.codec.binary.Base64Test.testTripletsChunked(Base64Test.java:1008)

testRfc4648Section10DecodeEncode(org.apache.commons.codec.binary.Base64Test)  Time elapsed: 0 sec  <<< FAILURE!
org.junit.ComparisonFailure: expected:<Z[m9]v> but was:<Z[]v>
	at org.junit.Assert.assertEquals(Assert.java:115)
	at org.junit.Assert.assertEquals(Assert.java:144)
	at org.apache.commons.codec.binary.Base64Test.testDecodeEncode(Base64Test.java:682)
	at org.apache.commons.codec.binary.Base64Test.testRfc4648Section10DecodeEncode(Base64Test.java:673)

testChunkedEncodeMultipleOf76(org.apache.commons.codec.binary.Base64Test)  Time elapsed: 0.001 sec  <<< FAILURE!
java.lang.AssertionError: chunkedEncodeMultipleOf76
	at org.junit.Assert.fail(Assert.java:88)
	at org.junit.Assert.assertTrue(Assert.java:41)
	at org.apache.commons.codec.binary.Base64Test.testChunkedEncodeMultipleOf76(Base64Test.java:132)

testBase64(org.apache.commons.codec.binary.Base64Test)  Time elapsed: 0.001 sec  <<< FAILURE!
org.junit.ComparisonFailure: encoding hello world expected:<S[GVsbG8gV29]ybGQ=> but was:<S[sbgV]ybGQ=>
	at org.junit.Assert.assertEquals(Assert.java:115)
	at org.apache.commons.codec.binary.Base64Test.testBase64(Base64Test.java:84)

testConstructor_Int_ByteArray_Boolean(org.apache.commons.codec.binary.Base64Test)  Time elapsed: 0.002 sec  <<< FAILURE!
org.junit.ComparisonFailure: new Base64(65, \t, false) expected:<9[IPNKwUvdLiIAp6ctz12SiQmOGstWyYvSPeevufDhrzaws65voykKjbIj33YWTa9	xA7c/FHypWclrZhQ7onfc3JE93BJ5fT4R9zAEdjbjy1hv4ZYNnET4WJeXMLJ/5p+	qBpTsPpepW8DNVYy1c02/1wyC+kgA6CvRUd9cSr/lt88AEdsTV4GMCn1+EwuAiYd	ivxuzn+cLM8q2jewqlI52tP9J7Cs8vqG71s6+WAELKvm/UovvyaOi+OdMUfjQ0JL	iLkHu6p9OwUgvQqiDKzEv/Augo0dTPZzYGEyCP5GVrle3QQdgciIHnpdd4VUTPGR	UbXeKbh++U3fbJIng/sQXM3IYByMZ7xt9HWS1LUcRdQ7Prwn/IlQWxOMeq+KZJSo	AviWtdserXyHbIEa//hmr4p/j80k0g9q35hq1ayGM9984ALTSaZ8WeyFbZx1CxC/	Qoqf92UH/ylBRnSJNn4sS0oa3uUbNvOnpkB4D9V7Ut9atinCJrw+wiJcMl+9kp25	1IUxBGA4cUxh0eaxk3ODWnwI95EktmWOKwCSP0xjWwIMxDjygwAG5R8fk9H9bVi1	thMavm4nDc4vaNoSE1RnZNYwbiUVlVPM9EclvJWTWd6igWeA0MxHAA8iOM5Vnmqp	/WGM7UDq59rBIdNQCoeTJaAkEtAuLL5zogOa5e+MzVjvB5MYQlOlaaTtQrRApXa5	Z4VfEanu9UK2fi1T8jJPFC2PmXebxp0bnO+VW+bgyEdIIkIQCaZq1MKWC3KuiOS9	BJ1t7O0A2JKJKvoE4UNulzV2TGCC+KAnmjRqQBqXlJmgjHQAoHNZKOma/uIQOsvf	DnqicYdDmfyCYuV89HjA1H8tiDJ85VfsrFHdcbPAoNCpi65awJSHfdPO1NDONOK+	+S7Y0VXUgoYYrBV4Y7YbC8wg/nqcimr3lm3tRyp+QsgKzdREbfNRk0F5PLyLfsUE	lepjs1QdV3fEV1LJtiywA3ubVNQJRxhbYxa/C/Xy2qxpm6vvdL92l3q1ccev35Ic	aOiSx7Im+/GxV2lVKdaOvYVGDD1zBRe6Y2CwQb9p088l3/93qGR5593NCiuPPWcs	DWwUShM1EyW0FNX1F8bnzHnYijoyE/jf4s/l9bBd7yJdRWRCyih2WcypAiOIEkBs	H+dCTgalu8sRDoMh4ZIBBdgHfoZUycLqReQFLZZ4Sl4zSmzt5vQxQFhEKb9+ff/4	rb1KAo6wifengxVfIsa2b5ljXzAqXs7JkPvmC6fa7X4ZZndRokaxYlu3cg8OV+uG	/6YAHZilo8at0OpkkNdNFuhwuGlkBqrZKNUj/gSiYYc06gF/r/z6iWAjpXJRW1qq	3CLZXdZFZ/VrqXeVjtO]Au2A=	> but was:<9[NKvdIAct2SmOtWvSevDhaw5vkKIjYW9	xc/yplrQ7fcE9J54RAEbjhvYNT4eXJ/+	qTsepDNy12/yCgAvR9c/l8AsTGM1+uAd	iuzcLq2wq529Js8G76+ELm/vvOidMjQL	iHu9OgviDEvugdTzYyCGVe3dgIHddUTR	UeK++fbngQXIYMZt9S1cR7Pn/QWMeKZo	AWterHba/mr/jk0q3q1GM84TS8WFb1C/	Qf9H/BRJNsSa3bNnp4D7UatCJ+wcM9k5	1xB4ch0xkDWI9ktOKSPjWMxygG5fk9b1	tavnDvaSEnZwbVlM9lvTWigA0HAiOVnp	/M7q5BIQCTJkEuLzoa5MzvBYQlatQAp5	ZfEu92fT8PFPmbxbnVWgyIIQCq1WCui9	Bt7A2JKE4ul2TC+nmqQXlgjAoZKa/QOf	DicDmCY89A1ti85srdcAopiawHfO1ON+	+Y0UgYr4YbCg/ci3ltR+QKzEbRk5PLfE	ljsdVEVJtwAbVJRbY/Cy2pmvd2l1cv3c	aSxm+xVVKOvGDzB6YwQp0l33q55NCPPs	DUS1E0F1FnzYiyEf4l9d7dRCy2WpAIEs	HCTluRDh4BBHfUyqRFL4SzSt5xQEK+f4	rKAwingfI2bjXqXJkmCa7ZZRoxY3cOVG	/AHlot0kkNFwukBZKj/iY06/r6ijpRWq	3ZXFZrqVj]Au2A=	>
	at org.junit.Assert.assertEquals(Assert.java:115)
	at org.apache.commons.codec.binary.Base64Test.testConstructor_Int_ByteArray_Boolean(Base64Test.java:250)

testByteToStringVariations(org.apache.commons.codec.binary.Base64Test)  Time elapsed: 0 sec  <<< FAILURE!
org.junit.ComparisonFailure: byteToString Hello World expected:<S[GVsbG8gV29]ybGQ=> but was:<S[sbgV]ybGQ=>
	at org.junit.Assert.assertEquals(Assert.java:115)
	at org.apache.commons.codec.binary.Base64Test.testByteToStringVariations(Base64Test.java:1197)

testObjectEncodeWithValidParameter(org.apache.commons.codec.binary.Base64Test)  Time elapsed: 0 sec  <<< FAILURE!
org.junit.ComparisonFailure: dest string does not equal original expected:<[Hello World!]> but was:<[J��W&�]>
	at org.junit.Assert.assertEquals(Assert.java:115)
	at org.apache.commons.codec.binary.Base64Test.testObjectEncodeWithValidParameter(Base64Test.java:536)

testRfc4648Section10Encode(org.apache.commons.codec.binary.Base64Test)  Time elapsed: 0.001 sec  <<< FAILURE!
org.junit.ComparisonFailure: expected:<Z[m9]v> but was:<Z[]v>
	at org.junit.Assert.assertEquals(Assert.java:115)
	at org.junit.Assert.assertEquals(Assert.java:144)
	at org.apache.commons.codec.binary.Base64Test.testRfc4648Section10Encode(Base64Test.java:648)

testRfc4648Section10EncodeDecode(org.apache.commons.codec.binary.Base64Test)  Time elapsed: 0.001 sec  <<< FAILURE!
org.junit.ComparisonFailure: expected:<f[oo]> but was:<f[]>
	at org.junit.Assert.assertEquals(Assert.java:115)
	at org.junit.Assert.assertEquals(Assert.java:144)
	at org.apache.commons.codec.binary.Base64Test.testEncodeDecode(Base64Test.java:713)
	at org.apache.commons.codec.binary.Base64Test.testRfc4648Section10EncodeDecode(Base64Test.java:704)

Running org.apache.commons.codec.binary.HexTest
Tests run: 19, Failures: 0, Errors: 0, Skipped: 0, Time elapsed: 0.181 sec - in org.apache.commons.codec.binary.HexTest
Running org.apache.commons.codec.DecoderExceptionTest
Tests run: 4, Failures: 0, Errors: 0, Skipped: 0, Time elapsed: 0.001 sec - in org.apache.commons.codec.DecoderExceptionTest
Running org.apache.commons.codec.EncoderExceptionTest
Tests run: 4, Failures: 0, Errors: 0, Skipped: 0, Time elapsed: 0 sec - in org.apache.commons.codec.EncoderExceptionTest
Running org.apache.commons.codec.net.BCodecTest
Tests run: 9, Failures: 3, Errors: 0, Skipped: 0, Time elapsed: 0.005 sec <<< FAILURE! - in org.apache.commons.codec.net.BCodecTest
testUTF8RoundTrip(org.apache.commons.codec.net.BCodecTest)  Time elapsed: 0.002 sec  <<< FAILURE!
org.junit.ComparisonFailure: expected:<=?UTF-8?B?0[JLRgdC10Lxf0L/RgNC40LLQtdG]C?=> but was:<=?UTF-8?B?0[Rg10f0Rg40Qt]C?=>
	at org.junit.Assert.assertEquals(Assert.java:115)
	at org.junit.Assert.assertEquals(Assert.java:144)
	at org.apache.commons.codec.net.BCodecTest.testUTF8RoundTrip(BCodecTest.java:69)

testBasicEncodeDecode(org.apache.commons.codec.net.BCodecTest)  Time elapsed: 0 sec  <<< FAILURE!
org.junit.ComparisonFailure: Basic B encoding test expected:<=?UTF-8?B?S[GVsbG8gdGh]lcmU=?=> but was:<=?UTF-8?B?S[sbgd]lcmU=?=>
	at org.junit.Assert.assertEquals(Assert.java:115)
	at org.apache.commons.codec.net.BCodecTest.testBasicEncodeDecode(BCodecTest.java:81)

testEncodeObjects(org.apache.commons.codec.net.BCodecTest)  Time elapsed: 0 sec  <<< FAILURE!
org.junit.ComparisonFailure: Basic B encoding test expected:<=?UTF-8?B?d[2hhdCB]ub3Q=?=> but was:<=?UTF-8?B?d[hd]ub3Q=?=>
	at org.junit.Assert.assertEquals(Assert.java:115)
	at org.apache.commons.codec.net.BCodecTest.testEncodeObjects(BCodecTest.java:114)

Running org.apache.commons.codec.net.QCodecTest
Tests run: 12, Failures: 0, Errors: 0, Skipped: 0, Time elapsed: 0.005 sec - in org.apache.commons.codec.net.QCodecTest
Running org.apache.commons.codec.net.UtilsTest
Tests run: 1, Failures: 0, Errors: 0, Skipped: 0, Time elapsed: 0 sec - in org.apache.commons.codec.net.UtilsTest
Running org.apache.commons.codec.net.RFC1522CodecTest
Tests run: 2, Failures: 0, Errors: 0, Skipped: 0, Time elapsed: 0.002 sec - in org.apache.commons.codec.net.RFC1522CodecTest
Running org.apache.commons.codec.net.URLCodecTest
Tests run: 16, Failures: 0, Errors: 0, Skipped: 0, Time elapsed: 0.005 sec - in org.apache.commons.codec.net.URLCodecTest
Running org.apache.commons.codec.net.QuotedPrintableCodecTest
Tests run: 21, Failures: 0, Errors: 0, Skipped: 0, Time elapsed: 0.016 sec - in org.apache.commons.codec.net.QuotedPrintableCodecTest
Running org.apache.commons.codec.StringEncoderComparatorTest
Tests run: 3, Failures: 0, Errors: 0, Skipped: 0, Time elapsed: 0 sec - in org.apache.commons.codec.StringEncoderComparatorTest
Running org.apache.commons.codec.language.Caverphone1Test
Tests run: 9, Failures: 0, Errors: 0, Skipped: 0, Time elapsed: 0.024 sec - in org.apache.commons.codec.language.Caverphone1Test
Running org.apache.commons.codec.language.NysiisTest
Tests run: 23, Failures: 0, Errors: 0, Skipped: 0, Time elapsed: 0.021 sec - in org.apache.commons.codec.language.NysiisTest
Running org.apache.commons.codec.language.Caverphone2Test
Tests run: 13, Failures: 0, Errors: 0, Skipped: 0, Time elapsed: 0.132 sec - in org.apache.commons.codec.language.Caverphone2Test
Running org.apache.commons.codec.language.DaitchMokotoffSoundexTest
Tests run: 13, Failures: 0, Errors: 0, Skipped: 0, Time elapsed: 0.05 sec - in org.apache.commons.codec.language.DaitchMokotoffSoundexTest
Running org.apache.commons.codec.language.bm.BeiderMorseEncoderTest
Tests run: 22, Failures: 0, Errors: 0, Skipped: 0, Time elapsed: 2.99 sec - in org.apache.commons.codec.language.bm.BeiderMorseEncoderTest
Running org.apache.commons.codec.language.bm.PhoneticEngineTest
Tests run: 8, Failures: 0, Errors: 0, Skipped: 0, Time elapsed: 0.014 sec - in org.apache.commons.codec.language.bm.PhoneticEngineTest
Running org.apache.commons.codec.language.bm.PhoneticEngineRegressionTest
Tests run: 4, Failures: 0, Errors: 0, Skipped: 0, Time elapsed: 0.013 sec - in org.apache.commons.codec.language.bm.PhoneticEngineRegressionTest
Running org.apache.commons.codec.language.bm.RuleTest
Tests run: 3, Failures: 0, Errors: 0, Skipped: 0, Time elapsed: 0.002 sec - in org.apache.commons.codec.language.bm.RuleTest
Running org.apache.commons.codec.language.bm.LanguageGuessingTest
Tests run: 18, Failures: 0, Errors: 0, Skipped: 0, Time elapsed: 0.009 sec - in org.apache.commons.codec.language.bm.LanguageGuessingTest
Running org.apache.commons.codec.language.DoubleMetaphoneTest
Tests run: 16, Failures: 0, Errors: 0, Skipped: 0, Time elapsed: 0.045 sec - in org.apache.commons.codec.language.DoubleMetaphoneTest
Running org.apache.commons.codec.language.SoundexTest
Tests run: 28, Failures: 0, Errors: 0, Skipped: 0, Time elapsed: 0.009 sec - in org.apache.commons.codec.language.SoundexTest
Running org.apache.commons.codec.language.RefinedSoundexTest
Tests run: 10, Failures: 0, Errors: 0, Skipped: 0, Time elapsed: 0.002 sec - in org.apache.commons.codec.language.RefinedSoundexTest
Running org.apache.commons.codec.language.MatchRatingApproachEncoderTest
Tests run: 96, Failures: 0, Errors: 0, Skipped: 0, Time elapsed: 0.032 sec - in org.apache.commons.codec.language.MatchRatingApproachEncoderTest
Running org.apache.commons.codec.language.ColognePhoneticTest
Tests run: 13, Failures: 0, Errors: 0, Skipped: 0, Time elapsed: 0.003 sec - in org.apache.commons.codec.language.ColognePhoneticTest
Running org.apache.commons.codec.language.DoubleMetaphone2Test
Tests run: 6, Failures: 0, Errors: 0, Skipped: 0, Time elapsed: 0.025 sec - in org.apache.commons.codec.language.DoubleMetaphone2Test
Running org.apache.commons.codec.language.MetaphoneTest
Tests run: 34, Failures: 0, Errors: 0, Skipped: 0, Time elapsed: 0.089 sec - in org.apache.commons.codec.language.MetaphoneTest
Running org.apache.commons.codec.CharEncodingTest
Tests run: 7, Failures: 0, Errors: 0, Skipped: 0, Time elapsed: 0.001 sec - in org.apache.commons.codec.CharEncodingTest

Results :

Failed tests: 
  Base64OutputStreamTest.testBase64OutputStreamByteByByte:144->testByteByByte:249 Streaming byte-by-byte base64 encode
  Base64OutputStreamTest.testBase64OutputStreamByChunk:106->testByChunk:197 Streaming chunked base64 encode
  Base64Codec13Test.testEncoder:372 Encoder test-3
  Base64Codec13Test.testBinaryEncoder:410 BinaryEncoder test-3
  Base64Codec13Test.testStaticEncodeChunked:483 static Base64.encodeBase64Chunked() test-3
  Base64Codec13Test.testStaticEncode:447 static Base64.encodeBase64() test-3
  Base64InputStreamTest.testBase64InputStreamByChunk:216->testByChunk:308 Streaming base64 encode
  Base64InputStreamTest.testCodec130:73 expected:<[ello World]> but was:<[��W&�]>
  Base64InputStreamTest.testBase64InputStreamByteByByte:254->testByteByByte:364 Streaming base64 encode
  Base64Test.testTriplets:940 expected:<AA[AA]> but was:<AA[]>
  Base64Test.testConstructor_Int_ByteArray_Boolean_UrlSafe:264 new Base64(64, \t, true) expected:<9[NKvdIAct2SmOtWvSevDhaw5vkKIjYW9	xc_yplrQ7fcE9J54RAEbjhvYNT4eXJ_-	qTsepDNy12_yCgAvR9c_l8AsTGM1-uAd	iuzcLq2wq529Js8G76-ELm_vvOidMjQL	iHu9OgviDEvugdTzYyCGVe3dgIHddUTR	UeK--fbngQXIYMZt9S1cR7Pn_QWMeKZo	AWterHba_mr_jk0q3q1GM84TS8WFb1C_	Qf9H_BRJNsSa3bNnp4D7UatCJ-wcM9k5	1xB4ch0xkDWI9ktOKSPjWMxygG5fk9b1	tavnDvaSEnZwbVlM9lvTWigA0HAiOVnp	_M7q5BIQCTJkEuLzoa5MzvBYQlatQAp5	ZfEu92fT8PFPmbxbnVWgyIIQCq1WCui9	Bt7A2JKE4ul2TC-nmqQXlgjAoZKa_QOf	DicDmCY89A1ti85srdcAopiawHfO1ON-	-Y0UgYr4YbCg_ci3ltR-QKzEbRk5PLfE	ljsdVEVJtwAbVJRbY_Cy2pmvd2l1cv3c	aSxm-xVVKOvGDzB6YwQp0l33q55NCPPs	DUS1E0F1FnzYiyEf4l9d7dRCy2WpAIEs	HCTluRDh4BBHfUyqRFL4SzSt5xQEK-f4	rKAwingfI2bjXqXJkmCa7ZZRoxY3cOVG	_AHlot0kkNFwukBZKj_iY06_r6ijpRWq	3ZXFZrqVj]Au2A	> but was:<9[IPNKwUvdLiIAp6ctz12SiQmOGstWyYvSPeevufDhrzaws65voykKjbIj33YWTa9	xA7c_FHypWclrZhQ7onfc3JE93BJ5fT4R9zAEdjbjy1hv4ZYNnET4WJeXMLJ_5p-	qBpTsPpepW8DNVYy1c02_1wyC-kgA6CvRUd9cSr_lt88AEdsTV4GMCn1-EwuAiYd	ivxuzn-cLM8q2jewqlI52tP9J7Cs8vqG71s6-WAELKvm_UovvyaOi-OdMUfjQ0JL	iLkHu6p9OwUgvQqiDKzEv_Augo0dTPZzYGEyCP5GVrle3QQdgciIHnpdd4VUTPGR	UbXeKbh--U3fbJIng_sQXM3IYByMZ7xt9HWS1LUcRdQ7Prwn_IlQWxOMeq-KZJSo	AviWtdserXyHbIEa__hmr4p_j80k0g9q35hq1ayGM9984ALTSaZ8WeyFbZx1CxC_	Qoqf92UH_ylBRnSJNn4sS0oa3uUbNvOnpkB4D9V7Ut9atinCJrw-wiJcMl-9kp25	1IUxBGA4cUxh0eaxk3ODWnwI95EktmWOKwCSP0xjWwIMxDjygwAG5R8fk9H9bVi1	thMavm4nDc4vaNoSE1RnZNYwbiUVlVPM9EclvJWTWd6igWeA0MxHAA8iOM5Vnmqp	_WGM7UDq59rBIdNQCoeTJaAkEtAuLL5zogOa5e-MzVjvB5MYQlOlaaTtQrRApXa5	Z4VfEanu9UK2fi1T8jJPFC2PmXebxp0bnO-VW-bgyEdIIkIQCaZq1MKWC3KuiOS9	BJ1t7O0A2JKJKvoE4UNulzV2TGCC-KAnmjRqQBqXlJmgjHQAoHNZKOma_uIQOsvf	DnqicYdDmfyCYuV89HjA1H8tiDJ85VfsrFHdcbPAoNCpi65awJSHfdPO1NDONOK-	-S7Y0VXUgoYYrBV4Y7YbC8wg_nqcimr3lm3tRyp-QsgKzdREbfNRk0F5PLyLfsUE	lepjs1QdV3fEV1LJtiywA3ubVNQJRxhbYxa_C_Xy2qxpm6vvdL92l3q1ccev35Ic	aOiSx7Im-_GxV2lVKdaOvYVGDD1zBRe6Y2CwQb9p088l3_93qGR5593NCiuPPWcs	DWwUShM1EyW0FNX1F8bnzHnYijoyE_jf4s_l9bBd7yJdRWRCyih2WcypAiOIEkBs	H-dCTgalu8sRDoMh4ZIBBdgHfoZUycLqReQFLZZ4Sl4zSmzt5vQxQFhEKb9-ff_4	rb1KAo6wifengxVfIsa2b5ljXzAqXs7JkPvmC6fa7X4ZZndRokaxYlu3cg8OV-uG	_6YAHZilo8at0OpkkNdNFuhwuGlkBqrZKNUj_gSiYYc06gF_r_z6iWAjpXJRW1qq	3CLZXdZFZ_VrqXeVjtO]Au2A	>
  Base64Test.testUUID:1180 standard encode uuid
  Base64Test.testEncodeDecodeSmall:365 -32,-67,-58 equals -32
  Base64Test.testObjectDecodeWithValidParameter:511 dest string does not equal original expected:<[Hello World!]> but was:<[J��W&�]>
  Base64Test.testCodeInteger1:149 expected:<l[i7dzDacuo67Jg7mtqEm2TR]uOMU=> but was:<l[dzcu7Jmtm2]uOMU=>
  Base64Test.testCodeInteger2:158 expected:<9[B5ypLY9pMOmtxCeTDHgwdN]FeGs=> but was:<9[yp9pmteTgw]FeGs=>
  Base64Test.testCodeInteger3:169 expected:<F[KIhdgaG5LGKiEtF1vHy4f3y700zaD6QwDS3IrNVGzNp2rY+1LFWTK6D44AyiC1n8uWz1itkYMZF0/aKDK0]Yjg==> but was:<F[hdG5KiF1y4y7zaQw3IVGp2+1WTD4yin8z1kYF0KD]Yjg==>
  Base64Test.testCodeInteger4:186 expected:<c[tA8YGxrtngg/zKVvqEOefnwmViFztcnPBYPlJsvh6yKI4iDm68fnp4Mi3RrJ6bZAygFrUIQLxLjV+OJtgJAEto0xAs+Mehuq1DkSFEpP3oDzCTOsrOiS1DwQe4oIb7zVk/9l7aPtJMHW0LVlMdwZNFNNJoqMcT2ZfCPrfv]YvQ0=> but was:<c[8Yrtg/VvOewmFznPPlvhKIDmfnMirJZAFrQLjVJtAE0x+MuqkSpPDzOsiSwQoIzV9lPtHWVlwZNNqM2ZPr]YvQ0=>
  Base64Test.testObjectEncode:542 expected:<S[GVsbG8gV29]ybGQ=> but was:<S[sbgV]ybGQ=>
  Base64Test.testUrlSafe:1085 url-safe i=3
  Base64Test.testEncodeDecodeRandom:352 null
  Base64Test.testDecodeWithWhitespace:324 Dest string doesn't equal the original expected:<[I am a late night coder.]> but was:<[J�"`nv�bFn]>
  Base64Test.testKnownEncodings:446 expected:<V[GhlIHF1aWNrIGJyb3duIGZveCBqdW1wZWQgb3ZlciB0aGUgbGF6eSBkb2d]zLg==> but was:<V[lI1arIybuIveqdwZgblc0agb6ekb]zLg==>
  Base64Test.testTripletsChunked:1008 expected:<AA[AA]
> but was:<AA[]
>
  Base64Test.testRfc4648Section10DecodeEncode:673->testDecodeEncode:682 expected:<Z[m9]v> but was:<Z[]v>
  Base64Test.testChunkedEncodeMultipleOf76:132 chunkedEncodeMultipleOf76
  Base64Test.testBase64:84 encoding hello world expected:<S[GVsbG8gV29]ybGQ=> but was:<S[sbgV]ybGQ=>
  Base64Test.testConstructor_Int_ByteArray_Boolean:250 new Base64(65, \t, false) expected:<9[IPNKwUvdLiIAp6ctz12SiQmOGstWyYvSPeevufDhrzaws65voykKjbIj33YWTa9	xA7c/FHypWclrZhQ7onfc3JE93BJ5fT4R9zAEdjbjy1hv4ZYNnET4WJeXMLJ/5p+	qBpTsPpepW8DNVYy1c02/1wyC+kgA6CvRUd9cSr/lt88AEdsTV4GMCn1+EwuAiYd	ivxuzn+cLM8q2jewqlI52tP9J7Cs8vqG71s6+WAELKvm/UovvyaOi+OdMUfjQ0JL	iLkHu6p9OwUgvQqiDKzEv/Augo0dTPZzYGEyCP5GVrle3QQdgciIHnpdd4VUTPGR	UbXeKbh++U3fbJIng/sQXM3IYByMZ7xt9HWS1LUcRdQ7Prwn/IlQWxOMeq+KZJSo	AviWtdserXyHbIEa//hmr4p/j80k0g9q35hq1ayGM9984ALTSaZ8WeyFbZx1CxC/	Qoqf92UH/ylBRnSJNn4sS0oa3uUbNvOnpkB4D9V7Ut9atinCJrw+wiJcMl+9kp25	1IUxBGA4cUxh0eaxk3ODWnwI95EktmWOKwCSP0xjWwIMxDjygwAG5R8fk9H9bVi1	thMavm4nDc4vaNoSE1RnZNYwbiUVlVPM9EclvJWTWd6igWeA0MxHAA8iOM5Vnmqp	/WGM7UDq59rBIdNQCoeTJaAkEtAuLL5zogOa5e+MzVjvB5MYQlOlaaTtQrRApXa5	Z4VfEanu9UK2fi1T8jJPFC2PmXebxp0bnO+VW+bgyEdIIkIQCaZq1MKWC3KuiOS9	BJ1t7O0A2JKJKvoE4UNulzV2TGCC+KAnmjRqQBqXlJmgjHQAoHNZKOma/uIQOsvf	DnqicYdDmfyCYuV89HjA1H8tiDJ85VfsrFHdcbPAoNCpi65awJSHfdPO1NDONOK+	+S7Y0VXUgoYYrBV4Y7YbC8wg/nqcimr3lm3tRyp+QsgKzdREbfNRk0F5PLyLfsUE	lepjs1QdV3fEV1LJtiywA3ubVNQJRxhbYxa/C/Xy2qxpm6vvdL92l3q1ccev35Ic	aOiSx7Im+/GxV2lVKdaOvYVGDD1zBRe6Y2CwQb9p088l3/93qGR5593NCiuPPWcs	DWwUShM1EyW0FNX1F8bnzHnYijoyE/jf4s/l9bBd7yJdRWRCyih2WcypAiOIEkBs	H+dCTgalu8sRDoMh4ZIBBdgHfoZUycLqReQFLZZ4Sl4zSmzt5vQxQFhEKb9+ff/4	rb1KAo6wifengxVfIsa2b5ljXzAqXs7JkPvmC6fa7X4ZZndRokaxYlu3cg8OV+uG	/6YAHZilo8at0OpkkNdNFuhwuGlkBqrZKNUj/gSiYYc06gF/r/z6iWAjpXJRW1qq	3CLZXdZFZ/VrqXeVjtO]Au2A=	> but was:<9[NKvdIAct2SmOtWvSevDhaw5vkKIjYW9	xc/yplrQ7fcE9J54RAEbjhvYNT4eXJ/+	qTsepDNy12/yCgAvR9c/l8AsTGM1+uAd	iuzcLq2wq529Js8G76+ELm/vvOidMjQL	iHu9OgviDEvugdTzYyCGVe3dgIHddUTR	UeK++fbngQXIYMZt9S1cR7Pn/QWMeKZo	AWterHba/mr/jk0q3q1GM84TS8WFb1C/	Qf9H/BRJNsSa3bNnp4D7UatCJ+wcM9k5	1xB4ch0xkDWI9ktOKSPjWMxygG5fk9b1	tavnDvaSEnZwbVlM9lvTWigA0HAiOVnp	/M7q5BIQCTJkEuLzoa5MzvBYQlatQAp5	ZfEu92fT8PFPmbxbnVWgyIIQCq1WCui9	Bt7A2JKE4ul2TC+nmqQXlgjAoZKa/QOf	DicDmCY89A1ti85srdcAopiawHfO1ON+	+Y0UgYr4YbCg/ci3ltR+QKzEbRk5PLfE	ljsdVEVJtwAbVJRbY/Cy2pmvd2l1cv3c	aSxm+xVVKOvGDzB6YwQp0l33q55NCPPs	DUS1E0F1FnzYiyEf4l9d7dRCy2WpAIEs	HCTluRDh4BBHfUyqRFL4SzSt5xQEK+f4	rKAwingfI2bjXqXJkmCa7ZZRoxY3cOVG	/AHlot0kkNFwukBZKj/iY06/r6ijpRWq	3ZXFZrqVj]Au2A=	>
  Base64Test.testByteToStringVariations:1197 byteToString Hello World expected:<S[GVsbG8gV29]ybGQ=> but was:<S[sbgV]ybGQ=>
  Base64Test.testObjectEncodeWithValidParameter:536 dest string does not equal original expected:<[Hello World!]> but was:<[J��W&�]>
  Base64Test.testRfc4648Section10Encode:648 expected:<Z[m9]v> but was:<Z[]v>
  Base64Test.testRfc4648Section10EncodeDecode:704->testEncodeDecode:713 expected:<f[oo]> but was:<f[]>
  BCodecTest.testUTF8RoundTrip:69 expected:<=?UTF-8?B?0[JLRgdC10Lxf0L/RgNC40LLQtdG]C?=> but was:<=?UTF-8?B?0[Rg10f0Rg40Qt]C?=>
  BCodecTest.testBasicEncodeDecode:81 Basic B encoding test expected:<=?UTF-8?B?S[GVsbG8gdGh]lcmU=?=> but was:<=?UTF-8?B?S[sbgd]lcmU=?=>
  BCodecTest.testEncodeObjects:114 Basic B encoding test expected:<=?UTF-8?B?d[2hhdCB]ub3Q=?=> but was:<=?UTF-8?B?d[hd]ub3Q=?=>

Tests run: 662, Failures: 35, Errors: 0, Skipped: 1

[INFO] ------------------------------------------------------------------------
[INFO] BUILD FAILURE
[INFO] ------------------------------------------------------------------------
[INFO] Total time: 14.638s
[INFO] Finished at: Sun Aug 02 06:27:37 BST 2015
[INFO] Final Memory: 20M/287M
[INFO] ------------------------------------------------------------------------
[ERROR] Failed to execute goal org.apache.maven.plugins:maven-surefire-plugin:2.17:test (default-test) on project commons-codec: There are test failures.
[ERROR] 
[ERROR] Please refer to /home/perham/Study/LittleDarwin/Cases/commons-codec-1.10-src/target/surefire-reports for the individual test results.
[ERROR] -> [Help 1]
[ERROR] 
[ERROR] To see the full stack trace of the errors, re-run Maven with the -e switch.
[ERROR] Re-run Maven using the -X switch to enable full debug logging.
[ERROR] 
[ERROR] For more information about the errors and possible solutions, please read the following articles:
[ERROR] [Help 1] http://cwiki.apache.org/confluence/display/MAVEN/MojoFailureException
