[INFO] Scanning for projects...
[INFO]                                                                         
[INFO] ------------------------------------------------------------------------
[INFO] Building Apache Commons Codec 1.10
[INFO] ------------------------------------------------------------------------
[INFO] 
[INFO] --- maven-enforcer-plugin:1.3.1:enforce (enforce-maven-3) @ commons-codec ---
[INFO] 
[INFO] --- maven-antrun-plugin:1.7:run (javadoc.resources) @ commons-codec ---
[INFO] Executing tasks

main:
[INFO] Executed tasks
[INFO] 
[INFO] --- maven-remote-resources-plugin:1.5:process (default) @ commons-codec ---
[INFO] 
[INFO] --- buildnumber-maven-plugin:1.3:create (default) @ commons-codec ---
[INFO] Executing: /bin/sh -c cd /home/perham/Study/LittleDarwin/Cases/commons-codec-1.10-src && svn --non-interactive info
[INFO] Working directory: /home/perham/Study/LittleDarwin/Cases/commons-codec-1.10-src
[INFO] Storing buildNumber: ?????? at timestamp: 1438495848776
[INFO] Executing: /bin/sh -c cd /home/perham/Study/LittleDarwin/Cases/commons-codec-1.10-src && svn --non-interactive info
[INFO] Working directory: /home/perham/Study/LittleDarwin/Cases/commons-codec-1.10-src
[INFO] Storing buildScmBranch: UNKNOWN_BRANCH
[INFO] 
[INFO] --- maven-resources-plugin:2.7:resources (default-resources) @ commons-codec ---
[INFO] Using 'UTF-8' encoding to copy filtered resources.
[INFO] Copying 128 resources
[INFO] Copying 2 resources to META-INF
[INFO] 
[INFO] --- maven-compiler-plugin:3.2:compile (default-compile) @ commons-codec ---
[INFO] Changes detected - recompiling the module!
[INFO] Compiling 60 source files to /home/perham/Study/LittleDarwin/Cases/commons-codec-1.10-src/target/classes
[INFO] /home/perham/Study/LittleDarwin/Cases/commons-codec-1.10-src/src/main/java/org/apache/commons/codec/digest/Sha2Crypt.java: Some input files use or override a deprecated API.
[INFO] /home/perham/Study/LittleDarwin/Cases/commons-codec-1.10-src/src/main/java/org/apache/commons/codec/digest/Sha2Crypt.java: Recompile with -Xlint:deprecation for details.
[INFO] 
[INFO] --- maven-bundle-plugin:2.5.3:manifest (bundle-manifest) @ commons-codec ---
[INFO] 
[INFO] --- maven-resources-plugin:2.7:testResources (default-testResources) @ commons-codec ---
[INFO] Using 'UTF-8' encoding to copy filtered resources.
[INFO] skip non existing resourceDirectory /home/perham/Study/LittleDarwin/Cases/commons-codec-1.10-src/src/test/resources
[INFO] Copying 2 resources to META-INF
[INFO] 
[INFO] --- maven-compiler-plugin:3.2:testCompile (default-testCompile) @ commons-codec ---
[INFO] Nothing to compile - all classes are up to date
[INFO] 
[INFO] --- maven-surefire-plugin:2.17:test (default-test) @ commons-codec ---
[INFO] Surefire report directory: /home/perham/Study/LittleDarwin/Cases/commons-codec-1.10-src/target/surefire-reports

-------------------------------------------------------
 T E S T S
-------------------------------------------------------
Running org.apache.commons.codec.digest.B64Test
Tests run: 2, Failures: 0, Errors: 0, Skipped: 0, Time elapsed: 0.026 sec - in org.apache.commons.codec.digest.B64Test
Running org.apache.commons.codec.digest.DigestUtilsTest
Tests run: 17, Failures: 0, Errors: 0, Skipped: 0, Time elapsed: 0.639 sec - in org.apache.commons.codec.digest.DigestUtilsTest
Running org.apache.commons.codec.digest.Sha512CryptTest
Tests run: 8, Failures: 0, Errors: 0, Skipped: 0, Time elapsed: 0.488 sec - in org.apache.commons.codec.digest.Sha512CryptTest
Running org.apache.commons.codec.digest.Apr1CryptTest
Tests run: 8, Failures: 0, Errors: 0, Skipped: 0, Time elapsed: 0.074 sec - in org.apache.commons.codec.digest.Apr1CryptTest
Running org.apache.commons.codec.digest.HmacUtilsTest
Tests run: 24, Failures: 0, Errors: 0, Skipped: 0, Time elapsed: 0.054 sec - in org.apache.commons.codec.digest.HmacUtilsTest
Running org.apache.commons.codec.digest.Sha2CryptTest
Tests run: 1, Failures: 0, Errors: 0, Skipped: 0, Time elapsed: 0 sec - in org.apache.commons.codec.digest.Sha2CryptTest
Running org.apache.commons.codec.digest.CryptTest
Tests run: 4, Failures: 0, Errors: 0, Skipped: 0, Time elapsed: 0.057 sec - in org.apache.commons.codec.digest.CryptTest
Running org.apache.commons.codec.digest.Sha256CryptTest
Tests run: 7, Failures: 0, Errors: 0, Skipped: 0, Time elapsed: 0.133 sec - in org.apache.commons.codec.digest.Sha256CryptTest
Running org.apache.commons.codec.digest.Md5CryptTest
Tests run: 7, Failures: 0, Errors: 0, Skipped: 0, Time elapsed: 0.025 sec - in org.apache.commons.codec.digest.Md5CryptTest
Running org.apache.commons.codec.digest.UnixCryptTest
Tests run: 9, Failures: 0, Errors: 0, Skipped: 0, Time elapsed: 0.006 sec - in org.apache.commons.codec.digest.UnixCryptTest
Running org.apache.commons.codec.CharsetsTest
Tests run: 7, Failures: 0, Errors: 0, Skipped: 0, Time elapsed: 0.001 sec - in org.apache.commons.codec.CharsetsTest
Running org.apache.commons.codec.binary.Base32Test
Tests run: 8, Failures: 0, Errors: 0, Skipped: 0, Time elapsed: 0.004 sec - in org.apache.commons.codec.binary.Base32Test
Running org.apache.commons.codec.binary.Base64OutputStreamTest
Tests run: 7, Failures: 2, Errors: 0, Skipped: 0, Time elapsed: 0.015 sec <<< FAILURE! - in org.apache.commons.codec.binary.Base64OutputStreamTest
testBase64OutputStreamByteByByte(org.apache.commons.codec.binary.Base64OutputStreamTest)  Time elapsed: 0.011 sec  <<< FAILURE!
java.lang.AssertionError: Streaming byte-by-byte base64 encode
	at org.junit.Assert.fail(Assert.java:88)
	at org.junit.Assert.assertTrue(Assert.java:41)
	at org.apache.commons.codec.binary.Base64OutputStreamTest.testByteByByte(Base64OutputStreamTest.java:249)
	at org.apache.commons.codec.binary.Base64OutputStreamTest.testBase64OutputStreamByteByByte(Base64OutputStreamTest.java:154)

testBase64OutputStreamByChunk(org.apache.commons.codec.binary.Base64OutputStreamTest)  Time elapsed: 0.002 sec  <<< FAILURE!
java.lang.AssertionError: Streaming chunked base64 encode
	at org.junit.Assert.fail(Assert.java:88)
	at org.junit.Assert.assertTrue(Assert.java:41)
	at org.apache.commons.codec.binary.Base64OutputStreamTest.testByChunk(Base64OutputStreamTest.java:197)
	at org.apache.commons.codec.binary.Base64OutputStreamTest.testBase64OutputStreamByChunk(Base64OutputStreamTest.java:116)

Running org.apache.commons.codec.binary.Base64Codec13Test
Tests run: 8, Failures: 4, Errors: 0, Skipped: 0, Time elapsed: 0.02 sec <<< FAILURE! - in org.apache.commons.codec.binary.Base64Codec13Test
testEncoder(org.apache.commons.codec.binary.Base64Codec13Test)  Time elapsed: 0 sec  <<< FAILURE!
java.lang.AssertionError: Encoder test-2
	at org.junit.Assert.fail(Assert.java:88)
	at org.junit.Assert.assertTrue(Assert.java:41)
	at org.apache.commons.codec.binary.Base64Codec13Test.testEncoder(Base64Codec13Test.java:372)

testBinaryEncoder(org.apache.commons.codec.binary.Base64Codec13Test)  Time elapsed: 0 sec  <<< FAILURE!
java.lang.AssertionError: BinaryEncoder test-2
	at org.junit.Assert.fail(Assert.java:88)
	at org.junit.Assert.assertTrue(Assert.java:41)
	at org.apache.commons.codec.binary.Base64Codec13Test.testBinaryEncoder(Base64Codec13Test.java:410)

testStaticEncodeChunked(org.apache.commons.codec.binary.Base64Codec13Test)  Time elapsed: 0 sec  <<< FAILURE!
java.lang.AssertionError: static Base64.encodeBase64Chunked() test-2
	at org.junit.Assert.fail(Assert.java:88)
	at org.junit.Assert.assertTrue(Assert.java:41)
	at org.apache.commons.codec.binary.Base64Codec13Test.testStaticEncodeChunked(Base64Codec13Test.java:483)

testStaticEncode(org.apache.commons.codec.binary.Base64Codec13Test)  Time elapsed: 0.001 sec  <<< FAILURE!
java.lang.AssertionError: static Base64.encodeBase64() test-2
	at org.junit.Assert.fail(Assert.java:88)
	at org.junit.Assert.assertTrue(Assert.java:41)
	at org.apache.commons.codec.binary.Base64Codec13Test.testStaticEncode(Base64Codec13Test.java:447)

Running org.apache.commons.codec.binary.Base64InputStreamTest
Tests run: 19, Failures: 2, Errors: 0, Skipped: 0, Time elapsed: 0.012 sec <<< FAILURE! - in org.apache.commons.codec.binary.Base64InputStreamTest
testBase64InputStreamByChunk(org.apache.commons.codec.binary.Base64InputStreamTest)  Time elapsed: 0.001 sec  <<< FAILURE!
java.lang.AssertionError: Streaming base64 encode
	at org.junit.Assert.fail(Assert.java:88)
	at org.junit.Assert.assertTrue(Assert.java:41)
	at org.apache.commons.codec.binary.Base64InputStreamTest.testByChunk(Base64InputStreamTest.java:308)
	at org.apache.commons.codec.binary.Base64InputStreamTest.testBase64InputStreamByChunk(Base64InputStreamTest.java:226)

testBase64InputStreamByteByByte(org.apache.commons.codec.binary.Base64InputStreamTest)  Time elapsed: 0.002 sec  <<< FAILURE!
java.lang.AssertionError: Streaming base64 encode
	at org.junit.Assert.fail(Assert.java:88)
	at org.junit.Assert.assertTrue(Assert.java:41)
	at org.apache.commons.codec.binary.Base64InputStreamTest.testByteByByte(Base64InputStreamTest.java:364)
	at org.apache.commons.codec.binary.Base64InputStreamTest.testBase64InputStreamByteByByte(Base64InputStreamTest.java:264)

Running org.apache.commons.codec.binary.Base32InputStreamTest
Tests run: 16, Failures: 0, Errors: 0, Skipped: 0, Time elapsed: 0.145 sec - in org.apache.commons.codec.binary.Base32InputStreamTest
Running org.apache.commons.codec.binary.Base32OutputStreamTest
Tests run: 6, Failures: 0, Errors: 0, Skipped: 0, Time elapsed: 0.096 sec - in org.apache.commons.codec.binary.Base32OutputStreamTest
Running org.apache.commons.codec.binary.BinaryCodecTest
Tests run: 13, Failures: 0, Errors: 0, Skipped: 0, Time elapsed: 0.008 sec - in org.apache.commons.codec.binary.BinaryCodecTest
Running org.apache.commons.codec.binary.BaseNCodecTest
Tests run: 7, Failures: 0, Errors: 0, Skipped: 0, Time elapsed: 0.001 sec - in org.apache.commons.codec.binary.BaseNCodecTest
Running org.apache.commons.codec.binary.StringUtilsTest
Tests run: 17, Failures: 0, Errors: 0, Skipped: 0, Time elapsed: 0.025 sec - in org.apache.commons.codec.binary.StringUtilsTest
Running org.apache.commons.codec.binary.Base64Test
Tests run: 53, Failures: 13, Errors: 0, Skipped: 1, Time elapsed: 0.048 sec <<< FAILURE! - in org.apache.commons.codec.binary.Base64Test
testConstructor_Int_ByteArray_Boolean_UrlSafe(org.apache.commons.codec.binary.Base64Test)  Time elapsed: 0.003 sec  <<< FAILURE!
org.junit.ComparisonFailure: new Base64(64, \t, true) expected:<[8oHNKwUvcraIAJyctz12SiQmOGstWyYvRvWevOXDhLrawMy5vIqkKjTIj3vYWTS9	xAzc_E_ypWclq5hQ7Iffc3JE93BJ4_L4RdrAD9bbjy1hvYZYNnET4WJeWsDJ_Zp-	qBpTrvpepW8DNVYy0802_1wyCekgAZ6vRUd9cSj_lN88AEdsTV4GMCf1-EwuAiYd	iPxuzn2cKs8q2jWwqlI52NH9Ja6s8PiG71s6-WAEKqnm_UovvySOieGdMUXjQ0JL	hrkHuap9OwUgvQiiCqrEvfAugI0dSvZzYGEyBv5GVLle3QQdf8aIHnpddYVUSu-R	T7PeJ7h--UvfapIngfsQWsvIYBqMZbxt9HOS0rUcQ9Q7PLwn-olQWxGMeK2KYpKo	APaWs9serXqHaoEa_fhmrYp_jc0k0g9q3Zhq06qGMd984ADTR6Z8V-qFa5x1Cw6_	QIif92UH_ylBRnKJNn4sS0oa3OUbNPGnpkB4DdV7UN9atifCJLw-wiJcMl29kJu5	0oUxBGA4cUxhz-Sxk3GDWnwI9ZEktmOOKv6SP0xjWwIMxDbygwAG5R8fkc_9bVa1	thMavm4nC84vZtoSE1RnYtYwbiUVlVHM9EclupOTV9yigWWAzsxHAA8iNs5Vnmip	_V-M7T7q5djBH9NQCIWTI6AkENAuKr5zogGa4-2MzVbvBZMYQlGlZ6LtQLRApXS5	ZYVfD6fu9UC2fi1T8jJPFCuPmXWbxJ0bmu2VWeTgyEdIIkIQB6Zq0sCWC3CuhuK9	Ap1t6u0A1pCJKPoE4UNulzV2TF6C9qAnmjRqQBiXkpegjHQAoHNZJuea_OIQOMnf	Dniib4dDl_qCYOV89HbA1H8tiDJ85VXsrE_db7HAns6pia5avpKHe9HO0s7OMuC-	-SzY0VPUgIYYrBV4YbYbCcwg_nicimj3lmvtRyp-QMgKy9REa_NRk0F5OrqLfMUE	k-pjs1QdV3XEV1DJtiqwA3mbUtQJRxhbYxS_CfPy2Kxpmanvcr92l3i1b8Wv3ZIc	ZuaSxbIm-e-xV2lVJ9SOu4VGDD1zBRW6Y16wP79p0c8l3f93qGR55dvNCimPPWcs	DWwUShM1EyO0EtP1FcTnzHfYijoyEfbf4M3l87Bd7yJdRWRCyih2V8qpAiGIEkBs	HedCTgSlucsRDIMh35IBA9gHfIZUx8DqQ-QFK5Z4Sl4zSmrt5PQxQFhEJ79-e_34	q71KAIywh_WngxVfIMS2bZljXzAqXMzJjvnmCaXa7X4ZZndRokSxYlm3cg8OVemG	_aYAG5alocStzupkjtdNFOhwuGlkBKjZJtUj_gKiX4c06gF_rfr6iWAjpXJRW1iq	3CDZW9ZFZfVrqXWVjNG]Au2A	> but was:<[9IPNKwUvdLiIAp6ctz12SiQmOGstWyYvSPeevufDhrzaws65voykKjbIj33YWTa9	xA7c_FHypWclrZhQ7onfc3JE93BJ5fT4R9zAEdjbjy1hv4ZYNnET4WJeXMLJ_5p-	qBpTsPpepW8DNVYy1c02_1wyC-kgA6CvRUd9cSr_lt88AEdsTV4GMCn1-EwuAiYd	ivxuzn-cLM8q2jewqlI52tP9J7Cs8vqG71s6-WAELKvm_UovvyaOi-OdMUfjQ0JL	iLkHu6p9OwUgvQqiDKzEv_Augo0dTPZzYGEyCP5GVrle3QQdgciIHnpdd4VUTPGR	UbXeKbh--U3fbJIng_sQXM3IYByMZ7xt9HWS1LUcRdQ7Prwn_IlQWxOMeq-KZJSo	AviWtdserXyHbIEa__hmr4p_j80k0g9q35hq1ayGM9984ALTSaZ8WeyFbZx1CxC_	Qoqf92UH_ylBRnSJNn4sS0oa3uUbNvOnpkB4D9V7Ut9atinCJrw-wiJcMl-9kp25	1IUxBGA4cUxh0eaxk3ODWnwI95EktmWOKwCSP0xjWwIMxDjygwAG5R8fk9H9bVi1	thMavm4nDc4vaNoSE1RnZNYwbiUVlVPM9EclvJWTWd6igWeA0MxHAA8iOM5Vnmqp	_WGM7UDq59rBIdNQCoeTJaAkEtAuLL5zogOa5e-MzVjvB5MYQlOlaaTtQrRApXa5	Z4VfEanu9UK2fi1T8jJPFC2PmXebxp0bnO-VW-bgyEdIIkIQCaZq1MKWC3KuiOS9	BJ1t7O0A2JKJKvoE4UNulzV2TGCC-KAnmjRqQBqXlJmgjHQAoHNZKOma_uIQOsvf	DnqicYdDmfyCYuV89HjA1H8tiDJ85VfsrFHdcbPAoNCpi65awJSHfdPO1NDONOK-	-S7Y0VXUgoYYrBV4Y7YbC8wg_nqcimr3lm3tRyp-QsgKzdREbfNRk0F5PLyLfsUE	lepjs1QdV3fEV1LJtiywA3ubVNQJRxhbYxa_C_Xy2qxpm6vvdL92l3q1ccev35Ic	aOiSx7Im-_GxV2lVKdaOvYVGDD1zBRe6Y2CwQb9p088l3_93qGR5593NCiuPPWcs	DWwUShM1EyW0FNX1F8bnzHnYijoyE_jf4s_l9bBd7yJdRWRCyih2WcypAiOIEkBs	H-dCTgalu8sRDoMh4ZIBBdgHfoZUycLqReQFLZZ4Sl4zSmzt5vQxQFhEKb9-ff_4	rb1KAo6wifengxVfIsa2b5ljXzAqXs7JkPvmC6fa7X4ZZndRokaxYlu3cg8OV-uG	_6YAHZilo8at0OpkkNdNFuhwuGlkBqrZKNUj_gSiYYc06gF_r_z6iWAjpXJRW1qq	3CLZXdZFZ_VrqXeVjtO]Au2A	>
	at org.junit.Assert.assertEquals(Assert.java:115)
	at org.apache.commons.codec.binary.Base64Test.testConstructor_Int_ByteArray_Boolean_UrlSafe(Base64Test.java:264)

testPairs(org.apache.commons.codec.binary.Base64Test)  Time elapsed: 0 sec  <<< FAILURE!
java.lang.AssertionError: null
	at org.junit.Assert.fail(Assert.java:86)
	at org.junit.Assert.assertTrue(Assert.java:41)
	at org.junit.Assert.assertTrue(Assert.java:52)
	at org.apache.commons.codec.binary.Base64Test.testPairs(Base64Test.java:550)

testUUID(org.apache.commons.codec.binary.Base64Test)  Time elapsed: 0 sec  <<< FAILURE!
java.lang.AssertionError: standard encode uuid
	at org.junit.Assert.fail(Assert.java:88)
	at org.junit.Assert.assertTrue(Assert.java:41)
	at org.apache.commons.codec.binary.Base64Test.testUUID(Base64Test.java:1180)

testEncodeDecodeSmall(org.apache.commons.codec.binary.Base64Test)  Time elapsed: 0.001 sec  <<< FAILURE!
java.lang.AssertionError: 82,-77 equals 80,-77
	at org.junit.Assert.fail(Assert.java:88)
	at org.junit.Assert.assertTrue(Assert.java:41)
	at org.apache.commons.codec.binary.Base64Test.testEncodeDecodeSmall(Base64Test.java:365)

testCodeInteger1(org.apache.commons.codec.binary.Base64Test)  Time elapsed: 0.003 sec  <<< FAILURE!
org.junit.ComparisonFailure: expected:<li[7dzDacuo67Jg7mtqEm2TRuOM]U=> but was:<li[zdzDScuIy7JgzmtKEm2TRuNs]U=>
	at org.junit.Assert.assertEquals(Assert.java:115)
	at org.junit.Assert.assertEquals(Assert.java:144)
	at org.apache.commons.codec.binary.Base64Test.testCodeInteger1(Base64Test.java:149)

testCodeInteger2(org.apache.commons.codec.binary.Base64Test)  Time elapsed: 0.001 sec  <<< FAILURE!
org.junit.ComparisonFailure: expected:<9B5y[pLY9pMOmtxCeTDHgwd]NFeGs=> but was:<9B5y[orY9osGmtw6eTC/gv9]NFeGs=>
	at org.junit.Assert.assertEquals(Assert.java:115)
	at org.junit.Assert.assertEquals(Assert.java:144)
	at org.apache.commons.codec.binary.Base64Test.testCodeInteger2(Base64Test.java:158)

testCodeInteger3(org.apache.commons.codec.binary.Base64Test)  Time elapsed: 0.001 sec  <<< FAILURE!
org.junit.ComparisonFailure: expected:<[FKIhdgaG5LGKiEtF1vHy4f3y700zaD6QwDS3IrNVGzNp2rY+1LFWTK6D44AyiC1n8uWz1itkYMZF0/aKDK]0Yjg==> but was:<[EqIhdgSG4q+KiEtF1O/y3/vy700zaDyQwDK3ILNVGzNp2LY+0rFWSqyD4YAyiC1n8OOz1itkXsZF0fSKCq]0Yjg==>
	at org.junit.Assert.assertEquals(Assert.java:115)
	at org.junit.Assert.assertEquals(Assert.java:144)
	at org.apache.commons.codec.binary.Base64Test.testCodeInteger3(Base64Test.java:169)

testCodeInteger4(org.apache.commons.codec.binary.Base64Test)  Time elapsed: 0.001 sec  <<< FAILURE!
org.junit.ComparisonFailure: expected:<c[tA8YGxrtngg/zKVvqEOefnwmViFztcnPBYPlJsvh6yKI4iDm68fnp4Mi3RrJ6bZAygFrUIQLxLjV+OJtgJAEto0xAs+Mehuq1DkSFEpP3oDzCTOsrOiS1DwQe4oIb7zVk/9l7aPtJMHW0LVlMdwZNFNNJoqMcT2ZfCPrfv]YvQ0=> but was:<c[NA8YGxrtngg/zCVvKEOd/fwmVaFzNcnPBYPkpsvhaqKIYaDma8fnJ4Mi3RrJaTZAygFrUIQLxDjVeGJtgJAENo0xAs+L+huq07kSFEpP3oDzCLOsLGiS07wP+4oH7zzVk39lbSPspMHW0DVksdwYtFNMpoqL8L2Y+6Pq/n]YvQ0=>
	at org.junit.Assert.assertEquals(Assert.java:115)
	at org.junit.Assert.assertEquals(Assert.java:144)
	at org.apache.commons.codec.binary.Base64Test.testCodeInteger4(Base64Test.java:186)

testUrlSafe(org.apache.commons.codec.binary.Base64Test)  Time elapsed: 0 sec  <<< FAILURE!
java.lang.AssertionError: url-safe i=3
	at org.junit.Assert.fail(Assert.java:88)
	at org.junit.Assert.assertTrue(Assert.java:41)
	at org.apache.commons.codec.binary.Base64Test.testUrlSafe(Base64Test.java:1085)

testEncodeDecodeRandom(org.apache.commons.codec.binary.Base64Test)  Time elapsed: 0.002 sec  <<< FAILURE!
java.lang.AssertionError: null
	at org.junit.Assert.fail(Assert.java:86)
	at org.junit.Assert.assertTrue(Assert.java:41)
	at org.junit.Assert.assertTrue(Assert.java:52)
	at org.apache.commons.codec.binary.Base64Test.testEncodeDecodeRandom(Base64Test.java:352)

testChunkedEncodeMultipleOf76(org.apache.commons.codec.binary.Base64Test)  Time elapsed: 0.001 sec  <<< FAILURE!
java.lang.AssertionError: chunkedEncodeMultipleOf76
	at org.junit.Assert.fail(Assert.java:88)
	at org.junit.Assert.assertTrue(Assert.java:41)
	at org.apache.commons.codec.binary.Base64Test.testChunkedEncodeMultipleOf76(Base64Test.java:132)

testConstructor_Int_ByteArray_Boolean(org.apache.commons.codec.binary.Base64Test)  Time elapsed: 0.001 sec  <<< FAILURE!
org.junit.ComparisonFailure: new Base64(65, \t, false) expected:<[9IPNKwUvdLiIAp6ctz12SiQmOGstWyYvSPeevufDhrzaws65voykKjbIj33YWTa9	xA7c/FHypWclrZhQ7onfc3JE93BJ5fT4R9zAEdjbjy1hv4ZYNnET4WJeXMLJ/5p+	qBpTsPpepW8DNVYy1c02/1wyC+kgA6CvRUd9cSr/lt88AEdsTV4GMCn1+EwuAiYd	ivxuzn+cLM8q2jewqlI52tP9J7Cs8vqG71s6+WAELKvm/UovvyaOi+OdMUfjQ0JL	iLkHu6p9OwUgvQqiDKzEv/Augo0dTPZzYGEyCP5GVrle3QQdgciIHnpdd4VUTPGR	UbXeKbh++U3fbJIng/sQXM3IYByMZ7xt9HWS1LUcRdQ7Prwn/IlQWxOMeq+KZJSo	AviWtdserXyHbIEa//hmr4p/j80k0g9q35hq1ayGM9984ALTSaZ8WeyFbZx1CxC/	Qoqf92UH/ylBRnSJNn4sS0oa3uUbNvOnpkB4D9V7Ut9atinCJrw+wiJcMl+9kp25	1IUxBGA4cUxh0eaxk3ODWnwI95EktmWOKwCSP0xjWwIMxDjygwAG5R8fk9H9bVi1	thMavm4nDc4vaNoSE1RnZNYwbiUVlVPM9EclvJWTWd6igWeA0MxHAA8iOM5Vnmqp	/WGM7UDq59rBIdNQCoeTJaAkEtAuLL5zogOa5e+MzVjvB5MYQlOlaaTtQrRApXa5	Z4VfEanu9UK2fi1T8jJPFC2PmXebxp0bnO+VW+bgyEdIIkIQCaZq1MKWC3KuiOS9	BJ1t7O0A2JKJKvoE4UNulzV2TGCC+KAnmjRqQBqXlJmgjHQAoHNZKOma/uIQOsvf	DnqicYdDmfyCYuV89HjA1H8tiDJ85VfsrFHdcbPAoNCpi65awJSHfdPO1NDONOK+	+S7Y0VXUgoYYrBV4Y7YbC8wg/nqcimr3lm3tRyp+QsgKzdREbfNRk0F5PLyLfsUE	lepjs1QdV3fEV1LJtiywA3ubVNQJRxhbYxa/C/Xy2qxpm6vvdL92l3q1ccev35Ic	aOiSx7Im+/GxV2lVKdaOvYVGDD1zBRe6Y2CwQb9p088l3/93qGR5593NCiuPPWcs	DWwUShM1EyW0FNX1F8bnzHnYijoyE/jf4s/l9bBd7yJdRWRCyih2WcypAiOIEkBs	H+dCTgalu8sRDoMh4ZIBBdgHfoZUycLqReQFLZZ4Sl4zSmzt5vQxQFhEKb9+ff/4	rb1KAo6wifengxVfIsa2b5ljXzAqXs7JkPvmC6fa7X4ZZndRokaxYlu3cg8OV+uG	/6YAHZilo8at0OpkkNdNFuhwuGlkBqrZKNUj/gSiYYc06gF/r/z6iWAjpXJRW1qq	3CLZXdZFZ/VrqXeVjtO]Au2A=	> but was:<[8oHNKwUvcraIAJyctz12SiQmOGstWyYvRvWevOXDhLrawMy5vIqkKjTIj3vYWTS9	xAzc/E/ypWclq5hQ7Iffc3JE93BJ4/L4RdrAD9bbjy1hvYZYNnET4WJeWsDJ/Zp+	qBpTrvpepW8DNVYy0802/1wyCekgAZ6vRUd9cSj/lN88AEdsTV4GMCf1+EwuAiYd	iPxuzn2cKs8q2jWwqlI52NH9Ja6s8PiG71s6+WAEKqnm/UovvySOieGdMUXjQ0JL	hrkHuap9OwUgvQiiCqrEvfAugI0dSvZzYGEyBv5GVLle3QQdf8aIHnpddYVUSu+R	T7PeJ7h++UvfapIngfsQWsvIYBqMZbxt9HOS0rUcQ9Q7PLwn+olQWxGMeK2KYpKo	APaWs9serXqHaoEa/fhmrYp/jc0k0g9q3Zhq06qGMd984ADTR6Z8V+qFa5x1Cw6/	QIif92UH/ylBRnKJNn4sS0oa3OUbNPGnpkB4DdV7UN9atifCJLw+wiJcMl29kJu5	0oUxBGA4cUxhz+Sxk3GDWnwI9ZEktmOOKv6SP0xjWwIMxDbygwAG5R8fkc/9bVa1	thMavm4nC84vZtoSE1RnYtYwbiUVlVHM9EclupOTV9yigWWAzsxHAA8iNs5Vnmip	/V+M7T7q5djBH9NQCIWTI6AkENAuKr5zogGa4+2MzVbvBZMYQlGlZ6LtQLRApXS5	ZYVfD6fu9UC2fi1T8jJPFCuPmXWbxJ0bmu2VWeTgyEdIIkIQB6Zq0sCWC3CuhuK9	Ap1t6u0A1pCJKPoE4UNulzV2TF6C9qAnmjRqQBiXkpegjHQAoHNZJuea/OIQOMnf	Dniib4dDl/qCYOV89HbA1H8tiDJ85VXsrE/db7HAns6pia5avpKHe9HO0s7OMuC+	+SzY0VPUgIYYrBV4YbYbCcwg/nicimj3lmvtRyp+QMgKy9REa/NRk0F5OrqLfMUE	k+pjs1QdV3XEV1DJtiqwA3mbUtQJRxhbYxS/CfPy2Kxpmanvcr92l3i1b8Wv3ZIc	ZuaSxbIm+e+xV2lVJ9SOu4VGDD1zBRW6Y16wP79p0c8l3f93qGR55dvNCimPPWcs	DWwUShM1EyO0EtP1FcTnzHfYijoyEfbf4M3l87Bd7yJdRWRCyih2V8qpAiGIEkBs	HedCTgSlucsRDIMh35IBA9gHfIZUx8DqQ+QFK5Z4Sl4zSmrt5PQxQFhEJ79+e/34	q71KAIywh/WngxVfIMS2bZljXzAqXMzJjvnmCaXa7X4ZZndRokSxYlm3cg8OVemG	/aYAG5alocStzupkjtdNFOhwuGlkBKjZJtUj/gKiX4c06gF/rfr6iWAjpXJRW1iq	3CDZW9ZFZfVrqXWVjNG]Au2A=	>
	at org.junit.Assert.assertEquals(Assert.java:115)
	at org.apache.commons.codec.binary.Base64Test.testConstructor_Int_ByteArray_Boolean(Base64Test.java:250)

testByteToStringVariations(org.apache.commons.codec.binary.Base64Test)  Time elapsed: 0 sec  <<< FAILURE!
org.junit.ComparisonFailure: byteToString UUID expected:<K[/fMJwH+Q5e0nr7tWs]xwkA==> but was:<K[fXMJv/+QZW0nLztWM]xwkA==>
	at org.junit.Assert.assertEquals(Assert.java:115)
	at org.apache.commons.codec.binary.Base64Test.testByteToStringVariations(Base64Test.java:1203)

Running org.apache.commons.codec.binary.HexTest
Tests run: 19, Failures: 0, Errors: 0, Skipped: 0, Time elapsed: 0.176 sec - in org.apache.commons.codec.binary.HexTest
Running org.apache.commons.codec.DecoderExceptionTest
Tests run: 4, Failures: 0, Errors: 0, Skipped: 0, Time elapsed: 0 sec - in org.apache.commons.codec.DecoderExceptionTest
Running org.apache.commons.codec.EncoderExceptionTest
Tests run: 4, Failures: 0, Errors: 0, Skipped: 0, Time elapsed: 0.001 sec - in org.apache.commons.codec.EncoderExceptionTest
Running org.apache.commons.codec.net.BCodecTest
Tests run: 9, Failures: 1, Errors: 0, Skipped: 0, Time elapsed: 0.005 sec <<< FAILURE! - in org.apache.commons.codec.net.BCodecTest
testUTF8RoundTrip(org.apache.commons.codec.net.BCodecTest)  Time elapsed: 0.001 sec  <<< FAILURE!
org.junit.ComparisonFailure: expected:<=?UTF-8?B?[0JLRgdC10Lxf0L/RgNC40LLQtdG]C?=> but was:<=?UTF-8?B?[zpDRf861zrxfzr3Rfs64zrDQs8+]C?=>
	at org.junit.Assert.assertEquals(Assert.java:115)
	at org.junit.Assert.assertEquals(Assert.java:144)
	at org.apache.commons.codec.net.BCodecTest.testUTF8RoundTrip(BCodecTest.java:69)

Running org.apache.commons.codec.net.QCodecTest
Tests run: 12, Failures: 0, Errors: 0, Skipped: 0, Time elapsed: 0.007 sec - in org.apache.commons.codec.net.QCodecTest
Running org.apache.commons.codec.net.UtilsTest
Tests run: 1, Failures: 0, Errors: 0, Skipped: 0, Time elapsed: 0 sec - in org.apache.commons.codec.net.UtilsTest
Running org.apache.commons.codec.net.RFC1522CodecTest
Tests run: 2, Failures: 0, Errors: 0, Skipped: 0, Time elapsed: 0.001 sec - in org.apache.commons.codec.net.RFC1522CodecTest
Running org.apache.commons.codec.net.URLCodecTest
Tests run: 16, Failures: 0, Errors: 0, Skipped: 0, Time elapsed: 0.007 sec - in org.apache.commons.codec.net.URLCodecTest
Running org.apache.commons.codec.net.QuotedPrintableCodecTest
Tests run: 21, Failures: 0, Errors: 0, Skipped: 0, Time elapsed: 0.01 sec - in org.apache.commons.codec.net.QuotedPrintableCodecTest
Running org.apache.commons.codec.StringEncoderComparatorTest
Tests run: 3, Failures: 0, Errors: 0, Skipped: 0, Time elapsed: 0.001 sec - in org.apache.commons.codec.StringEncoderComparatorTest
Running org.apache.commons.codec.language.Caverphone1Test
Tests run: 9, Failures: 0, Errors: 0, Skipped: 0, Time elapsed: 0.028 sec - in org.apache.commons.codec.language.Caverphone1Test
Running org.apache.commons.codec.language.NysiisTest
Tests run: 23, Failures: 0, Errors: 0, Skipped: 0, Time elapsed: 0.02 sec - in org.apache.commons.codec.language.NysiisTest
Running org.apache.commons.codec.language.Caverphone2Test
Tests run: 13, Failures: 0, Errors: 0, Skipped: 0, Time elapsed: 0.122 sec - in org.apache.commons.codec.language.Caverphone2Test
Running org.apache.commons.codec.language.DaitchMokotoffSoundexTest
Tests run: 13, Failures: 0, Errors: 0, Skipped: 0, Time elapsed: 0.047 sec - in org.apache.commons.codec.language.DaitchMokotoffSoundexTest
Running org.apache.commons.codec.language.bm.BeiderMorseEncoderTest
Tests run: 22, Failures: 0, Errors: 0, Skipped: 0, Time elapsed: 2.914 sec - in org.apache.commons.codec.language.bm.BeiderMorseEncoderTest
Running org.apache.commons.codec.language.bm.PhoneticEngineTest
Tests run: 8, Failures: 0, Errors: 0, Skipped: 0, Time elapsed: 0.016 sec - in org.apache.commons.codec.language.bm.PhoneticEngineTest
Running org.apache.commons.codec.language.bm.PhoneticEngineRegressionTest
Tests run: 4, Failures: 0, Errors: 0, Skipped: 0, Time elapsed: 0.016 sec - in org.apache.commons.codec.language.bm.PhoneticEngineRegressionTest
Running org.apache.commons.codec.language.bm.RuleTest
Tests run: 3, Failures: 0, Errors: 0, Skipped: 0, Time elapsed: 0.003 sec - in org.apache.commons.codec.language.bm.RuleTest
Running org.apache.commons.codec.language.bm.LanguageGuessingTest
Tests run: 18, Failures: 0, Errors: 0, Skipped: 0, Time elapsed: 0.012 sec - in org.apache.commons.codec.language.bm.LanguageGuessingTest
Running org.apache.commons.codec.language.DoubleMetaphoneTest
Tests run: 16, Failures: 0, Errors: 0, Skipped: 0, Time elapsed: 0.044 sec - in org.apache.commons.codec.language.DoubleMetaphoneTest
Running org.apache.commons.codec.language.SoundexTest
Tests run: 28, Failures: 0, Errors: 0, Skipped: 0, Time elapsed: 0.01 sec - in org.apache.commons.codec.language.SoundexTest
Running org.apache.commons.codec.language.RefinedSoundexTest
Tests run: 10, Failures: 0, Errors: 0, Skipped: 0, Time elapsed: 0.004 sec - in org.apache.commons.codec.language.RefinedSoundexTest
Running org.apache.commons.codec.language.MatchRatingApproachEncoderTest
Tests run: 96, Failures: 0, Errors: 0, Skipped: 0, Time elapsed: 0.027 sec - in org.apache.commons.codec.language.MatchRatingApproachEncoderTest
Running org.apache.commons.codec.language.ColognePhoneticTest
Tests run: 13, Failures: 0, Errors: 0, Skipped: 0, Time elapsed: 0.001 sec - in org.apache.commons.codec.language.ColognePhoneticTest
Running org.apache.commons.codec.language.DoubleMetaphone2Test
Tests run: 6, Failures: 0, Errors: 0, Skipped: 0, Time elapsed: 0.025 sec - in org.apache.commons.codec.language.DoubleMetaphone2Test
Running org.apache.commons.codec.language.MetaphoneTest
Tests run: 34, Failures: 0, Errors: 0, Skipped: 0, Time elapsed: 0.123 sec - in org.apache.commons.codec.language.MetaphoneTest
Running org.apache.commons.codec.CharEncodingTest
Tests run: 7, Failures: 0, Errors: 0, Skipped: 0, Time elapsed: 0 sec - in org.apache.commons.codec.CharEncodingTest

Results :

Failed tests: 
  Base64OutputStreamTest.testBase64OutputStreamByteByByte:154->testByteByByte:249 Streaming byte-by-byte base64 encode
  Base64OutputStreamTest.testBase64OutputStreamByChunk:116->testByChunk:197 Streaming chunked base64 encode
  Base64Codec13Test.testEncoder:372 Encoder test-2
  Base64Codec13Test.testBinaryEncoder:410 BinaryEncoder test-2
  Base64Codec13Test.testStaticEncodeChunked:483 static Base64.encodeBase64Chunked() test-2
  Base64Codec13Test.testStaticEncode:447 static Base64.encodeBase64() test-2
  Base64InputStreamTest.testBase64InputStreamByChunk:226->testByChunk:308 Streaming base64 encode
  Base64InputStreamTest.testBase64InputStreamByteByByte:264->testByteByByte:364 Streaming base64 encode
  Base64Test.testConstructor_Int_ByteArray_Boolean_UrlSafe:264 new Base64(64, \t, true) expected:<[8oHNKwUvcraIAJyctz12SiQmOGstWyYvRvWevOXDhLrawMy5vIqkKjTIj3vYWTS9	xAzc_E_ypWclq5hQ7Iffc3JE93BJ4_L4RdrAD9bbjy1hvYZYNnET4WJeWsDJ_Zp-	qBpTrvpepW8DNVYy0802_1wyCekgAZ6vRUd9cSj_lN88AEdsTV4GMCf1-EwuAiYd	iPxuzn2cKs8q2jWwqlI52NH9Ja6s8PiG71s6-WAEKqnm_UovvySOieGdMUXjQ0JL	hrkHuap9OwUgvQiiCqrEvfAugI0dSvZzYGEyBv5GVLle3QQdf8aIHnpddYVUSu-R	T7PeJ7h--UvfapIngfsQWsvIYBqMZbxt9HOS0rUcQ9Q7PLwn-olQWxGMeK2KYpKo	APaWs9serXqHaoEa_fhmrYp_jc0k0g9q3Zhq06qGMd984ADTR6Z8V-qFa5x1Cw6_	QIif92UH_ylBRnKJNn4sS0oa3OUbNPGnpkB4DdV7UN9atifCJLw-wiJcMl29kJu5	0oUxBGA4cUxhz-Sxk3GDWnwI9ZEktmOOKv6SP0xjWwIMxDbygwAG5R8fkc_9bVa1	thMavm4nC84vZtoSE1RnYtYwbiUVlVHM9EclupOTV9yigWWAzsxHAA8iNs5Vnmip	_V-M7T7q5djBH9NQCIWTI6AkENAuKr5zogGa4-2MzVbvBZMYQlGlZ6LtQLRApXS5	ZYVfD6fu9UC2fi1T8jJPFCuPmXWbxJ0bmu2VWeTgyEdIIkIQB6Zq0sCWC3CuhuK9	Ap1t6u0A1pCJKPoE4UNulzV2TF6C9qAnmjRqQBiXkpegjHQAoHNZJuea_OIQOMnf	Dniib4dDl_qCYOV89HbA1H8tiDJ85VXsrE_db7HAns6pia5avpKHe9HO0s7OMuC-	-SzY0VPUgIYYrBV4YbYbCcwg_nicimj3lmvtRyp-QMgKy9REa_NRk0F5OrqLfMUE	k-pjs1QdV3XEV1DJtiqwA3mbUtQJRxhbYxS_CfPy2Kxpmanvcr92l3i1b8Wv3ZIc	ZuaSxbIm-e-xV2lVJ9SOu4VGDD1zBRW6Y16wP79p0c8l3f93qGR55dvNCimPPWcs	DWwUShM1EyO0EtP1FcTnzHfYijoyEfbf4M3l87Bd7yJdRWRCyih2V8qpAiGIEkBs	HedCTgSlucsRDIMh35IBA9gHfIZUx8DqQ-QFK5Z4Sl4zSmrt5PQxQFhEJ79-e_34	q71KAIywh_WngxVfIMS2bZljXzAqXMzJjvnmCaXa7X4ZZndRokSxYlm3cg8OVemG	_aYAG5alocStzupkjtdNFOhwuGlkBKjZJtUj_gKiX4c06gF_rfr6iWAjpXJRW1iq	3CDZW9ZFZfVrqXWVjNG]Au2A	> but was:<[9IPNKwUvdLiIAp6ctz12SiQmOGstWyYvSPeevufDhrzaws65voykKjbIj33YWTa9	xA7c_FHypWclrZhQ7onfc3JE93BJ5fT4R9zAEdjbjy1hv4ZYNnET4WJeXMLJ_5p-	qBpTsPpepW8DNVYy1c02_1wyC-kgA6CvRUd9cSr_lt88AEdsTV4GMCn1-EwuAiYd	ivxuzn-cLM8q2jewqlI52tP9J7Cs8vqG71s6-WAELKvm_UovvyaOi-OdMUfjQ0JL	iLkHu6p9OwUgvQqiDKzEv_Augo0dTPZzYGEyCP5GVrle3QQdgciIHnpdd4VUTPGR	UbXeKbh--U3fbJIng_sQXM3IYByMZ7xt9HWS1LUcRdQ7Prwn_IlQWxOMeq-KZJSo	AviWtdserXyHbIEa__hmr4p_j80k0g9q35hq1ayGM9984ALTSaZ8WeyFbZx1CxC_	Qoqf92UH_ylBRnSJNn4sS0oa3uUbNvOnpkB4D9V7Ut9atinCJrw-wiJcMl-9kp25	1IUxBGA4cUxh0eaxk3ODWnwI95EktmWOKwCSP0xjWwIMxDjygwAG5R8fk9H9bVi1	thMavm4nDc4vaNoSE1RnZNYwbiUVlVPM9EclvJWTWd6igWeA0MxHAA8iOM5Vnmqp	_WGM7UDq59rBIdNQCoeTJaAkEtAuLL5zogOa5e-MzVjvB5MYQlOlaaTtQrRApXa5	Z4VfEanu9UK2fi1T8jJPFC2PmXebxp0bnO-VW-bgyEdIIkIQCaZq1MKWC3KuiOS9	BJ1t7O0A2JKJKvoE4UNulzV2TGCC-KAnmjRqQBqXlJmgjHQAoHNZKOma_uIQOsvf	DnqicYdDmfyCYuV89HjA1H8tiDJ85VfsrFHdcbPAoNCpi65awJSHfdPO1NDONOK-	-S7Y0VXUgoYYrBV4Y7YbC8wg_nqcimr3lm3tRyp-QsgKzdREbfNRk0F5PLyLfsUE	lepjs1QdV3fEV1LJtiywA3ubVNQJRxhbYxa_C_Xy2qxpm6vvdL92l3q1ccev35Ic	aOiSx7Im-_GxV2lVKdaOvYVGDD1zBRe6Y2CwQb9p088l3_93qGR5593NCiuPPWcs	DWwUShM1EyW0FNX1F8bnzHnYijoyE_jf4s_l9bBd7yJdRWRCyih2WcypAiOIEkBs	H-dCTgalu8sRDoMh4ZIBBdgHfoZUycLqReQFLZZ4Sl4zSmzt5vQxQFhEKb9-ff_4	rb1KAo6wifengxVfIsa2b5ljXzAqXs7JkPvmC6fa7X4ZZndRokaxYlu3cg8OV-uG	_6YAHZilo8at0OpkkNdNFuhwuGlkBqrZKNUj_gSiYYc06gF_r_z6iWAjpXJRW1qq	3CLZXdZFZ_VrqXeVjtO]Au2A	>
  Base64Test.testPairs:550 null
  Base64Test.testUUID:1180 standard encode uuid
  Base64Test.testEncodeDecodeSmall:365 82,-77 equals 80,-77
  Base64Test.testCodeInteger1:149 expected:<li[7dzDacuo67Jg7mtqEm2TRuOM]U=> but was:<li[zdzDScuIy7JgzmtKEm2TRuNs]U=>
  Base64Test.testCodeInteger2:158 expected:<9B5y[pLY9pMOmtxCeTDHgwd]NFeGs=> but was:<9B5y[orY9osGmtw6eTC/gv9]NFeGs=>
  Base64Test.testCodeInteger3:169 expected:<[FKIhdgaG5LGKiEtF1vHy4f3y700zaD6QwDS3IrNVGzNp2rY+1LFWTK6D44AyiC1n8uWz1itkYMZF0/aKDK]0Yjg==> but was:<[EqIhdgSG4q+KiEtF1O/y3/vy700zaDyQwDK3ILNVGzNp2LY+0rFWSqyD4YAyiC1n8OOz1itkXsZF0fSKCq]0Yjg==>
  Base64Test.testCodeInteger4:186 expected:<c[tA8YGxrtngg/zKVvqEOefnwmViFztcnPBYPlJsvh6yKI4iDm68fnp4Mi3RrJ6bZAygFrUIQLxLjV+OJtgJAEto0xAs+Mehuq1DkSFEpP3oDzCTOsrOiS1DwQe4oIb7zVk/9l7aPtJMHW0LVlMdwZNFNNJoqMcT2ZfCPrfv]YvQ0=> but was:<c[NA8YGxrtngg/zCVvKEOd/fwmVaFzNcnPBYPkpsvhaqKIYaDma8fnJ4Mi3RrJaTZAygFrUIQLxDjVeGJtgJAENo0xAs+L+huq07kSFEpP3oDzCLOsLGiS07wP+4oH7zzVk39lbSPspMHW0DVksdwYtFNMpoqL8L2Y+6Pq/n]YvQ0=>
  Base64Test.testUrlSafe:1085 url-safe i=3
  Base64Test.testEncodeDecodeRandom:352 null
  Base64Test.testChunkedEncodeMultipleOf76:132 chunkedEncodeMultipleOf76
  Base64Test.testConstructor_Int_ByteArray_Boolean:250 new Base64(65, \t, false) expected:<[9IPNKwUvdLiIAp6ctz12SiQmOGstWyYvSPeevufDhrzaws65voykKjbIj33YWTa9	xA7c/FHypWclrZhQ7onfc3JE93BJ5fT4R9zAEdjbjy1hv4ZYNnET4WJeXMLJ/5p+	qBpTsPpepW8DNVYy1c02/1wyC+kgA6CvRUd9cSr/lt88AEdsTV4GMCn1+EwuAiYd	ivxuzn+cLM8q2jewqlI52tP9J7Cs8vqG71s6+WAELKvm/UovvyaOi+OdMUfjQ0JL	iLkHu6p9OwUgvQqiDKzEv/Augo0dTPZzYGEyCP5GVrle3QQdgciIHnpdd4VUTPGR	UbXeKbh++U3fbJIng/sQXM3IYByMZ7xt9HWS1LUcRdQ7Prwn/IlQWxOMeq+KZJSo	AviWtdserXyHbIEa//hmr4p/j80k0g9q35hq1ayGM9984ALTSaZ8WeyFbZx1CxC/	Qoqf92UH/ylBRnSJNn4sS0oa3uUbNvOnpkB4D9V7Ut9atinCJrw+wiJcMl+9kp25	1IUxBGA4cUxh0eaxk3ODWnwI95EktmWOKwCSP0xjWwIMxDjygwAG5R8fk9H9bVi1	thMavm4nDc4vaNoSE1RnZNYwbiUVlVPM9EclvJWTWd6igWeA0MxHAA8iOM5Vnmqp	/WGM7UDq59rBIdNQCoeTJaAkEtAuLL5zogOa5e+MzVjvB5MYQlOlaaTtQrRApXa5	Z4VfEanu9UK2fi1T8jJPFC2PmXebxp0bnO+VW+bgyEdIIkIQCaZq1MKWC3KuiOS9	BJ1t7O0A2JKJKvoE4UNulzV2TGCC+KAnmjRqQBqXlJmgjHQAoHNZKOma/uIQOsvf	DnqicYdDmfyCYuV89HjA1H8tiDJ85VfsrFHdcbPAoNCpi65awJSHfdPO1NDONOK+	+S7Y0VXUgoYYrBV4Y7YbC8wg/nqcimr3lm3tRyp+QsgKzdREbfNRk0F5PLyLfsUE	lepjs1QdV3fEV1LJtiywA3ubVNQJRxhbYxa/C/Xy2qxpm6vvdL92l3q1ccev35Ic	aOiSx7Im+/GxV2lVKdaOvYVGDD1zBRe6Y2CwQb9p088l3/93qGR5593NCiuPPWcs	DWwUShM1EyW0FNX1F8bnzHnYijoyE/jf4s/l9bBd7yJdRWRCyih2WcypAiOIEkBs	H+dCTgalu8sRDoMh4ZIBBdgHfoZUycLqReQFLZZ4Sl4zSmzt5vQxQFhEKb9+ff/4	rb1KAo6wifengxVfIsa2b5ljXzAqXs7JkPvmC6fa7X4ZZndRokaxYlu3cg8OV+uG	/6YAHZilo8at0OpkkNdNFuhwuGlkBqrZKNUj/gSiYYc06gF/r/z6iWAjpXJRW1qq	3CLZXdZFZ/VrqXeVjtO]Au2A=	> but was:<[8oHNKwUvcraIAJyctz12SiQmOGstWyYvRvWevOXDhLrawMy5vIqkKjTIj3vYWTS9	xAzc/E/ypWclq5hQ7Iffc3JE93BJ4/L4RdrAD9bbjy1hvYZYNnET4WJeWsDJ/Zp+	qBpTrvpepW8DNVYy0802/1wyCekgAZ6vRUd9cSj/lN88AEdsTV4GMCf1+EwuAiYd	iPxuzn2cKs8q2jWwqlI52NH9Ja6s8PiG71s6+WAEKqnm/UovvySOieGdMUXjQ0JL	hrkHuap9OwUgvQiiCqrEvfAugI0dSvZzYGEyBv5GVLle3QQdf8aIHnpddYVUSu+R	T7PeJ7h++UvfapIngfsQWsvIYBqMZbxt9HOS0rUcQ9Q7PLwn+olQWxGMeK2KYpKo	APaWs9serXqHaoEa/fhmrYp/jc0k0g9q3Zhq06qGMd984ADTR6Z8V+qFa5x1Cw6/	QIif92UH/ylBRnKJNn4sS0oa3OUbNPGnpkB4DdV7UN9atifCJLw+wiJcMl29kJu5	0oUxBGA4cUxhz+Sxk3GDWnwI9ZEktmOOKv6SP0xjWwIMxDbygwAG5R8fkc/9bVa1	thMavm4nC84vZtoSE1RnYtYwbiUVlVHM9EclupOTV9yigWWAzsxHAA8iNs5Vnmip	/V+M7T7q5djBH9NQCIWTI6AkENAuKr5zogGa4+2MzVbvBZMYQlGlZ6LtQLRApXS5	ZYVfD6fu9UC2fi1T8jJPFCuPmXWbxJ0bmu2VWeTgyEdIIkIQB6Zq0sCWC3CuhuK9	Ap1t6u0A1pCJKPoE4UNulzV2TF6C9qAnmjRqQBiXkpegjHQAoHNZJuea/OIQOMnf	Dniib4dDl/qCYOV89HbA1H8tiDJ85VXsrE/db7HAns6pia5avpKHe9HO0s7OMuC+	+SzY0VPUgIYYrBV4YbYbCcwg/nicimj3lmvtRyp+QMgKy9REa/NRk0F5OrqLfMUE	k+pjs1QdV3XEV1DJtiqwA3mbUtQJRxhbYxS/CfPy2Kxpmanvcr92l3i1b8Wv3ZIc	ZuaSxbIm+e+xV2lVJ9SOu4VGDD1zBRW6Y16wP79p0c8l3f93qGR55dvNCimPPWcs	DWwUShM1EyO0EtP1FcTnzHfYijoyEfbf4M3l87Bd7yJdRWRCyih2V8qpAiGIEkBs	HedCTgSlucsRDIMh35IBA9gHfIZUx8DqQ+QFK5Z4Sl4zSmrt5PQxQFhEJ79+e/34	q71KAIywh/WngxVfIMS2bZljXzAqXMzJjvnmCaXa7X4ZZndRokSxYlm3cg8OVemG	/aYAG5alocStzupkjtdNFOhwuGlkBKjZJtUj/gKiX4c06gF/rfr6iWAjpXJRW1iq	3CDZW9ZFZfVrqXWVjNG]Au2A=	>
  Base64Test.testByteToStringVariations:1203 byteToString UUID expected:<K[/fMJwH+Q5e0nr7tWs]xwkA==> but was:<K[fXMJv/+QZW0nLztWM]xwkA==>
  BCodecTest.testUTF8RoundTrip:69 expected:<=?UTF-8?B?[0JLRgdC10Lxf0L/RgNC40LLQtdG]C?=> but was:<=?UTF-8?B?[zpDRf861zrxfzr3Rfs64zrDQs8+]C?=>

Tests run: 662, Failures: 22, Errors: 0, Skipped: 1

[INFO] ------------------------------------------------------------------------
[INFO] BUILD FAILURE
[INFO] ------------------------------------------------------------------------
[INFO] Total time: 13.053s
[INFO] Finished at: Sun Aug 02 07:10:59 BST 2015
[INFO] Final Memory: 26M/340M
[INFO] ------------------------------------------------------------------------
[ERROR] Failed to execute goal org.apache.maven.plugins:maven-surefire-plugin:2.17:test (default-test) on project commons-codec: There are test failures.
[ERROR] 
[ERROR] Please refer to /home/perham/Study/LittleDarwin/Cases/commons-codec-1.10-src/target/surefire-reports for the individual test results.
[ERROR] -> [Help 1]
[ERROR] 
[ERROR] To see the full stack trace of the errors, re-run Maven with the -e switch.
[ERROR] Re-run Maven using the -X switch to enable full debug logging.
[ERROR] 
[ERROR] For more information about the errors and possible solutions, please read the following articles:
[ERROR] [Help 1] http://cwiki.apache.org/confluence/display/MAVEN/MojoFailureException
