[INFO] Scanning for projects...
[INFO]                                                                         
[INFO] ------------------------------------------------------------------------
[INFO] Building Apache Commons Codec 1.10
[INFO] ------------------------------------------------------------------------
[INFO] 
[INFO] --- maven-enforcer-plugin:1.3.1:enforce (enforce-maven-3) @ commons-codec ---
[INFO] 
[INFO] --- maven-antrun-plugin:1.7:run (javadoc.resources) @ commons-codec ---
[INFO] Executing tasks

main:
[INFO] Executed tasks
[INFO] 
[INFO] --- maven-remote-resources-plugin:1.5:process (default) @ commons-codec ---
[INFO] 
[INFO] --- buildnumber-maven-plugin:1.3:create (default) @ commons-codec ---
[INFO] Executing: /bin/sh -c cd /home/perham/Study/LittleDarwin/Cases/commons-codec-1.10-src && svn --non-interactive info
[INFO] Working directory: /home/perham/Study/LittleDarwin/Cases/commons-codec-1.10-src
[INFO] Storing buildNumber: ?????? at timestamp: 1438495741489
[INFO] Executing: /bin/sh -c cd /home/perham/Study/LittleDarwin/Cases/commons-codec-1.10-src && svn --non-interactive info
[INFO] Working directory: /home/perham/Study/LittleDarwin/Cases/commons-codec-1.10-src
[INFO] Storing buildScmBranch: UNKNOWN_BRANCH
[INFO] 
[INFO] --- maven-resources-plugin:2.7:resources (default-resources) @ commons-codec ---
[INFO] Using 'UTF-8' encoding to copy filtered resources.
[INFO] Copying 128 resources
[INFO] Copying 2 resources to META-INF
[INFO] 
[INFO] --- maven-compiler-plugin:3.2:compile (default-compile) @ commons-codec ---
[INFO] Changes detected - recompiling the module!
[INFO] Compiling 60 source files to /home/perham/Study/LittleDarwin/Cases/commons-codec-1.10-src/target/classes
[INFO] /home/perham/Study/LittleDarwin/Cases/commons-codec-1.10-src/src/main/java/org/apache/commons/codec/digest/Sha2Crypt.java: Some input files use or override a deprecated API.
[INFO] /home/perham/Study/LittleDarwin/Cases/commons-codec-1.10-src/src/main/java/org/apache/commons/codec/digest/Sha2Crypt.java: Recompile with -Xlint:deprecation for details.
[INFO] 
[INFO] --- maven-bundle-plugin:2.5.3:manifest (bundle-manifest) @ commons-codec ---
[INFO] 
[INFO] --- maven-resources-plugin:2.7:testResources (default-testResources) @ commons-codec ---
[INFO] Using 'UTF-8' encoding to copy filtered resources.
[INFO] skip non existing resourceDirectory /home/perham/Study/LittleDarwin/Cases/commons-codec-1.10-src/src/test/resources
[INFO] Copying 2 resources to META-INF
[INFO] 
[INFO] --- maven-compiler-plugin:3.2:testCompile (default-testCompile) @ commons-codec ---
[INFO] Nothing to compile - all classes are up to date
[INFO] 
[INFO] --- maven-surefire-plugin:2.17:test (default-test) @ commons-codec ---
[INFO] Surefire report directory: /home/perham/Study/LittleDarwin/Cases/commons-codec-1.10-src/target/surefire-reports

-------------------------------------------------------
 T E S T S
-------------------------------------------------------
Running org.apache.commons.codec.digest.B64Test
Tests run: 2, Failures: 0, Errors: 0, Skipped: 0, Time elapsed: 0.025 sec - in org.apache.commons.codec.digest.B64Test
Running org.apache.commons.codec.digest.DigestUtilsTest
Tests run: 17, Failures: 0, Errors: 0, Skipped: 0, Time elapsed: 0.647 sec - in org.apache.commons.codec.digest.DigestUtilsTest
Running org.apache.commons.codec.digest.Sha512CryptTest
Tests run: 8, Failures: 0, Errors: 0, Skipped: 0, Time elapsed: 0.542 sec - in org.apache.commons.codec.digest.Sha512CryptTest
Running org.apache.commons.codec.digest.Apr1CryptTest
Tests run: 8, Failures: 0, Errors: 0, Skipped: 0, Time elapsed: 0.07 sec - in org.apache.commons.codec.digest.Apr1CryptTest
Running org.apache.commons.codec.digest.HmacUtilsTest
Tests run: 24, Failures: 0, Errors: 0, Skipped: 0, Time elapsed: 0.042 sec - in org.apache.commons.codec.digest.HmacUtilsTest
Running org.apache.commons.codec.digest.Sha2CryptTest
Tests run: 1, Failures: 0, Errors: 0, Skipped: 0, Time elapsed: 0 sec - in org.apache.commons.codec.digest.Sha2CryptTest
Running org.apache.commons.codec.digest.CryptTest
Tests run: 4, Failures: 0, Errors: 0, Skipped: 0, Time elapsed: 0.063 sec - in org.apache.commons.codec.digest.CryptTest
Running org.apache.commons.codec.digest.Sha256CryptTest
Tests run: 7, Failures: 0, Errors: 0, Skipped: 0, Time elapsed: 0.111 sec - in org.apache.commons.codec.digest.Sha256CryptTest
Running org.apache.commons.codec.digest.Md5CryptTest
Tests run: 7, Failures: 0, Errors: 0, Skipped: 0, Time elapsed: 0.025 sec - in org.apache.commons.codec.digest.Md5CryptTest
Running org.apache.commons.codec.digest.UnixCryptTest
Tests run: 9, Failures: 0, Errors: 0, Skipped: 0, Time elapsed: 0.006 sec - in org.apache.commons.codec.digest.UnixCryptTest
Running org.apache.commons.codec.CharsetsTest
Tests run: 7, Failures: 0, Errors: 0, Skipped: 0, Time elapsed: 0 sec - in org.apache.commons.codec.CharsetsTest
Running org.apache.commons.codec.binary.Base32Test
Tests run: 8, Failures: 0, Errors: 0, Skipped: 0, Time elapsed: 0.005 sec - in org.apache.commons.codec.binary.Base32Test
Running org.apache.commons.codec.binary.Base64OutputStreamTest
Tests run: 7, Failures: 2, Errors: 0, Skipped: 0, Time elapsed: 0.012 sec <<< FAILURE! - in org.apache.commons.codec.binary.Base64OutputStreamTest
testBase64OutputStreamByteByByte(org.apache.commons.codec.binary.Base64OutputStreamTest)  Time elapsed: 0.005 sec  <<< FAILURE!
java.lang.AssertionError: Streaming byte-by-byte base64 encode
	at org.junit.Assert.fail(Assert.java:88)
	at org.junit.Assert.assertTrue(Assert.java:41)
	at org.apache.commons.codec.binary.Base64OutputStreamTest.testByteByByte(Base64OutputStreamTest.java:249)
	at org.apache.commons.codec.binary.Base64OutputStreamTest.testBase64OutputStreamByteByByte(Base64OutputStreamTest.java:144)

testBase64OutputStreamByChunk(org.apache.commons.codec.binary.Base64OutputStreamTest)  Time elapsed: 0 sec  <<< FAILURE!
java.lang.AssertionError: Streaming chunked base64 encode
	at org.junit.Assert.fail(Assert.java:88)
	at org.junit.Assert.assertTrue(Assert.java:41)
	at org.apache.commons.codec.binary.Base64OutputStreamTest.testByChunk(Base64OutputStreamTest.java:197)
	at org.apache.commons.codec.binary.Base64OutputStreamTest.testBase64OutputStreamByChunk(Base64OutputStreamTest.java:106)

Running org.apache.commons.codec.binary.Base64Codec13Test
Tests run: 8, Failures: 1, Errors: 3, Skipped: 0, Time elapsed: 0.015 sec <<< FAILURE! - in org.apache.commons.codec.binary.Base64Codec13Test
testEncoder(org.apache.commons.codec.binary.Base64Codec13Test)  Time elapsed: 0 sec  <<< ERROR!
java.lang.NullPointerException: null
	at org.apache.commons.codec.binary.Base64.encode(Base64.java:72)
	at org.apache.commons.codec.binary.BaseNCodec.encode(BaseNCodec.java:430)
	at org.apache.commons.codec.binary.BaseNCodec.encode(BaseNCodec.java:338)
	at org.apache.commons.codec.binary.Base64Codec13Test.testEncoder(Base64Codec13Test.java:371)

testBinaryEncoder(org.apache.commons.codec.binary.Base64Codec13Test)  Time elapsed: 0 sec  <<< ERROR!
java.lang.NullPointerException: null
	at org.apache.commons.codec.binary.Base64.encode(Base64.java:72)
	at org.apache.commons.codec.binary.BaseNCodec.encode(BaseNCodec.java:430)
	at org.apache.commons.codec.binary.Base64Codec13Test.testBinaryEncoder(Base64Codec13Test.java:409)

testStaticEncodeChunked(org.apache.commons.codec.binary.Base64Codec13Test)  Time elapsed: 0 sec  <<< FAILURE!
java.lang.AssertionError: static Base64.encodeBase64Chunked() test-4
	at org.junit.Assert.fail(Assert.java:88)
	at org.junit.Assert.assertTrue(Assert.java:41)
	at org.apache.commons.codec.binary.Base64Codec13Test.testStaticEncodeChunked(Base64Codec13Test.java:483)

testStaticEncode(org.apache.commons.codec.binary.Base64Codec13Test)  Time elapsed: 0.001 sec  <<< ERROR!
java.lang.NullPointerException: null
	at org.apache.commons.codec.binary.Base64.encode(Base64.java:72)
	at org.apache.commons.codec.binary.BaseNCodec.encode(BaseNCodec.java:430)
	at org.apache.commons.codec.binary.Base64.encodeBase64(Base64.java:117)
	at org.apache.commons.codec.binary.Base64.encodeBase64(Base64.java:112)
	at org.apache.commons.codec.binary.Base64.encodeBase64(Base64.java:111)
	at org.apache.commons.codec.binary.Base64.encodeBase64(Base64.java:106)
	at org.apache.commons.codec.binary.Base64Codec13Test.testStaticEncode(Base64Codec13Test.java:446)

Running org.apache.commons.codec.binary.Base64InputStreamTest
Tests run: 19, Failures: 2, Errors: 1, Skipped: 0, Time elapsed: 0.01 sec <<< FAILURE! - in org.apache.commons.codec.binary.Base64InputStreamTest
testBase64InputStreamByChunk(org.apache.commons.codec.binary.Base64InputStreamTest)  Time elapsed: 0.001 sec  <<< FAILURE!
java.lang.AssertionError: Streaming base64 encode
	at org.junit.Assert.fail(Assert.java:88)
	at org.junit.Assert.assertTrue(Assert.java:41)
	at org.apache.commons.codec.binary.Base64InputStreamTest.testByChunk(Base64InputStreamTest.java:308)
	at org.apache.commons.codec.binary.Base64InputStreamTest.testBase64InputStreamByChunk(Base64InputStreamTest.java:216)

testCodec105(org.apache.commons.codec.binary.Base64InputStreamTest)  Time elapsed: 0 sec  <<< ERROR!
java.lang.NullPointerException: null
	at org.apache.commons.codec.binary.Base64.encode(Base64.java:72)
	at org.apache.commons.codec.binary.BaseNCodecInputStream.read(BaseNCodecInputStream.java:160)
	at org.apache.commons.codec.binary.BaseNCodecInputStream.read(BaseNCodecInputStream.java:97)
	at org.apache.commons.codec.binary.Base64InputStreamTest.testCodec105(Base64InputStreamTest.java:84)

testBase64InputStreamByteByByte(org.apache.commons.codec.binary.Base64InputStreamTest)  Time elapsed: 0 sec  <<< FAILURE!
java.lang.AssertionError: EOF expected:<-1> but was:<98>
	at org.junit.Assert.fail(Assert.java:88)
	at org.junit.Assert.failNotEquals(Assert.java:743)
	at org.junit.Assert.assertEquals(Assert.java:118)
	at org.junit.Assert.assertEquals(Assert.java:555)
	at org.apache.commons.codec.binary.Base64InputStreamTest.testByteByByte(Base64InputStreamTest.java:362)
	at org.apache.commons.codec.binary.Base64InputStreamTest.testBase64InputStreamByteByByte(Base64InputStreamTest.java:254)

Running org.apache.commons.codec.binary.Base32InputStreamTest
Tests run: 16, Failures: 0, Errors: 0, Skipped: 0, Time elapsed: 0.151 sec - in org.apache.commons.codec.binary.Base32InputStreamTest
Running org.apache.commons.codec.binary.Base32OutputStreamTest
Tests run: 6, Failures: 0, Errors: 0, Skipped: 0, Time elapsed: 0.101 sec - in org.apache.commons.codec.binary.Base32OutputStreamTest
Running org.apache.commons.codec.binary.BinaryCodecTest
Tests run: 13, Failures: 0, Errors: 0, Skipped: 0, Time elapsed: 0.01 sec - in org.apache.commons.codec.binary.BinaryCodecTest
Running org.apache.commons.codec.binary.BaseNCodecTest
Tests run: 7, Failures: 0, Errors: 0, Skipped: 0, Time elapsed: 0.001 sec - in org.apache.commons.codec.binary.BaseNCodecTest
Running org.apache.commons.codec.binary.StringUtilsTest
Tests run: 17, Failures: 0, Errors: 0, Skipped: 0, Time elapsed: 0.024 sec - in org.apache.commons.codec.binary.StringUtilsTest
Running org.apache.commons.codec.binary.Base64Test
Tests run: 53, Failures: 3, Errors: 19, Skipped: 1, Time elapsed: 0.045 sec <<< FAILURE! - in org.apache.commons.codec.binary.Base64Test
testTriplets(org.apache.commons.codec.binary.Base64Test)  Time elapsed: 0.001 sec  <<< ERROR!
java.lang.NullPointerException: null
	at org.apache.commons.codec.binary.Base64.encode(Base64.java:72)
	at org.apache.commons.codec.binary.BaseNCodec.encode(BaseNCodec.java:430)
	at org.apache.commons.codec.binary.Base64.encodeBase64(Base64.java:117)
	at org.apache.commons.codec.binary.Base64.encodeBase64(Base64.java:112)
	at org.apache.commons.codec.binary.Base64.encodeBase64(Base64.java:111)
	at org.apache.commons.codec.binary.Base64.encodeBase64(Base64.java:106)
	at org.apache.commons.codec.binary.Base64Test.testTriplets(Base64Test.java:940)

testConstructor_Int_ByteArray_Boolean_UrlSafe(org.apache.commons.codec.binary.Base64Test)  Time elapsed: 0.005 sec  <<< FAILURE!
org.junit.ComparisonFailure: new Base64(64, \t, true) expected:<9IPN[	KwUv	dLiI	Ap6c	tz12	SiQm	OGst	WyYv	SPee	vufD	hrza	ws65	voyk	KjbI	j33Y	WTa9	xA7c	_FHy	pWcl	rZhQ	7onf	c3JE	93BJ	5fT4	R9zA	Edjb	jy1h	v4ZY	NnET	4WJe	XMLJ	_5p-	qBpT	sPpe	pW8D	NVYy	1c02	_1wy	C-kg	A6Cv	RUd9	cSr_	lt88	AEds	TV4G	MCn1	-Ewu	AiYd	ivxu	zn-c	LM8q	2jew	qlI5	2tP9	J7Cs	8vqG	71s6	-WAE	LKvm	_Uov	vyaO	i-Od	MUfj	Q0JL	iLkH	u6p9	OwUg	vQqi	DKzE	v_Au	go0d	TPZz	YGEy	CP5G	Vrle	3QQd	gciI	Hnpd	d4VU	TPGR	UbXe	Kbh-	-U3f	bJIn	g_sQ	XM3I	YByM	Z7xt	9HWS	1LUc	RdQ7	Prwn	_IlQ	WxOM	eq-K	ZJSo	AviW	tdse	rXyH	bIEa	__hm	r4p_	j80k	0g9q	35hq	1ayG	M998	4ALT	SaZ8	WeyF	bZx1	CxC_	Qoqf	92UH	_ylB	RnSJ	Nn4s	S0oa	3uUb	NvOn	pkB4	D9V7	Ut9a	tinC	Jrw-	wiJc	Ml-9	kp25	1IUx	BGA4	cUxh	0eax	k3OD	WnwI	95Ek	tmWO	KwCS	P0xj	WwIM	xDjy	gwAG	5R8f	k9H9	bVi1	thMa	vm4n	Dc4v	aNoS	E1Rn	ZNYw	biUV	lVPM	9Ecl	vJWT	Wd6i	gWeA	0MxH	AA8i	OM5V	nmqp	_WGM	7UDq	59rB	IdNQ	CoeT	JaAk	EtAu	LL5z	ogOa	5e-M	zVjv	B5MY	QlOl	aaTt	QrRA	pXa5	Z4Vf	Eanu	9UK2	fi1T	8jJP	FC2P	mXeb	xp0b	nO-V	W-bg	yEdI	IkIQ	CaZq	1MKW	C3Ku	iOS9	BJ1t	7O0A	2JKJ	KvoE	4UNu	lzV2	TGCC	-KAn	mjRq	QBqX	lJmg	jHQA	oHNZ	KOma	_uIQ	Osvf	Dnqi	cYdD	mfyC	YuV8	9HjA	1H8t	iDJ8	5Vfs	rFHd	cbPA	oNCp	i65a	wJSH	fdPO	1NDO	NOK-	-S7Y	0VXU	goYY	rBV4	Y7Yb	C8wg	_nqc	imr3	lm3t	Ryp-	QsgK	zdRE	bfNR	k0F5	PLyL	fsUE	lepj	s1Qd	V3fE	V1LJ	tiyw	A3ub	VNQJ	Rxhb	Yxa_	C_Xy	2qxp	m6vv	dL92	l3q1	ccev	35Ic	aOiS	x7Im	-_Gx	V2lV	KdaO	vYVG	DD1z	BRe6	Y2Cw	Qb9p	088l	3_93	qGR5	593N	CiuP	PWcs	DWwU	ShM1	EyW0	FNX1	F8bn	zHnY	ijoy	E_jf	4s_l	9bBd	7yJd	RWRC	yih2	Wcyp	AiOI	EkBs	H-dC	Tgal	u8sR	DoMh	4ZIB	BdgH	foZU	ycLq	ReQF	LZZ4	Sl4z	Smzt	5vQx	QFhE	Kb9-	ff_4	rb1K	Ao6w	ifen	gxVf	Isa2	b5lj	XzAq	Xs7J	kPvm	C6fa	7X4Z	ZndR	okax	Ylu3	cg8O	V-uG	_6YA	HZil	o8at	0Opk	kNdN	Fuhw	uGlk	BqrZ	KNUj	_gSi	YYc0	6gF_	r_z6	iWAj	pXJR	W1qq	3CLZ	XdZF	Z_Vr	qXeV	jtOA	]u2A	> but was:<9IPN[KwUvdLiIAp6ctz12SiQmOGstWyYvSPeevufDhrzaws65voykKjbIj33YWTa9	xA7c_FHypWclrZhQ7onfc3JE93BJ5fT4R9zAEdjbjy1hv4ZYNnET4WJeXMLJ_5p-	qBpTsPpepW8DNVYy1c02_1wyC-kgA6CvRUd9cSr_lt88AEdsTV4GMCn1-EwuAiYd	ivxuzn-cLM8q2jewqlI52tP9J7Cs8vqG71s6-WAELKvm_UovvyaOi-OdMUfjQ0JL	iLkHu6p9OwUgvQqiDKzEv_Augo0dTPZzYGEyCP5GVrle3QQdgciIHnpdd4VUTPGR	UbXeKbh--U3fbJIng_sQXM3IYByMZ7xt9HWS1LUcRdQ7Prwn_IlQWxOMeq-KZJSo	AviWtdserXyHbIEa__hmr4p_j80k0g9q35hq1ayGM9984ALTSaZ8WeyFbZx1CxC_	Qoqf92UH_ylBRnSJNn4sS0oa3uUbNvOnpkB4D9V7Ut9atinCJrw-wiJcMl-9kp25	1IUxBGA4cUxh0eaxk3ODWnwI95EktmWOKwCSP0xjWwIMxDjygwAG5R8fk9H9bVi1	thMavm4nDc4vaNoSE1RnZNYwbiUVlVPM9EclvJWTWd6igWeA0MxHAA8iOM5Vnmqp	_WGM7UDq59rBIdNQCoeTJaAkEtAuLL5zogOa5e-MzVjvB5MYQlOlaaTtQrRApXa5	Z4VfEanu9UK2fi1T8jJPFC2PmXebxp0bnO-VW-bgyEdIIkIQCaZq1MKWC3KuiOS9	BJ1t7O0A2JKJKvoE4UNulzV2TGCC-KAnmjRqQBqXlJmgjHQAoHNZKOma_uIQOsvf	DnqicYdDmfyCYuV89HjA1H8tiDJ85VfsrFHdcbPAoNCpi65awJSHfdPO1NDONOK-	-S7Y0VXUgoYYrBV4Y7YbC8wg_nqcimr3lm3tRyp-QsgKzdREbfNRk0F5PLyLfsUE	lepjs1QdV3fEV1LJtiywA3ubVNQJRxhbYxa_C_Xy2qxpm6vvdL92l3q1ccev35Ic	aOiSx7Im-_GxV2lVKdaOvYVGDD1zBRe6Y2CwQb9p088l3_93qGR5593NCiuPPWcs	DWwUShM1EyW0FNX1F8bnzHnYijoyE_jf4s_l9bBd7yJdRWRCyih2WcypAiOIEkBs	H-dCTgalu8sRDoMh4ZIBBdgHfoZUycLqReQFLZZ4Sl4zSmzt5vQxQFhEKb9-ff_4	rb1KAo6wifengxVfIsa2b5ljXzAqXs7JkPvmC6fa7X4ZZndRokaxYlu3cg8OV-uG	_6YAHZilo8at0OpkkNdNFuhwuGlkBqrZKNUj_gSiYYc06gF_r_z6iWAjpXJRW1qq	3CLZXdZFZ_VrqXeVjtOA]u2A	>
	at org.junit.Assert.assertEquals(Assert.java:115)
	at org.apache.commons.codec.binary.Base64Test.testConstructor_Int_ByteArray_Boolean_UrlSafe(Base64Test.java:264)

testUUID(org.apache.commons.codec.binary.Base64Test)  Time elapsed: 0.001 sec  <<< ERROR!
java.lang.NullPointerException: null
	at org.apache.commons.codec.binary.Base64.encode(Base64.java:72)
	at org.apache.commons.codec.binary.BaseNCodec.encode(BaseNCodec.java:430)
	at org.apache.commons.codec.binary.Base64.encodeBase64(Base64.java:117)
	at org.apache.commons.codec.binary.Base64.encodeBase64(Base64.java:112)
	at org.apache.commons.codec.binary.Base64.encodeBase64(Base64.java:111)
	at org.apache.commons.codec.binary.Base64.encodeBase64(Base64.java:106)
	at org.apache.commons.codec.binary.Base64Test.testUUID(Base64Test.java:1147)

testEncodeDecodeSmall(org.apache.commons.codec.binary.Base64Test)  Time elapsed: 0.001 sec  <<< ERROR!
java.lang.NullPointerException: null
	at org.apache.commons.codec.binary.Base64.encode(Base64.java:72)
	at org.apache.commons.codec.binary.BaseNCodec.encode(BaseNCodec.java:430)
	at org.apache.commons.codec.binary.Base64.encodeBase64(Base64.java:117)
	at org.apache.commons.codec.binary.Base64.encodeBase64(Base64.java:112)
	at org.apache.commons.codec.binary.Base64.encodeBase64(Base64.java:111)
	at org.apache.commons.codec.binary.Base64.encodeBase64(Base64.java:106)
	at org.apache.commons.codec.binary.Base64Test.testEncodeDecodeSmall(Base64Test.java:362)

testObjectDecodeWithValidParameter(org.apache.commons.codec.binary.Base64Test)  Time elapsed: 0.001 sec  <<< ERROR!
java.lang.NullPointerException: null
	at org.apache.commons.codec.binary.Base64.encode(Base64.java:72)
	at org.apache.commons.codec.binary.BaseNCodec.encode(BaseNCodec.java:430)
	at org.apache.commons.codec.binary.Base64.encodeBase64(Base64.java:117)
	at org.apache.commons.codec.binary.Base64.encodeBase64(Base64.java:112)
	at org.apache.commons.codec.binary.Base64.encodeBase64(Base64.java:111)
	at org.apache.commons.codec.binary.Base64.encodeBase64(Base64.java:106)
	at org.apache.commons.codec.binary.Base64Test.testObjectDecodeWithValidParameter(Base64Test.java:504)

testCodeInteger1(org.apache.commons.codec.binary.Base64Test)  Time elapsed: 0.002 sec  <<< ERROR!
java.lang.NullPointerException: null
	at org.apache.commons.codec.binary.Base64.encode(Base64.java:72)
	at org.apache.commons.codec.binary.BaseNCodec.encode(BaseNCodec.java:430)
	at org.apache.commons.codec.binary.Base64.encodeBase64(Base64.java:117)
	at org.apache.commons.codec.binary.Base64.encodeBase64(Base64.java:112)
	at org.apache.commons.codec.binary.Base64.encodeBase64(Base64.java:111)
	at org.apache.commons.codec.binary.Base64.encodeInteger(Base64.java:122)
	at org.apache.commons.codec.binary.Base64Test.testCodeInteger1(Base64Test.java:149)

testCodeInteger2(org.apache.commons.codec.binary.Base64Test)  Time elapsed: 0.001 sec  <<< ERROR!
java.lang.NullPointerException: null
	at org.apache.commons.codec.binary.Base64.encode(Base64.java:72)
	at org.apache.commons.codec.binary.BaseNCodec.encode(BaseNCodec.java:430)
	at org.apache.commons.codec.binary.Base64.encodeBase64(Base64.java:117)
	at org.apache.commons.codec.binary.Base64.encodeBase64(Base64.java:112)
	at org.apache.commons.codec.binary.Base64.encodeBase64(Base64.java:111)
	at org.apache.commons.codec.binary.Base64.encodeInteger(Base64.java:122)
	at org.apache.commons.codec.binary.Base64Test.testCodeInteger2(Base64Test.java:158)

testCodeInteger3(org.apache.commons.codec.binary.Base64Test)  Time elapsed: 0 sec  <<< ERROR!
java.lang.NullPointerException: null
	at org.apache.commons.codec.binary.Base64.encode(Base64.java:72)
	at org.apache.commons.codec.binary.BaseNCodec.encode(BaseNCodec.java:430)
	at org.apache.commons.codec.binary.Base64.encodeBase64(Base64.java:117)
	at org.apache.commons.codec.binary.Base64.encodeBase64(Base64.java:112)
	at org.apache.commons.codec.binary.Base64.encodeBase64(Base64.java:111)
	at org.apache.commons.codec.binary.Base64.encodeInteger(Base64.java:122)
	at org.apache.commons.codec.binary.Base64Test.testCodeInteger3(Base64Test.java:169)

testCodeInteger4(org.apache.commons.codec.binary.Base64Test)  Time elapsed: 0 sec  <<< ERROR!
java.lang.NullPointerException: null
	at org.apache.commons.codec.binary.Base64.encode(Base64.java:72)
	at org.apache.commons.codec.binary.BaseNCodec.encode(BaseNCodec.java:430)
	at org.apache.commons.codec.binary.Base64.encodeBase64(Base64.java:117)
	at org.apache.commons.codec.binary.Base64.encodeBase64(Base64.java:112)
	at org.apache.commons.codec.binary.Base64.encodeBase64(Base64.java:111)
	at org.apache.commons.codec.binary.Base64.encodeInteger(Base64.java:122)
	at org.apache.commons.codec.binary.Base64Test.testCodeInteger4(Base64Test.java:186)

testObjectEncode(org.apache.commons.codec.binary.Base64Test)  Time elapsed: 0 sec  <<< ERROR!
java.lang.NullPointerException: null
	at org.apache.commons.codec.binary.Base64.encode(Base64.java:72)
	at org.apache.commons.codec.binary.BaseNCodec.encode(BaseNCodec.java:430)
	at org.apache.commons.codec.binary.Base64Test.testObjectEncode(Base64Test.java:542)

testUrlSafe(org.apache.commons.codec.binary.Base64Test)  Time elapsed: 0 sec  <<< ERROR!
java.lang.NullPointerException: null
	at org.apache.commons.codec.binary.Base64.encode(Base64.java:72)
	at org.apache.commons.codec.binary.BaseNCodec.encode(BaseNCodec.java:430)
	at org.apache.commons.codec.binary.Base64.encodeBase64(Base64.java:117)
	at org.apache.commons.codec.binary.Base64.encodeBase64(Base64.java:112)
	at org.apache.commons.codec.binary.Base64.encodeBase64URLSafe(Base64.java:108)
	at org.apache.commons.codec.binary.Base64TestData.randomData(Base64TestData.java:204)
	at org.apache.commons.codec.binary.Base64Test.testUrlSafe(Base64Test.java:1081)

testEncodeDecodeRandom(org.apache.commons.codec.binary.Base64Test)  Time elapsed: 0 sec  <<< ERROR!
java.lang.NullPointerException: null
	at org.apache.commons.codec.binary.Base64.encode(Base64.java:72)
	at org.apache.commons.codec.binary.BaseNCodec.encode(BaseNCodec.java:430)
	at org.apache.commons.codec.binary.Base64.encodeBase64(Base64.java:117)
	at org.apache.commons.codec.binary.Base64.encodeBase64(Base64.java:112)
	at org.apache.commons.codec.binary.Base64.encodeBase64(Base64.java:111)
	at org.apache.commons.codec.binary.Base64.encodeBase64(Base64.java:106)
	at org.apache.commons.codec.binary.Base64Test.testEncodeDecodeRandom(Base64Test.java:349)

testDecodeWithWhitespace(org.apache.commons.codec.binary.Base64Test)  Time elapsed: 0 sec  <<< ERROR!
java.lang.NullPointerException: null
	at org.apache.commons.codec.binary.Base64.encode(Base64.java:72)
	at org.apache.commons.codec.binary.BaseNCodec.encode(BaseNCodec.java:430)
	at org.apache.commons.codec.binary.Base64.encodeBase64(Base64.java:117)
	at org.apache.commons.codec.binary.Base64.encodeBase64(Base64.java:112)
	at org.apache.commons.codec.binary.Base64.encodeBase64(Base64.java:111)
	at org.apache.commons.codec.binary.Base64.encodeBase64(Base64.java:106)
	at org.apache.commons.codec.binary.Base64Test.testDecodeWithWhitespace(Base64Test.java:311)

testKnownEncodings(org.apache.commons.codec.binary.Base64Test)  Time elapsed: 0 sec  <<< ERROR!
java.lang.NullPointerException: null
	at org.apache.commons.codec.binary.Base64.encode(Base64.java:72)
	at org.apache.commons.codec.binary.BaseNCodec.encode(BaseNCodec.java:430)
	at org.apache.commons.codec.binary.Base64.encodeBase64(Base64.java:117)
	at org.apache.commons.codec.binary.Base64.encodeBase64(Base64.java:112)
	at org.apache.commons.codec.binary.Base64.encodeBase64(Base64.java:111)
	at org.apache.commons.codec.binary.Base64.encodeBase64(Base64.java:106)
	at org.apache.commons.codec.binary.Base64Test.testKnownEncodings(Base64Test.java:446)

testRfc4648Section10DecodeEncode(org.apache.commons.codec.binary.Base64Test)  Time elapsed: 0.001 sec  <<< ERROR!
java.lang.NullPointerException: null
	at org.apache.commons.codec.binary.Base64.encode(Base64.java:72)
	at org.apache.commons.codec.binary.BaseNCodec.encode(BaseNCodec.java:430)
	at org.apache.commons.codec.binary.Base64.encodeBase64(Base64.java:117)
	at org.apache.commons.codec.binary.Base64.encodeBase64(Base64.java:112)
	at org.apache.commons.codec.binary.Base64.encodeBase64(Base64.java:111)
	at org.apache.commons.codec.binary.Base64.encodeBase64String(Base64.java:107)
	at org.apache.commons.codec.binary.Base64Test.testDecodeEncode(Base64Test.java:681)
	at org.apache.commons.codec.binary.Base64Test.testRfc4648Section10DecodeEncode(Base64Test.java:673)

testChunkedEncodeMultipleOf76(org.apache.commons.codec.binary.Base64Test)  Time elapsed: 0.001 sec  <<< FAILURE!
java.lang.AssertionError: chunkedEncodeMultipleOf76
	at org.junit.Assert.fail(Assert.java:88)
	at org.junit.Assert.assertTrue(Assert.java:41)
	at org.apache.commons.codec.binary.Base64Test.testChunkedEncodeMultipleOf76(Base64Test.java:132)

testBase64(org.apache.commons.codec.binary.Base64Test)  Time elapsed: 0 sec  <<< ERROR!
java.lang.NullPointerException: null
	at org.apache.commons.codec.binary.Base64.encode(Base64.java:72)
	at org.apache.commons.codec.binary.BaseNCodec.encode(BaseNCodec.java:430)
	at org.apache.commons.codec.binary.Base64.encodeBase64(Base64.java:117)
	at org.apache.commons.codec.binary.Base64.encodeBase64(Base64.java:112)
	at org.apache.commons.codec.binary.Base64.encodeBase64(Base64.java:111)
	at org.apache.commons.codec.binary.Base64.encodeBase64(Base64.java:106)
	at org.apache.commons.codec.binary.Base64Test.testBase64(Base64Test.java:82)

testConstructor_Int_ByteArray_Boolean(org.apache.commons.codec.binary.Base64Test)  Time elapsed: 0.003 sec  <<< FAILURE!
org.junit.ComparisonFailure: new Base64(65, \t, false) expected:<9IPN[KwUvdLiIAp6ctz12SiQmOGstWyYvSPeevufDhrzaws65voykKjbIj33YWTa9	xA7c/FHypWclrZhQ7onfc3JE93BJ5fT4R9zAEdjbjy1hv4ZYNnET4WJeXMLJ/5p+	qBpTsPpepW8DNVYy1c02/1wyC+kgA6CvRUd9cSr/lt88AEdsTV4GMCn1+EwuAiYd	ivxuzn+cLM8q2jewqlI52tP9J7Cs8vqG71s6+WAELKvm/UovvyaOi+OdMUfjQ0JL	iLkHu6p9OwUgvQqiDKzEv/Augo0dTPZzYGEyCP5GVrle3QQdgciIHnpdd4VUTPGR	UbXeKbh++U3fbJIng/sQXM3IYByMZ7xt9HWS1LUcRdQ7Prwn/IlQWxOMeq+KZJSo	AviWtdserXyHbIEa//hmr4p/j80k0g9q35hq1ayGM9984ALTSaZ8WeyFbZx1CxC/	Qoqf92UH/ylBRnSJNn4sS0oa3uUbNvOnpkB4D9V7Ut9atinCJrw+wiJcMl+9kp25	1IUxBGA4cUxh0eaxk3ODWnwI95EktmWOKwCSP0xjWwIMxDjygwAG5R8fk9H9bVi1	thMavm4nDc4vaNoSE1RnZNYwbiUVlVPM9EclvJWTWd6igWeA0MxHAA8iOM5Vnmqp	/WGM7UDq59rBIdNQCoeTJaAkEtAuLL5zogOa5e+MzVjvB5MYQlOlaaTtQrRApXa5	Z4VfEanu9UK2fi1T8jJPFC2PmXebxp0bnO+VW+bgyEdIIkIQCaZq1MKWC3KuiOS9	BJ1t7O0A2JKJKvoE4UNulzV2TGCC+KAnmjRqQBqXlJmgjHQAoHNZKOma/uIQOsvf	DnqicYdDmfyCYuV89HjA1H8tiDJ85VfsrFHdcbPAoNCpi65awJSHfdPO1NDONOK+	+S7Y0VXUgoYYrBV4Y7YbC8wg/nqcimr3lm3tRyp+QsgKzdREbfNRk0F5PLyLfsUE	lepjs1QdV3fEV1LJtiywA3ubVNQJRxhbYxa/C/Xy2qxpm6vvdL92l3q1ccev35Ic	aOiSx7Im+/GxV2lVKdaOvYVGDD1zBRe6Y2CwQb9p088l3/93qGR5593NCiuPPWcs	DWwUShM1EyW0FNX1F8bnzHnYijoyE/jf4s/l9bBd7yJdRWRCyih2WcypAiOIEkBs	H+dCTgalu8sRDoMh4ZIBBdgHfoZUycLqReQFLZZ4Sl4zSmzt5vQxQFhEKb9+ff/4	rb1KAo6wifengxVfIsa2b5ljXzAqXs7JkPvmC6fa7X4ZZndRokaxYlu3cg8OV+uG	/6YAHZilo8at0OpkkNdNFuhwuGlkBqrZKNUj/gSiYYc06gF/r/z6iWAjpXJRW1qq	3CLZXdZFZ/VrqXeVjtOA]u2A=	> but was:<9IPN[	KwUv	dLiI	Ap6c	tz12	SiQm	OGst	WyYv	SPee	vufD	hrza	ws65	voyk	KjbI	j33Y	WTa9	xA7c	/FHy	pWcl	rZhQ	7onf	c3JE	93BJ	5fT4	R9zA	Edjb	jy1h	v4ZY	NnET	4WJe	XMLJ	/5p+	qBpT	sPpe	pW8D	NVYy	1c02	/1wy	C+kg	A6Cv	RUd9	cSr/	lt88	AEds	TV4G	MCn1	+Ewu	AiYd	ivxu	zn+c	LM8q	2jew	qlI5	2tP9	J7Cs	8vqG	71s6	+WAE	LKvm	/Uov	vyaO	i+Od	MUfj	Q0JL	iLkH	u6p9	OwUg	vQqi	DKzE	v/Au	go0d	TPZz	YGEy	CP5G	Vrle	3QQd	gciI	Hnpd	d4VU	TPGR	UbXe	Kbh+	+U3f	bJIn	g/sQ	XM3I	YByM	Z7xt	9HWS	1LUc	RdQ7	Prwn	/IlQ	WxOM	eq+K	ZJSo	AviW	tdse	rXyH	bIEa	//hm	r4p/	j80k	0g9q	35hq	1ayG	M998	4ALT	SaZ8	WeyF	bZx1	CxC/	Qoqf	92UH	/ylB	RnSJ	Nn4s	S0oa	3uUb	NvOn	pkB4	D9V7	Ut9a	tinC	Jrw+	wiJc	Ml+9	kp25	1IUx	BGA4	cUxh	0eax	k3OD	WnwI	95Ek	tmWO	KwCS	P0xj	WwIM	xDjy	gwAG	5R8f	k9H9	bVi1	thMa	vm4n	Dc4v	aNoS	E1Rn	ZNYw	biUV	lVPM	9Ecl	vJWT	Wd6i	gWeA	0MxH	AA8i	OM5V	nmqp	/WGM	7UDq	59rB	IdNQ	CoeT	JaAk	EtAu	LL5z	ogOa	5e+M	zVjv	B5MY	QlOl	aaTt	QrRA	pXa5	Z4Vf	Eanu	9UK2	fi1T	8jJP	FC2P	mXeb	xp0b	nO+V	W+bg	yEdI	IkIQ	CaZq	1MKW	C3Ku	iOS9	BJ1t	7O0A	2JKJ	KvoE	4UNu	lzV2	TGCC	+KAn	mjRq	QBqX	lJmg	jHQA	oHNZ	KOma	/uIQ	Osvf	Dnqi	cYdD	mfyC	YuV8	9HjA	1H8t	iDJ8	5Vfs	rFHd	cbPA	oNCp	i65a	wJSH	fdPO	1NDO	NOK+	+S7Y	0VXU	goYY	rBV4	Y7Yb	C8wg	/nqc	imr3	lm3t	Ryp+	QsgK	zdRE	bfNR	k0F5	PLyL	fsUE	lepj	s1Qd	V3fE	V1LJ	tiyw	A3ub	VNQJ	Rxhb	Yxa/	C/Xy	2qxp	m6vv	dL92	l3q1	ccev	35Ic	aOiS	x7Im	+/Gx	V2lV	KdaO	vYVG	DD1z	BRe6	Y2Cw	Qb9p	088l	3/93	qGR5	593N	CiuP	PWcs	DWwU	ShM1	EyW0	FNX1	F8bn	zHnY	ijoy	E/jf	4s/l	9bBd	7yJd	RWRC	yih2	Wcyp	AiOI	EkBs	H+dC	Tgal	u8sR	DoMh	4ZIB	BdgH	foZU	ycLq	ReQF	LZZ4	Sl4z	Smzt	5vQx	QFhE	Kb9+	ff/4	rb1K	Ao6w	ifen	gxVf	Isa2	b5lj	XzAq	Xs7J	kPvm	C6fa	7X4Z	ZndR	okax	Ylu3	cg8O	V+uG	/6YA	HZil	o8at	0Opk	kNdN	Fuhw	uGlk	BqrZ	KNUj	/gSi	YYc0	6gF/	r/z6	iWAj	pXJR	W1qq	3CLZ	XdZF	Z/Vr	qXeV	jtOA	]u2A=	>
	at org.junit.Assert.assertEquals(Assert.java:115)
	at org.apache.commons.codec.binary.Base64Test.testConstructor_Int_ByteArray_Boolean(Base64Test.java:250)

testByteToStringVariations(org.apache.commons.codec.binary.Base64Test)  Time elapsed: 0.001 sec  <<< ERROR!
java.lang.NullPointerException: null
	at org.apache.commons.codec.binary.Base64.encode(Base64.java:72)
	at org.apache.commons.codec.binary.BaseNCodec.encode(BaseNCodec.java:430)
	at org.apache.commons.codec.binary.BaseNCodec.encodeToString(BaseNCodec.java:350)
	at org.apache.commons.codec.binary.Base64Test.testByteToStringVariations(Base64Test.java:1197)

testObjectEncodeWithValidParameter(org.apache.commons.codec.binary.Base64Test)  Time elapsed: 0 sec  <<< ERROR!
java.lang.NullPointerException: null
	at org.apache.commons.codec.binary.Base64.encode(Base64.java:72)
	at org.apache.commons.codec.binary.BaseNCodec.encode(BaseNCodec.java:430)
	at org.apache.commons.codec.binary.BaseNCodec.encode(BaseNCodec.java:338)
	at org.apache.commons.codec.binary.Base64Test.testObjectEncodeWithValidParameter(Base64Test.java:532)

testRfc4648Section10Encode(org.apache.commons.codec.binary.Base64Test)  Time elapsed: 0 sec  <<< ERROR!
java.lang.NullPointerException: null
	at org.apache.commons.codec.binary.Base64.encode(Base64.java:72)
	at org.apache.commons.codec.binary.BaseNCodec.encode(BaseNCodec.java:430)
	at org.apache.commons.codec.binary.Base64.encodeBase64(Base64.java:117)
	at org.apache.commons.codec.binary.Base64.encodeBase64(Base64.java:112)
	at org.apache.commons.codec.binary.Base64.encodeBase64(Base64.java:111)
	at org.apache.commons.codec.binary.Base64.encodeBase64String(Base64.java:107)
	at org.apache.commons.codec.binary.Base64Test.testRfc4648Section10Encode(Base64Test.java:648)

testRfc4648Section10EncodeDecode(org.apache.commons.codec.binary.Base64Test)  Time elapsed: 0.001 sec  <<< ERROR!
java.lang.NullPointerException: null
	at org.apache.commons.codec.binary.Base64.encode(Base64.java:72)
	at org.apache.commons.codec.binary.BaseNCodec.encode(BaseNCodec.java:430)
	at org.apache.commons.codec.binary.Base64.encodeBase64(Base64.java:117)
	at org.apache.commons.codec.binary.Base64.encodeBase64(Base64.java:112)
	at org.apache.commons.codec.binary.Base64.encodeBase64(Base64.java:111)
	at org.apache.commons.codec.binary.Base64.encodeBase64String(Base64.java:107)
	at org.apache.commons.codec.binary.Base64Test.testEncodeDecode(Base64Test.java:711)
	at org.apache.commons.codec.binary.Base64Test.testRfc4648Section10EncodeDecode(Base64Test.java:704)

Running org.apache.commons.codec.binary.HexTest
Tests run: 19, Failures: 0, Errors: 0, Skipped: 0, Time elapsed: 0.18 sec - in org.apache.commons.codec.binary.HexTest
Running org.apache.commons.codec.DecoderExceptionTest
Tests run: 4, Failures: 0, Errors: 0, Skipped: 0, Time elapsed: 0.001 sec - in org.apache.commons.codec.DecoderExceptionTest
Running org.apache.commons.codec.EncoderExceptionTest
Tests run: 4, Failures: 0, Errors: 0, Skipped: 0, Time elapsed: 0.001 sec - in org.apache.commons.codec.EncoderExceptionTest
Running org.apache.commons.codec.net.BCodecTest
Tests run: 9, Failures: 0, Errors: 3, Skipped: 0, Time elapsed: 0.001 sec <<< FAILURE! - in org.apache.commons.codec.net.BCodecTest
testUTF8RoundTrip(org.apache.commons.codec.net.BCodecTest)  Time elapsed: 0 sec  <<< ERROR!
java.lang.NullPointerException: null
	at org.apache.commons.codec.binary.Base64.encode(Base64.java:72)
	at org.apache.commons.codec.binary.BaseNCodec.encode(BaseNCodec.java:430)
	at org.apache.commons.codec.binary.Base64.encodeBase64(Base64.java:117)
	at org.apache.commons.codec.binary.Base64.encodeBase64(Base64.java:112)
	at org.apache.commons.codec.binary.Base64.encodeBase64(Base64.java:111)
	at org.apache.commons.codec.binary.Base64.encodeBase64(Base64.java:106)
	at org.apache.commons.codec.net.BCodec.doEncoding(BCodec.java:96)
	at org.apache.commons.codec.net.RFC1522Codec.encodeText(RFC1522Codec.java:78)
	at org.apache.commons.codec.net.BCodec.encode(BCodec.java:123)
	at org.apache.commons.codec.net.BCodec.encode(BCodec.java:162)
	at org.apache.commons.codec.net.BCodecTest.testUTF8RoundTrip(BCodecTest.java:69)

testBasicEncodeDecode(org.apache.commons.codec.net.BCodecTest)  Time elapsed: 0 sec  <<< ERROR!
java.lang.NullPointerException: null
	at org.apache.commons.codec.binary.Base64.encode(Base64.java:72)
	at org.apache.commons.codec.binary.BaseNCodec.encode(BaseNCodec.java:430)
	at org.apache.commons.codec.binary.Base64.encodeBase64(Base64.java:117)
	at org.apache.commons.codec.binary.Base64.encodeBase64(Base64.java:112)
	at org.apache.commons.codec.binary.Base64.encodeBase64(Base64.java:111)
	at org.apache.commons.codec.binary.Base64.encodeBase64(Base64.java:106)
	at org.apache.commons.codec.net.BCodec.doEncoding(BCodec.java:96)
	at org.apache.commons.codec.net.RFC1522Codec.encodeText(RFC1522Codec.java:78)
	at org.apache.commons.codec.net.BCodec.encode(BCodec.java:123)
	at org.apache.commons.codec.net.BCodec.encode(BCodec.java:162)
	at org.apache.commons.codec.net.BCodecTest.testBasicEncodeDecode(BCodecTest.java:80)

testEncodeObjects(org.apache.commons.codec.net.BCodecTest)  Time elapsed: 0 sec  <<< ERROR!
java.lang.NullPointerException: null
	at org.apache.commons.codec.binary.Base64.encode(Base64.java:72)
	at org.apache.commons.codec.binary.BaseNCodec.encode(BaseNCodec.java:430)
	at org.apache.commons.codec.binary.Base64.encodeBase64(Base64.java:117)
	at org.apache.commons.codec.binary.Base64.encodeBase64(Base64.java:112)
	at org.apache.commons.codec.binary.Base64.encodeBase64(Base64.java:111)
	at org.apache.commons.codec.binary.Base64.encodeBase64(Base64.java:106)
	at org.apache.commons.codec.net.BCodec.doEncoding(BCodec.java:96)
	at org.apache.commons.codec.net.RFC1522Codec.encodeText(RFC1522Codec.java:78)
	at org.apache.commons.codec.net.BCodec.encode(BCodec.java:123)
	at org.apache.commons.codec.net.BCodec.encode(BCodec.java:162)
	at org.apache.commons.codec.net.BCodec.encode(BCodec.java:201)
	at org.apache.commons.codec.net.BCodecTest.testEncodeObjects(BCodecTest.java:112)

Running org.apache.commons.codec.net.QCodecTest
Tests run: 12, Failures: 0, Errors: 0, Skipped: 0, Time elapsed: 0.001 sec - in org.apache.commons.codec.net.QCodecTest
Running org.apache.commons.codec.net.UtilsTest
Tests run: 1, Failures: 0, Errors: 0, Skipped: 0, Time elapsed: 0 sec - in org.apache.commons.codec.net.UtilsTest
Running org.apache.commons.codec.net.RFC1522CodecTest
Tests run: 2, Failures: 0, Errors: 0, Skipped: 0, Time elapsed: 0 sec - in org.apache.commons.codec.net.RFC1522CodecTest
Running org.apache.commons.codec.net.URLCodecTest
Tests run: 16, Failures: 0, Errors: 0, Skipped: 0, Time elapsed: 0.004 sec - in org.apache.commons.codec.net.URLCodecTest
Running org.apache.commons.codec.net.QuotedPrintableCodecTest
Tests run: 21, Failures: 0, Errors: 0, Skipped: 0, Time elapsed: 0.012 sec - in org.apache.commons.codec.net.QuotedPrintableCodecTest
Running org.apache.commons.codec.StringEncoderComparatorTest
Tests run: 3, Failures: 0, Errors: 0, Skipped: 0, Time elapsed: 0.005 sec - in org.apache.commons.codec.StringEncoderComparatorTest
Running org.apache.commons.codec.language.Caverphone1Test
Tests run: 9, Failures: 0, Errors: 0, Skipped: 0, Time elapsed: 0.029 sec - in org.apache.commons.codec.language.Caverphone1Test
Running org.apache.commons.codec.language.NysiisTest
Tests run: 23, Failures: 0, Errors: 0, Skipped: 0, Time elapsed: 0.014 sec - in org.apache.commons.codec.language.NysiisTest
Running org.apache.commons.codec.language.Caverphone2Test
Tests run: 13, Failures: 0, Errors: 0, Skipped: 0, Time elapsed: 0.135 sec - in org.apache.commons.codec.language.Caverphone2Test
Running org.apache.commons.codec.language.DaitchMokotoffSoundexTest
Tests run: 13, Failures: 0, Errors: 0, Skipped: 0, Time elapsed: 0.046 sec - in org.apache.commons.codec.language.DaitchMokotoffSoundexTest
Running org.apache.commons.codec.language.bm.BeiderMorseEncoderTest
Tests run: 22, Failures: 0, Errors: 0, Skipped: 0, Time elapsed: 2.976 sec - in org.apache.commons.codec.language.bm.BeiderMorseEncoderTest
Running org.apache.commons.codec.language.bm.PhoneticEngineTest
Tests run: 8, Failures: 0, Errors: 0, Skipped: 0, Time elapsed: 0.029 sec - in org.apache.commons.codec.language.bm.PhoneticEngineTest
Running org.apache.commons.codec.language.bm.PhoneticEngineRegressionTest
Tests run: 4, Failures: 0, Errors: 0, Skipped: 0, Time elapsed: 0.015 sec - in org.apache.commons.codec.language.bm.PhoneticEngineRegressionTest
Running org.apache.commons.codec.language.bm.RuleTest
Tests run: 3, Failures: 0, Errors: 0, Skipped: 0, Time elapsed: 0.002 sec - in org.apache.commons.codec.language.bm.RuleTest
Running org.apache.commons.codec.language.bm.LanguageGuessingTest
Tests run: 18, Failures: 0, Errors: 0, Skipped: 0, Time elapsed: 0.017 sec - in org.apache.commons.codec.language.bm.LanguageGuessingTest
Running org.apache.commons.codec.language.DoubleMetaphoneTest
Tests run: 16, Failures: 0, Errors: 0, Skipped: 0, Time elapsed: 0.054 sec - in org.apache.commons.codec.language.DoubleMetaphoneTest
Running org.apache.commons.codec.language.SoundexTest
Tests run: 28, Failures: 0, Errors: 0, Skipped: 0, Time elapsed: 0.015 sec - in org.apache.commons.codec.language.SoundexTest
Running org.apache.commons.codec.language.RefinedSoundexTest
Tests run: 10, Failures: 0, Errors: 0, Skipped: 0, Time elapsed: 0.003 sec - in org.apache.commons.codec.language.RefinedSoundexTest
Running org.apache.commons.codec.language.MatchRatingApproachEncoderTest
Tests run: 96, Failures: 0, Errors: 0, Skipped: 0, Time elapsed: 0.03 sec - in org.apache.commons.codec.language.MatchRatingApproachEncoderTest
Running org.apache.commons.codec.language.ColognePhoneticTest
Tests run: 13, Failures: 0, Errors: 0, Skipped: 0, Time elapsed: 0.002 sec - in org.apache.commons.codec.language.ColognePhoneticTest
Running org.apache.commons.codec.language.DoubleMetaphone2Test
Tests run: 6, Failures: 0, Errors: 0, Skipped: 0, Time elapsed: 0.026 sec - in org.apache.commons.codec.language.DoubleMetaphone2Test
Running org.apache.commons.codec.language.MetaphoneTest
Tests run: 34, Failures: 0, Errors: 0, Skipped: 0, Time elapsed: 0.134 sec - in org.apache.commons.codec.language.MetaphoneTest
Running org.apache.commons.codec.CharEncodingTest
Tests run: 7, Failures: 0, Errors: 0, Skipped: 0, Time elapsed: 0 sec - in org.apache.commons.codec.CharEncodingTest

Results :

Failed tests: 
  Base64OutputStreamTest.testBase64OutputStreamByteByByte:144->testByteByByte:249 Streaming byte-by-byte base64 encode
  Base64OutputStreamTest.testBase64OutputStreamByChunk:106->testByChunk:197 Streaming chunked base64 encode
  Base64Codec13Test.testStaticEncodeChunked:483 static Base64.encodeBase64Chunked() test-4
  Base64InputStreamTest.testBase64InputStreamByChunk:216->testByChunk:308 Streaming base64 encode
  Base64InputStreamTest.testBase64InputStreamByteByByte:254->testByteByByte:362 EOF expected:<-1> but was:<98>
  Base64Test.testConstructor_Int_ByteArray_Boolean_UrlSafe:264 new Base64(64, \t, true) expected:<9IPN[	KwUv	dLiI	Ap6c	tz12	SiQm	OGst	WyYv	SPee	vufD	hrza	ws65	voyk	KjbI	j33Y	WTa9	xA7c	_FHy	pWcl	rZhQ	7onf	c3JE	93BJ	5fT4	R9zA	Edjb	jy1h	v4ZY	NnET	4WJe	XMLJ	_5p-	qBpT	sPpe	pW8D	NVYy	1c02	_1wy	C-kg	A6Cv	RUd9	cSr_	lt88	AEds	TV4G	MCn1	-Ewu	AiYd	ivxu	zn-c	LM8q	2jew	qlI5	2tP9	J7Cs	8vqG	71s6	-WAE	LKvm	_Uov	vyaO	i-Od	MUfj	Q0JL	iLkH	u6p9	OwUg	vQqi	DKzE	v_Au	go0d	TPZz	YGEy	CP5G	Vrle	3QQd	gciI	Hnpd	d4VU	TPGR	UbXe	Kbh-	-U3f	bJIn	g_sQ	XM3I	YByM	Z7xt	9HWS	1LUc	RdQ7	Prwn	_IlQ	WxOM	eq-K	ZJSo	AviW	tdse	rXyH	bIEa	__hm	r4p_	j80k	0g9q	35hq	1ayG	M998	4ALT	SaZ8	WeyF	bZx1	CxC_	Qoqf	92UH	_ylB	RnSJ	Nn4s	S0oa	3uUb	NvOn	pkB4	D9V7	Ut9a	tinC	Jrw-	wiJc	Ml-9	kp25	1IUx	BGA4	cUxh	0eax	k3OD	WnwI	95Ek	tmWO	KwCS	P0xj	WwIM	xDjy	gwAG	5R8f	k9H9	bVi1	thMa	vm4n	Dc4v	aNoS	E1Rn	ZNYw	biUV	lVPM	9Ecl	vJWT	Wd6i	gWeA	0MxH	AA8i	OM5V	nmqp	_WGM	7UDq	59rB	IdNQ	CoeT	JaAk	EtAu	LL5z	ogOa	5e-M	zVjv	B5MY	QlOl	aaTt	QrRA	pXa5	Z4Vf	Eanu	9UK2	fi1T	8jJP	FC2P	mXeb	xp0b	nO-V	W-bg	yEdI	IkIQ	CaZq	1MKW	C3Ku	iOS9	BJ1t	7O0A	2JKJ	KvoE	4UNu	lzV2	TGCC	-KAn	mjRq	QBqX	lJmg	jHQA	oHNZ	KOma	_uIQ	Osvf	Dnqi	cYdD	mfyC	YuV8	9HjA	1H8t	iDJ8	5Vfs	rFHd	cbPA	oNCp	i65a	wJSH	fdPO	1NDO	NOK-	-S7Y	0VXU	goYY	rBV4	Y7Yb	C8wg	_nqc	imr3	lm3t	Ryp-	QsgK	zdRE	bfNR	k0F5	PLyL	fsUE	lepj	s1Qd	V3fE	V1LJ	tiyw	A3ub	VNQJ	Rxhb	Yxa_	C_Xy	2qxp	m6vv	dL92	l3q1	ccev	35Ic	aOiS	x7Im	-_Gx	V2lV	KdaO	vYVG	DD1z	BRe6	Y2Cw	Qb9p	088l	3_93	qGR5	593N	CiuP	PWcs	DWwU	ShM1	EyW0	FNX1	F8bn	zHnY	ijoy	E_jf	4s_l	9bBd	7yJd	RWRC	yih2	Wcyp	AiOI	EkBs	H-dC	Tgal	u8sR	DoMh	4ZIB	BdgH	foZU	ycLq	ReQF	LZZ4	Sl4z	Smzt	5vQx	QFhE	Kb9-	ff_4	rb1K	Ao6w	ifen	gxVf	Isa2	b5lj	XzAq	Xs7J	kPvm	C6fa	7X4Z	ZndR	okax	Ylu3	cg8O	V-uG	_6YA	HZil	o8at	0Opk	kNdN	Fuhw	uGlk	BqrZ	KNUj	_gSi	YYc0	6gF_	r_z6	iWAj	pXJR	W1qq	3CLZ	XdZF	Z_Vr	qXeV	jtOA	]u2A	> but was:<9IPN[KwUvdLiIAp6ctz12SiQmOGstWyYvSPeevufDhrzaws65voykKjbIj33YWTa9	xA7c_FHypWclrZhQ7onfc3JE93BJ5fT4R9zAEdjbjy1hv4ZYNnET4WJeXMLJ_5p-	qBpTsPpepW8DNVYy1c02_1wyC-kgA6CvRUd9cSr_lt88AEdsTV4GMCn1-EwuAiYd	ivxuzn-cLM8q2jewqlI52tP9J7Cs8vqG71s6-WAELKvm_UovvyaOi-OdMUfjQ0JL	iLkHu6p9OwUgvQqiDKzEv_Augo0dTPZzYGEyCP5GVrle3QQdgciIHnpdd4VUTPGR	UbXeKbh--U3fbJIng_sQXM3IYByMZ7xt9HWS1LUcRdQ7Prwn_IlQWxOMeq-KZJSo	AviWtdserXyHbIEa__hmr4p_j80k0g9q35hq1ayGM9984ALTSaZ8WeyFbZx1CxC_	Qoqf92UH_ylBRnSJNn4sS0oa3uUbNvOnpkB4D9V7Ut9atinCJrw-wiJcMl-9kp25	1IUxBGA4cUxh0eaxk3ODWnwI95EktmWOKwCSP0xjWwIMxDjygwAG5R8fk9H9bVi1	thMavm4nDc4vaNoSE1RnZNYwbiUVlVPM9EclvJWTWd6igWeA0MxHAA8iOM5Vnmqp	_WGM7UDq59rBIdNQCoeTJaAkEtAuLL5zogOa5e-MzVjvB5MYQlOlaaTtQrRApXa5	Z4VfEanu9UK2fi1T8jJPFC2PmXebxp0bnO-VW-bgyEdIIkIQCaZq1MKWC3KuiOS9	BJ1t7O0A2JKJKvoE4UNulzV2TGCC-KAnmjRqQBqXlJmgjHQAoHNZKOma_uIQOsvf	DnqicYdDmfyCYuV89HjA1H8tiDJ85VfsrFHdcbPAoNCpi65awJSHfdPO1NDONOK-	-S7Y0VXUgoYYrBV4Y7YbC8wg_nqcimr3lm3tRyp-QsgKzdREbfNRk0F5PLyLfsUE	lepjs1QdV3fEV1LJtiywA3ubVNQJRxhbYxa_C_Xy2qxpm6vvdL92l3q1ccev35Ic	aOiSx7Im-_GxV2lVKdaOvYVGDD1zBRe6Y2CwQb9p088l3_93qGR5593NCiuPPWcs	DWwUShM1EyW0FNX1F8bnzHnYijoyE_jf4s_l9bBd7yJdRWRCyih2WcypAiOIEkBs	H-dCTgalu8sRDoMh4ZIBBdgHfoZUycLqReQFLZZ4Sl4zSmzt5vQxQFhEKb9-ff_4	rb1KAo6wifengxVfIsa2b5ljXzAqXs7JkPvmC6fa7X4ZZndRokaxYlu3cg8OV-uG	_6YAHZilo8at0OpkkNdNFuhwuGlkBqrZKNUj_gSiYYc06gF_r_z6iWAjpXJRW1qq	3CLZXdZFZ_VrqXeVjtOA]u2A	>
  Base64Test.testChunkedEncodeMultipleOf76:132 chunkedEncodeMultipleOf76
  Base64Test.testConstructor_Int_ByteArray_Boolean:250 new Base64(65, \t, false) expected:<9IPN[KwUvdLiIAp6ctz12SiQmOGstWyYvSPeevufDhrzaws65voykKjbIj33YWTa9	xA7c/FHypWclrZhQ7onfc3JE93BJ5fT4R9zAEdjbjy1hv4ZYNnET4WJeXMLJ/5p+	qBpTsPpepW8DNVYy1c02/1wyC+kgA6CvRUd9cSr/lt88AEdsTV4GMCn1+EwuAiYd	ivxuzn+cLM8q2jewqlI52tP9J7Cs8vqG71s6+WAELKvm/UovvyaOi+OdMUfjQ0JL	iLkHu6p9OwUgvQqiDKzEv/Augo0dTPZzYGEyCP5GVrle3QQdgciIHnpdd4VUTPGR	UbXeKbh++U3fbJIng/sQXM3IYByMZ7xt9HWS1LUcRdQ7Prwn/IlQWxOMeq+KZJSo	AviWtdserXyHbIEa//hmr4p/j80k0g9q35hq1ayGM9984ALTSaZ8WeyFbZx1CxC/	Qoqf92UH/ylBRnSJNn4sS0oa3uUbNvOnpkB4D9V7Ut9atinCJrw+wiJcMl+9kp25	1IUxBGA4cUxh0eaxk3ODWnwI95EktmWOKwCSP0xjWwIMxDjygwAG5R8fk9H9bVi1	thMavm4nDc4vaNoSE1RnZNYwbiUVlVPM9EclvJWTWd6igWeA0MxHAA8iOM5Vnmqp	/WGM7UDq59rBIdNQCoeTJaAkEtAuLL5zogOa5e+MzVjvB5MYQlOlaaTtQrRApXa5	Z4VfEanu9UK2fi1T8jJPFC2PmXebxp0bnO+VW+bgyEdIIkIQCaZq1MKWC3KuiOS9	BJ1t7O0A2JKJKvoE4UNulzV2TGCC+KAnmjRqQBqXlJmgjHQAoHNZKOma/uIQOsvf	DnqicYdDmfyCYuV89HjA1H8tiDJ85VfsrFHdcbPAoNCpi65awJSHfdPO1NDONOK+	+S7Y0VXUgoYYrBV4Y7YbC8wg/nqcimr3lm3tRyp+QsgKzdREbfNRk0F5PLyLfsUE	lepjs1QdV3fEV1LJtiywA3ubVNQJRxhbYxa/C/Xy2qxpm6vvdL92l3q1ccev35Ic	aOiSx7Im+/GxV2lVKdaOvYVGDD1zBRe6Y2CwQb9p088l3/93qGR5593NCiuPPWcs	DWwUShM1EyW0FNX1F8bnzHnYijoyE/jf4s/l9bBd7yJdRWRCyih2WcypAiOIEkBs	H+dCTgalu8sRDoMh4ZIBBdgHfoZUycLqReQFLZZ4Sl4zSmzt5vQxQFhEKb9+ff/4	rb1KAo6wifengxVfIsa2b5ljXzAqXs7JkPvmC6fa7X4ZZndRokaxYlu3cg8OV+uG	/6YAHZilo8at0OpkkNdNFuhwuGlkBqrZKNUj/gSiYYc06gF/r/z6iWAjpXJRW1qq	3CLZXdZFZ/VrqXeVjtOA]u2A=	> but was:<9IPN[	KwUv	dLiI	Ap6c	tz12	SiQm	OGst	WyYv	SPee	vufD	hrza	ws65	voyk	KjbI	j33Y	WTa9	xA7c	/FHy	pWcl	rZhQ	7onf	c3JE	93BJ	5fT4	R9zA	Edjb	jy1h	v4ZY	NnET	4WJe	XMLJ	/5p+	qBpT	sPpe	pW8D	NVYy	1c02	/1wy	C+kg	A6Cv	RUd9	cSr/	lt88	AEds	TV4G	MCn1	+Ewu	AiYd	ivxu	zn+c	LM8q	2jew	qlI5	2tP9	J7Cs	8vqG	71s6	+WAE	LKvm	/Uov	vyaO	i+Od	MUfj	Q0JL	iLkH	u6p9	OwUg	vQqi	DKzE	v/Au	go0d	TPZz	YGEy	CP5G	Vrle	3QQd	gciI	Hnpd	d4VU	TPGR	UbXe	Kbh+	+U3f	bJIn	g/sQ	XM3I	YByM	Z7xt	9HWS	1LUc	RdQ7	Prwn	/IlQ	WxOM	eq+K	ZJSo	AviW	tdse	rXyH	bIEa	//hm	r4p/	j80k	0g9q	35hq	1ayG	M998	4ALT	SaZ8	WeyF	bZx1	CxC/	Qoqf	92UH	/ylB	RnSJ	Nn4s	S0oa	3uUb	NvOn	pkB4	D9V7	Ut9a	tinC	Jrw+	wiJc	Ml+9	kp25	1IUx	BGA4	cUxh	0eax	k3OD	WnwI	95Ek	tmWO	KwCS	P0xj	WwIM	xDjy	gwAG	5R8f	k9H9	bVi1	thMa	vm4n	Dc4v	aNoS	E1Rn	ZNYw	biUV	lVPM	9Ecl	vJWT	Wd6i	gWeA	0MxH	AA8i	OM5V	nmqp	/WGM	7UDq	59rB	IdNQ	CoeT	JaAk	EtAu	LL5z	ogOa	5e+M	zVjv	B5MY	QlOl	aaTt	QrRA	pXa5	Z4Vf	Eanu	9UK2	fi1T	8jJP	FC2P	mXeb	xp0b	nO+V	W+bg	yEdI	IkIQ	CaZq	1MKW	C3Ku	iOS9	BJ1t	7O0A	2JKJ	KvoE	4UNu	lzV2	TGCC	+KAn	mjRq	QBqX	lJmg	jHQA	oHNZ	KOma	/uIQ	Osvf	Dnqi	cYdD	mfyC	YuV8	9HjA	1H8t	iDJ8	5Vfs	rFHd	cbPA	oNCp	i65a	wJSH	fdPO	1NDO	NOK+	+S7Y	0VXU	goYY	rBV4	Y7Yb	C8wg	/nqc	imr3	lm3t	Ryp+	QsgK	zdRE	bfNR	k0F5	PLyL	fsUE	lepj	s1Qd	V3fE	V1LJ	tiyw	A3ub	VNQJ	Rxhb	Yxa/	C/Xy	2qxp	m6vv	dL92	l3q1	ccev	35Ic	aOiS	x7Im	+/Gx	V2lV	KdaO	vYVG	DD1z	BRe6	Y2Cw	Qb9p	088l	3/93	qGR5	593N	CiuP	PWcs	DWwU	ShM1	EyW0	FNX1	F8bn	zHnY	ijoy	E/jf	4s/l	9bBd	7yJd	RWRC	yih2	Wcyp	AiOI	EkBs	H+dC	Tgal	u8sR	DoMh	4ZIB	BdgH	foZU	ycLq	ReQF	LZZ4	Sl4z	Smzt	5vQx	QFhE	Kb9+	ff/4	rb1K	Ao6w	ifen	gxVf	Isa2	b5lj	XzAq	Xs7J	kPvm	C6fa	7X4Z	ZndR	okax	Ylu3	cg8O	V+uG	/6YA	HZil	o8at	0Opk	kNdN	Fuhw	uGlk	BqrZ	KNUj	/gSi	YYc0	6gF/	r/z6	iWAj	pXJR	W1qq	3CLZ	XdZF	Z/Vr	qXeV	jtOA	]u2A=	>

Tests in error: 
  Base64Codec13Test.testEncoder:371 » NullPointer
  Base64Codec13Test.testBinaryEncoder:409 » NullPointer
  Base64Codec13Test.testStaticEncode:446 » NullPointer
  Base64InputStreamTest.testCodec105:84 » NullPointer
  Base64Test.testTriplets:940 » NullPointer
  Base64Test.testUUID:1147 » NullPointer
  Base64Test.testEncodeDecodeSmall:362 » NullPointer
  Base64Test.testObjectDecodeWithValidParameter:504 » NullPointer
  Base64Test.testCodeInteger1:149 » NullPointer
  Base64Test.testCodeInteger2:158 » NullPointer
  Base64Test.testCodeInteger3:169 » NullPointer
  Base64Test.testCodeInteger4:186 » NullPointer
  Base64Test.testObjectEncode:542 » NullPointer
  Base64Test.testUrlSafe:1081 » NullPointer
  Base64Test.testEncodeDecodeRandom:349 » NullPointer
  Base64Test.testDecodeWithWhitespace:311 » NullPointer
  Base64Test.testKnownEncodings:446 » NullPointer
  Base64Test.testRfc4648Section10DecodeEncode:673->testDecodeEncode:681 » NullPointer
  Base64Test.testBase64:82 » NullPointer
  Base64Test.testByteToStringVariations:1197 » NullPointer
  Base64Test.testObjectEncodeWithValidParameter:532 » NullPointer
  Base64Test.testRfc4648Section10Encode:648 » NullPointer
  Base64Test.testRfc4648Section10EncodeDecode:704->testEncodeDecode:711 » NullPointer
  BCodecTest.testUTF8RoundTrip:69 » NullPointer
  BCodecTest.testBasicEncodeDecode:80 » NullPointer
  BCodecTest.testEncodeObjects:112 » NullPointer

Tests run: 662, Failures: 8, Errors: 26, Skipped: 1

[INFO] ------------------------------------------------------------------------
[INFO] BUILD FAILURE
[INFO] ------------------------------------------------------------------------
[INFO] Total time: 13.410s
[INFO] Finished at: Sun Aug 02 07:09:11 BST 2015
[INFO] Final Memory: 20M/344M
[INFO] ------------------------------------------------------------------------
[ERROR] Failed to execute goal org.apache.maven.plugins:maven-surefire-plugin:2.17:test (default-test) on project commons-codec: There are test failures.
[ERROR] 
[ERROR] Please refer to /home/perham/Study/LittleDarwin/Cases/commons-codec-1.10-src/target/surefire-reports for the individual test results.
[ERROR] -> [Help 1]
[ERROR] 
[ERROR] To see the full stack trace of the errors, re-run Maven with the -e switch.
[ERROR] Re-run Maven using the -X switch to enable full debug logging.
[ERROR] 
[ERROR] For more information about the errors and possible solutions, please read the following articles:
[ERROR] [Help 1] http://cwiki.apache.org/confluence/display/MAVEN/MojoFailureException
