[INFO] Scanning for projects...
[INFO]                                                                         
[INFO] ------------------------------------------------------------------------
[INFO] Building Apache Commons Codec 1.10
[INFO] ------------------------------------------------------------------------
[INFO] 
[INFO] --- maven-enforcer-plugin:1.3.1:enforce (enforce-maven-3) @ commons-codec ---
[INFO] 
[INFO] --- maven-antrun-plugin:1.7:run (javadoc.resources) @ commons-codec ---
[INFO] Executing tasks

main:
[INFO] Executed tasks
[INFO] 
[INFO] --- maven-remote-resources-plugin:1.5:process (default) @ commons-codec ---
[INFO] 
[INFO] --- buildnumber-maven-plugin:1.3:create (default) @ commons-codec ---
[INFO] Executing: /bin/sh -c cd /home/perham/Study/LittleDarwin/Cases/commons-codec-1.10-src && svn --non-interactive info
[INFO] Working directory: /home/perham/Study/LittleDarwin/Cases/commons-codec-1.10-src
[INFO] Storing buildNumber: ?????? at timestamp: 1438495380468
[INFO] Executing: /bin/sh -c cd /home/perham/Study/LittleDarwin/Cases/commons-codec-1.10-src && svn --non-interactive info
[INFO] Working directory: /home/perham/Study/LittleDarwin/Cases/commons-codec-1.10-src
[INFO] Storing buildScmBranch: UNKNOWN_BRANCH
[INFO] 
[INFO] --- maven-resources-plugin:2.7:resources (default-resources) @ commons-codec ---
[INFO] Using 'UTF-8' encoding to copy filtered resources.
[INFO] Copying 128 resources
[INFO] Copying 2 resources to META-INF
[INFO] 
[INFO] --- maven-compiler-plugin:3.2:compile (default-compile) @ commons-codec ---
[INFO] Changes detected - recompiling the module!
[INFO] Compiling 60 source files to /home/perham/Study/LittleDarwin/Cases/commons-codec-1.10-src/target/classes
[INFO] /home/perham/Study/LittleDarwin/Cases/commons-codec-1.10-src/src/main/java/org/apache/commons/codec/digest/Sha2Crypt.java: Some input files use or override a deprecated API.
[INFO] /home/perham/Study/LittleDarwin/Cases/commons-codec-1.10-src/src/main/java/org/apache/commons/codec/digest/Sha2Crypt.java: Recompile with -Xlint:deprecation for details.
[INFO] 
[INFO] --- maven-bundle-plugin:2.5.3:manifest (bundle-manifest) @ commons-codec ---
[INFO] 
[INFO] --- maven-resources-plugin:2.7:testResources (default-testResources) @ commons-codec ---
[INFO] Using 'UTF-8' encoding to copy filtered resources.
[INFO] skip non existing resourceDirectory /home/perham/Study/LittleDarwin/Cases/commons-codec-1.10-src/src/test/resources
[INFO] Copying 2 resources to META-INF
[INFO] 
[INFO] --- maven-compiler-plugin:3.2:testCompile (default-testCompile) @ commons-codec ---
[INFO] Nothing to compile - all classes are up to date
[INFO] 
[INFO] --- maven-surefire-plugin:2.17:test (default-test) @ commons-codec ---
[INFO] Surefire report directory: /home/perham/Study/LittleDarwin/Cases/commons-codec-1.10-src/target/surefire-reports

-------------------------------------------------------
 T E S T S
-------------------------------------------------------
Running org.apache.commons.codec.digest.B64Test
Tests run: 2, Failures: 0, Errors: 0, Skipped: 0, Time elapsed: 0.028 sec - in org.apache.commons.codec.digest.B64Test
Running org.apache.commons.codec.digest.DigestUtilsTest
Tests run: 17, Failures: 0, Errors: 0, Skipped: 0, Time elapsed: 0.671 sec - in org.apache.commons.codec.digest.DigestUtilsTest
Running org.apache.commons.codec.digest.Sha512CryptTest
Tests run: 8, Failures: 0, Errors: 0, Skipped: 0, Time elapsed: 0.484 sec - in org.apache.commons.codec.digest.Sha512CryptTest
Running org.apache.commons.codec.digest.Apr1CryptTest
Tests run: 8, Failures: 0, Errors: 0, Skipped: 0, Time elapsed: 0.09 sec - in org.apache.commons.codec.digest.Apr1CryptTest
Running org.apache.commons.codec.digest.HmacUtilsTest
Tests run: 24, Failures: 0, Errors: 0, Skipped: 0, Time elapsed: 0.045 sec - in org.apache.commons.codec.digest.HmacUtilsTest
Running org.apache.commons.codec.digest.Sha2CryptTest
Tests run: 1, Failures: 0, Errors: 0, Skipped: 0, Time elapsed: 0 sec - in org.apache.commons.codec.digest.Sha2CryptTest
Running org.apache.commons.codec.digest.CryptTest
Tests run: 4, Failures: 0, Errors: 0, Skipped: 0, Time elapsed: 0.112 sec - in org.apache.commons.codec.digest.CryptTest
Running org.apache.commons.codec.digest.Sha256CryptTest
Tests run: 7, Failures: 0, Errors: 0, Skipped: 0, Time elapsed: 0.1 sec - in org.apache.commons.codec.digest.Sha256CryptTest
Running org.apache.commons.codec.digest.Md5CryptTest
Tests run: 7, Failures: 0, Errors: 0, Skipped: 0, Time elapsed: 0.016 sec - in org.apache.commons.codec.digest.Md5CryptTest
Running org.apache.commons.codec.digest.UnixCryptTest
Tests run: 9, Failures: 0, Errors: 0, Skipped: 0, Time elapsed: 0.01 sec - in org.apache.commons.codec.digest.UnixCryptTest
Running org.apache.commons.codec.CharsetsTest
Tests run: 7, Failures: 0, Errors: 0, Skipped: 0, Time elapsed: 0.001 sec - in org.apache.commons.codec.CharsetsTest
Running org.apache.commons.codec.binary.Base32Test
Tests run: 8, Failures: 0, Errors: 0, Skipped: 0, Time elapsed: 0.004 sec - in org.apache.commons.codec.binary.Base32Test
Running org.apache.commons.codec.binary.Base64OutputStreamTest
Tests run: 7, Failures: 2, Errors: 0, Skipped: 0, Time elapsed: 0.01 sec <<< FAILURE! - in org.apache.commons.codec.binary.Base64OutputStreamTest
testBase64OutputStreamByteByByte(org.apache.commons.codec.binary.Base64OutputStreamTest)  Time elapsed: 0.006 sec  <<< FAILURE!
java.lang.AssertionError: Streaming byte-by-byte base64 encode
	at org.junit.Assert.fail(Assert.java:88)
	at org.junit.Assert.assertTrue(Assert.java:41)
	at org.apache.commons.codec.binary.Base64OutputStreamTest.testByteByByte(Base64OutputStreamTest.java:249)
	at org.apache.commons.codec.binary.Base64OutputStreamTest.testBase64OutputStreamByteByByte(Base64OutputStreamTest.java:144)

testBase64OutputStreamByChunk(org.apache.commons.codec.binary.Base64OutputStreamTest)  Time elapsed: 0 sec  <<< FAILURE!
java.lang.AssertionError: Streaming chunked base64 encode
	at org.junit.Assert.fail(Assert.java:88)
	at org.junit.Assert.assertTrue(Assert.java:41)
	at org.apache.commons.codec.binary.Base64OutputStreamTest.testByChunk(Base64OutputStreamTest.java:197)
	at org.apache.commons.codec.binary.Base64OutputStreamTest.testBase64OutputStreamByChunk(Base64OutputStreamTest.java:106)

Running org.apache.commons.codec.binary.Base64Codec13Test
Tests run: 8, Failures: 1, Errors: 3, Skipped: 0, Time elapsed: 0.018 sec <<< FAILURE! - in org.apache.commons.codec.binary.Base64Codec13Test
testEncoder(org.apache.commons.codec.binary.Base64Codec13Test)  Time elapsed: 0.002 sec  <<< ERROR!
java.lang.NullPointerException: null
	at org.apache.commons.codec.binary.Base64.encode(Base64.java:58)
	at org.apache.commons.codec.binary.BaseNCodec.encode(BaseNCodec.java:431)
	at org.apache.commons.codec.binary.BaseNCodec.encode(BaseNCodec.java:338)
	at org.apache.commons.codec.binary.Base64Codec13Test.testEncoder(Base64Codec13Test.java:371)

testBinaryEncoder(org.apache.commons.codec.binary.Base64Codec13Test)  Time elapsed: 0.001 sec  <<< ERROR!
java.lang.NullPointerException: null
	at org.apache.commons.codec.binary.Base64.encode(Base64.java:58)
	at org.apache.commons.codec.binary.BaseNCodec.encode(BaseNCodec.java:431)
	at org.apache.commons.codec.binary.Base64Codec13Test.testBinaryEncoder(Base64Codec13Test.java:409)

testStaticEncodeChunked(org.apache.commons.codec.binary.Base64Codec13Test)  Time elapsed: 0 sec  <<< FAILURE!
java.lang.AssertionError: static Base64.encodeBase64Chunked() test-1
	at org.junit.Assert.fail(Assert.java:88)
	at org.junit.Assert.assertTrue(Assert.java:41)
	at org.apache.commons.codec.binary.Base64Codec13Test.testStaticEncodeChunked(Base64Codec13Test.java:483)

testStaticEncode(org.apache.commons.codec.binary.Base64Codec13Test)  Time elapsed: 0 sec  <<< ERROR!
java.lang.NullPointerException: null
	at org.apache.commons.codec.binary.Base64.encode(Base64.java:58)
	at org.apache.commons.codec.binary.BaseNCodec.encode(BaseNCodec.java:431)
	at org.apache.commons.codec.binary.Base64.encodeBase64(Base64.java:117)
	at org.apache.commons.codec.binary.Base64.encodeBase64(Base64.java:112)
	at org.apache.commons.codec.binary.Base64.encodeBase64(Base64.java:111)
	at org.apache.commons.codec.binary.Base64.encodeBase64(Base64.java:106)
	at org.apache.commons.codec.binary.Base64Codec13Test.testStaticEncode(Base64Codec13Test.java:446)

Running org.apache.commons.codec.binary.Base64InputStreamTest
Tests run: 19, Failures: 2, Errors: 0, Skipped: 0, Time elapsed: 0.011 sec <<< FAILURE! - in org.apache.commons.codec.binary.Base64InputStreamTest
testBase64InputStreamByChunk(org.apache.commons.codec.binary.Base64InputStreamTest)  Time elapsed: 0 sec  <<< FAILURE!
java.lang.AssertionError: Streaming base64 encode
	at org.junit.Assert.fail(Assert.java:88)
	at org.junit.Assert.assertTrue(Assert.java:41)
	at org.apache.commons.codec.binary.Base64InputStreamTest.testByChunk(Base64InputStreamTest.java:308)
	at org.apache.commons.codec.binary.Base64InputStreamTest.testBase64InputStreamByChunk(Base64InputStreamTest.java:216)

testBase64InputStreamByteByByte(org.apache.commons.codec.binary.Base64InputStreamTest)  Time elapsed: 0 sec  <<< FAILURE!
java.lang.AssertionError: Streaming base64 encode
	at org.junit.Assert.fail(Assert.java:88)
	at org.junit.Assert.assertTrue(Assert.java:41)
	at org.apache.commons.codec.binary.Base64InputStreamTest.testByteByByte(Base64InputStreamTest.java:364)
	at org.apache.commons.codec.binary.Base64InputStreamTest.testBase64InputStreamByteByByte(Base64InputStreamTest.java:254)

Running org.apache.commons.codec.binary.Base32InputStreamTest
Tests run: 16, Failures: 0, Errors: 0, Skipped: 0, Time elapsed: 0.15 sec - in org.apache.commons.codec.binary.Base32InputStreamTest
Running org.apache.commons.codec.binary.Base32OutputStreamTest
Tests run: 6, Failures: 0, Errors: 0, Skipped: 0, Time elapsed: 0.092 sec - in org.apache.commons.codec.binary.Base32OutputStreamTest
Running org.apache.commons.codec.binary.BinaryCodecTest
Tests run: 13, Failures: 0, Errors: 0, Skipped: 0, Time elapsed: 0.009 sec - in org.apache.commons.codec.binary.BinaryCodecTest
Running org.apache.commons.codec.binary.BaseNCodecTest
Tests run: 7, Failures: 0, Errors: 0, Skipped: 0, Time elapsed: 0.002 sec - in org.apache.commons.codec.binary.BaseNCodecTest
Running org.apache.commons.codec.binary.StringUtilsTest
Tests run: 17, Failures: 0, Errors: 0, Skipped: 0, Time elapsed: 0.024 sec - in org.apache.commons.codec.binary.StringUtilsTest
Running org.apache.commons.codec.binary.Base64Test
Tests run: 53, Failures: 5, Errors: 18, Skipped: 1, Time elapsed: 0.041 sec <<< FAILURE! - in org.apache.commons.codec.binary.Base64Test
testConstructor_Int_ByteArray_Boolean_UrlSafe(org.apache.commons.codec.binary.Base64Test)  Time elapsed: 0.002 sec  <<< FAILURE!
org.junit.ComparisonFailure: new Base64(64, \t, true) expected:<...ZXdZFZ_VrqXeVjtOAu2A[]> but was:<...ZXdZFZ_VrqXeVjtOAu2A[	]>
	at org.junit.Assert.assertEquals(Assert.java:115)
	at org.apache.commons.codec.binary.Base64Test.testConstructor_Int_ByteArray_Boolean_UrlSafe(Base64Test.java:264)

testSingletonsChunked(org.apache.commons.codec.binary.Base64Test)  Time elapsed: 0.001 sec  <<< FAILURE!
org.junit.ComparisonFailure: expected:<AA==[
]> but was:<AA==[]>
	at org.junit.Assert.assertEquals(Assert.java:115)
	at org.junit.Assert.assertEquals(Assert.java:144)
	at org.apache.commons.codec.binary.Base64Test.testSingletonsChunked(Base64Test.java:831)

testPairs(org.apache.commons.codec.binary.Base64Test)  Time elapsed: 0 sec  <<< ERROR!
java.lang.NullPointerException: null
	at org.apache.commons.codec.binary.Base64.encode(Base64.java:58)
	at org.apache.commons.codec.binary.BaseNCodec.encode(BaseNCodec.java:431)
	at org.apache.commons.codec.binary.Base64.encodeBase64(Base64.java:117)
	at org.apache.commons.codec.binary.Base64.encodeBase64(Base64.java:112)
	at org.apache.commons.codec.binary.Base64.encodeBase64(Base64.java:111)
	at org.apache.commons.codec.binary.Base64.encodeBase64(Base64.java:106)
	at org.apache.commons.codec.binary.Base64Test.testPairs(Base64Test.java:547)

testUUID(org.apache.commons.codec.binary.Base64Test)  Time elapsed: 0 sec  <<< ERROR!
java.lang.NullPointerException: null
	at org.apache.commons.codec.binary.Base64.encode(Base64.java:58)
	at org.apache.commons.codec.binary.BaseNCodec.encode(BaseNCodec.java:431)
	at org.apache.commons.codec.binary.Base64.encodeBase64(Base64.java:117)
	at org.apache.commons.codec.binary.Base64.encodeBase64(Base64.java:112)
	at org.apache.commons.codec.binary.Base64.encodeBase64(Base64.java:111)
	at org.apache.commons.codec.binary.Base64.encodeBase64(Base64.java:106)
	at org.apache.commons.codec.binary.Base64Test.testUUID(Base64Test.java:1147)

testEncodeDecodeSmall(org.apache.commons.codec.binary.Base64Test)  Time elapsed: 0.001 sec  <<< ERROR!
java.lang.NullPointerException: null
	at org.apache.commons.codec.binary.Base64.encode(Base64.java:58)
	at org.apache.commons.codec.binary.BaseNCodec.encode(BaseNCodec.java:431)
	at org.apache.commons.codec.binary.Base64.encodeBase64(Base64.java:117)
	at org.apache.commons.codec.binary.Base64.encodeBase64(Base64.java:112)
	at org.apache.commons.codec.binary.Base64.encodeBase64(Base64.java:111)
	at org.apache.commons.codec.binary.Base64.encodeBase64(Base64.java:106)
	at org.apache.commons.codec.binary.Base64Test.testEncodeDecodeSmall(Base64Test.java:362)

testCodeInteger1(org.apache.commons.codec.binary.Base64Test)  Time elapsed: 0.002 sec  <<< ERROR!
java.lang.NullPointerException: null
	at org.apache.commons.codec.binary.Base64.encode(Base64.java:58)
	at org.apache.commons.codec.binary.BaseNCodec.encode(BaseNCodec.java:431)
	at org.apache.commons.codec.binary.Base64.encodeBase64(Base64.java:117)
	at org.apache.commons.codec.binary.Base64.encodeBase64(Base64.java:112)
	at org.apache.commons.codec.binary.Base64.encodeBase64(Base64.java:111)
	at org.apache.commons.codec.binary.Base64.encodeInteger(Base64.java:122)
	at org.apache.commons.codec.binary.Base64Test.testCodeInteger1(Base64Test.java:149)

testCodeInteger2(org.apache.commons.codec.binary.Base64Test)  Time elapsed: 0.001 sec  <<< ERROR!
java.lang.NullPointerException: null
	at org.apache.commons.codec.binary.Base64.encode(Base64.java:58)
	at org.apache.commons.codec.binary.BaseNCodec.encode(BaseNCodec.java:431)
	at org.apache.commons.codec.binary.Base64.encodeBase64(Base64.java:117)
	at org.apache.commons.codec.binary.Base64.encodeBase64(Base64.java:112)
	at org.apache.commons.codec.binary.Base64.encodeBase64(Base64.java:111)
	at org.apache.commons.codec.binary.Base64.encodeInteger(Base64.java:122)
	at org.apache.commons.codec.binary.Base64Test.testCodeInteger2(Base64Test.java:158)

testCodeInteger3(org.apache.commons.codec.binary.Base64Test)  Time elapsed: 0 sec  <<< ERROR!
java.lang.NullPointerException: null
	at org.apache.commons.codec.binary.Base64.encode(Base64.java:58)
	at org.apache.commons.codec.binary.BaseNCodec.encode(BaseNCodec.java:431)
	at org.apache.commons.codec.binary.Base64.encodeBase64(Base64.java:117)
	at org.apache.commons.codec.binary.Base64.encodeBase64(Base64.java:112)
	at org.apache.commons.codec.binary.Base64.encodeBase64(Base64.java:111)
	at org.apache.commons.codec.binary.Base64.encodeInteger(Base64.java:122)
	at org.apache.commons.codec.binary.Base64Test.testCodeInteger3(Base64Test.java:169)

testCodeInteger4(org.apache.commons.codec.binary.Base64Test)  Time elapsed: 0.001 sec  <<< ERROR!
java.lang.NullPointerException: null
	at org.apache.commons.codec.binary.Base64.encode(Base64.java:58)
	at org.apache.commons.codec.binary.BaseNCodec.encode(BaseNCodec.java:431)
	at org.apache.commons.codec.binary.Base64.encodeBase64(Base64.java:117)
	at org.apache.commons.codec.binary.Base64.encodeBase64(Base64.java:112)
	at org.apache.commons.codec.binary.Base64.encodeBase64(Base64.java:111)
	at org.apache.commons.codec.binary.Base64.encodeInteger(Base64.java:122)
	at org.apache.commons.codec.binary.Base64Test.testCodeInteger4(Base64Test.java:186)

testObjectEncode(org.apache.commons.codec.binary.Base64Test)  Time elapsed: 0 sec  <<< ERROR!
java.lang.NullPointerException: null
	at org.apache.commons.codec.binary.Base64.encode(Base64.java:58)
	at org.apache.commons.codec.binary.BaseNCodec.encode(BaseNCodec.java:431)
	at org.apache.commons.codec.binary.Base64Test.testObjectEncode(Base64Test.java:542)

testUrlSafe(org.apache.commons.codec.binary.Base64Test)  Time elapsed: 0.001 sec  <<< ERROR!
java.lang.NullPointerException: null
	at org.apache.commons.codec.binary.Base64.encode(Base64.java:58)
	at org.apache.commons.codec.binary.BaseNCodec.encode(BaseNCodec.java:431)
	at org.apache.commons.codec.binary.Base64.encodeBase64(Base64.java:117)
	at org.apache.commons.codec.binary.Base64.encodeBase64(Base64.java:112)
	at org.apache.commons.codec.binary.Base64.encodeBase64URLSafe(Base64.java:108)
	at org.apache.commons.codec.binary.Base64TestData.randomData(Base64TestData.java:204)
	at org.apache.commons.codec.binary.Base64Test.testUrlSafe(Base64Test.java:1081)

testEncodeDecodeRandom(org.apache.commons.codec.binary.Base64Test)  Time elapsed: 0.004 sec  <<< ERROR!
java.lang.NullPointerException: null
	at org.apache.commons.codec.binary.Base64.encode(Base64.java:58)
	at org.apache.commons.codec.binary.BaseNCodec.encode(BaseNCodec.java:431)
	at org.apache.commons.codec.binary.Base64.encodeBase64(Base64.java:117)
	at org.apache.commons.codec.binary.Base64.encodeBase64(Base64.java:112)
	at org.apache.commons.codec.binary.Base64.encodeBase64(Base64.java:111)
	at org.apache.commons.codec.binary.Base64.encodeBase64(Base64.java:106)
	at org.apache.commons.codec.binary.Base64Test.testEncodeDecodeRandom(Base64Test.java:349)

testKnownEncodings(org.apache.commons.codec.binary.Base64Test)  Time elapsed: 0.001 sec  <<< ERROR!
java.lang.NullPointerException: null
	at org.apache.commons.codec.binary.Base64.encode(Base64.java:58)
	at org.apache.commons.codec.binary.BaseNCodec.encode(BaseNCodec.java:431)
	at org.apache.commons.codec.binary.Base64.encodeBase64(Base64.java:117)
	at org.apache.commons.codec.binary.Base64.encodeBase64(Base64.java:112)
	at org.apache.commons.codec.binary.Base64.encodeBase64(Base64.java:111)
	at org.apache.commons.codec.binary.Base64.encodeBase64(Base64.java:106)
	at org.apache.commons.codec.binary.Base64Test.testKnownEncodings(Base64Test.java:446)

testCodec112(org.apache.commons.codec.binary.Base64Test)  Time elapsed: 0.001 sec  <<< ERROR!
java.lang.NullPointerException: null
	at org.apache.commons.codec.binary.Base64.encode(Base64.java:58)
	at org.apache.commons.codec.binary.BaseNCodec.encode(BaseNCodec.java:431)
	at org.apache.commons.codec.binary.Base64.encodeBase64(Base64.java:117)
	at org.apache.commons.codec.binary.Base64.encodeBase64(Base64.java:112)
	at org.apache.commons.codec.binary.Base64.encodeBase64(Base64.java:111)
	at org.apache.commons.codec.binary.Base64.encodeBase64(Base64.java:106)
	at org.apache.commons.codec.binary.Base64Test.testCodec112(Base64Test.java:380)

testSingletons(org.apache.commons.codec.binary.Base64Test)  Time elapsed: 0.001 sec  <<< ERROR!
java.lang.NullPointerException: null
	at org.apache.commons.codec.binary.Base64.encode(Base64.java:58)
	at org.apache.commons.codec.binary.BaseNCodec.encode(BaseNCodec.java:431)
	at org.apache.commons.codec.binary.Base64.encodeBase64(Base64.java:117)
	at org.apache.commons.codec.binary.Base64.encodeBase64(Base64.java:112)
	at org.apache.commons.codec.binary.Base64.encodeBase64(Base64.java:111)
	at org.apache.commons.codec.binary.Base64.encodeBase64(Base64.java:106)
	at org.apache.commons.codec.binary.Base64Test.testSingletons(Base64Test.java:718)

testTripletsChunked(org.apache.commons.codec.binary.Base64Test)  Time elapsed: 0 sec  <<< FAILURE!
org.junit.ComparisonFailure: expected:<AAAA[
]> but was:<AAAA[]>
	at org.junit.Assert.assertEquals(Assert.java:115)
	at org.junit.Assert.assertEquals(Assert.java:144)
	at org.apache.commons.codec.binary.Base64Test.testTripletsChunked(Base64Test.java:1008)

testRfc4648Section10DecodeEncode(org.apache.commons.codec.binary.Base64Test)  Time elapsed: 0 sec  <<< ERROR!
java.lang.NullPointerException: null
	at org.apache.commons.codec.binary.Base64.encode(Base64.java:58)
	at org.apache.commons.codec.binary.BaseNCodec.encode(BaseNCodec.java:431)
	at org.apache.commons.codec.binary.Base64.encodeBase64(Base64.java:117)
	at org.apache.commons.codec.binary.Base64.encodeBase64(Base64.java:112)
	at org.apache.commons.codec.binary.Base64.encodeBase64(Base64.java:111)
	at org.apache.commons.codec.binary.Base64.encodeBase64String(Base64.java:107)
	at org.apache.commons.codec.binary.Base64Test.testDecodeEncode(Base64Test.java:681)
	at org.apache.commons.codec.binary.Base64Test.testRfc4648Section10DecodeEncode(Base64Test.java:671)

testChunkedEncodeMultipleOf76(org.apache.commons.codec.binary.Base64Test)  Time elapsed: 0.001 sec  <<< FAILURE!
java.lang.AssertionError: chunkedEncodeMultipleOf76
	at org.junit.Assert.fail(Assert.java:88)
	at org.junit.Assert.assertTrue(Assert.java:41)
	at org.apache.commons.codec.binary.Base64Test.testChunkedEncodeMultipleOf76(Base64Test.java:132)

testBase64(org.apache.commons.codec.binary.Base64Test)  Time elapsed: 0 sec  <<< ERROR!
java.lang.NullPointerException: null
	at org.apache.commons.codec.binary.Base64.encode(Base64.java:58)
	at org.apache.commons.codec.binary.BaseNCodec.encode(BaseNCodec.java:431)
	at org.apache.commons.codec.binary.Base64.encodeBase64(Base64.java:117)
	at org.apache.commons.codec.binary.Base64.encodeBase64(Base64.java:112)
	at org.apache.commons.codec.binary.Base64.encodeBase64(Base64.java:111)
	at org.apache.commons.codec.binary.Base64.encodeBase64(Base64.java:106)
	at org.apache.commons.codec.binary.Base64Test.testBase64(Base64Test.java:82)

testConstructor_Int_ByteArray_Boolean(org.apache.commons.codec.binary.Base64Test)  Time elapsed: 0.001 sec  <<< FAILURE!
org.junit.ComparisonFailure: new Base64(65, \t, false) expected:<...XdZFZ/VrqXeVjtOAu2A=[	]> but was:<...XdZFZ/VrqXeVjtOAu2A=[]>
	at org.junit.Assert.assertEquals(Assert.java:115)
	at org.apache.commons.codec.binary.Base64Test.testConstructor_Int_ByteArray_Boolean(Base64Test.java:250)

testByteToStringVariations(org.apache.commons.codec.binary.Base64Test)  Time elapsed: 0 sec  <<< ERROR!
java.lang.NullPointerException: null
	at org.apache.commons.codec.binary.Base64.encode(Base64.java:58)
	at org.apache.commons.codec.binary.BaseNCodec.encode(BaseNCodec.java:431)
	at org.apache.commons.codec.binary.BaseNCodec.encodeToString(BaseNCodec.java:350)
	at org.apache.commons.codec.binary.Base64Test.testByteToStringVariations(Base64Test.java:1197)

testRfc4648Section10Encode(org.apache.commons.codec.binary.Base64Test)  Time elapsed: 0.001 sec  <<< ERROR!
java.lang.NullPointerException: null
	at org.apache.commons.codec.binary.Base64.encode(Base64.java:58)
	at org.apache.commons.codec.binary.BaseNCodec.encode(BaseNCodec.java:431)
	at org.apache.commons.codec.binary.Base64.encodeBase64(Base64.java:117)
	at org.apache.commons.codec.binary.Base64.encodeBase64(Base64.java:112)
	at org.apache.commons.codec.binary.Base64.encodeBase64(Base64.java:111)
	at org.apache.commons.codec.binary.Base64.encodeBase64String(Base64.java:107)
	at org.apache.commons.codec.binary.Base64Test.testRfc4648Section10Encode(Base64Test.java:646)

testRfc4648Section10EncodeDecode(org.apache.commons.codec.binary.Base64Test)  Time elapsed: 0.001 sec  <<< ERROR!
java.lang.NullPointerException: null
	at org.apache.commons.codec.binary.Base64.encode(Base64.java:58)
	at org.apache.commons.codec.binary.BaseNCodec.encode(BaseNCodec.java:431)
	at org.apache.commons.codec.binary.Base64.encodeBase64(Base64.java:117)
	at org.apache.commons.codec.binary.Base64.encodeBase64(Base64.java:112)
	at org.apache.commons.codec.binary.Base64.encodeBase64(Base64.java:111)
	at org.apache.commons.codec.binary.Base64.encodeBase64String(Base64.java:107)
	at org.apache.commons.codec.binary.Base64Test.testEncodeDecode(Base64Test.java:711)
	at org.apache.commons.codec.binary.Base64Test.testRfc4648Section10EncodeDecode(Base64Test.java:702)

Running org.apache.commons.codec.binary.HexTest
Tests run: 19, Failures: 0, Errors: 0, Skipped: 0, Time elapsed: 0.163 sec - in org.apache.commons.codec.binary.HexTest
Running org.apache.commons.codec.DecoderExceptionTest
Tests run: 4, Failures: 0, Errors: 0, Skipped: 0, Time elapsed: 0 sec - in org.apache.commons.codec.DecoderExceptionTest
Running org.apache.commons.codec.EncoderExceptionTest
Tests run: 4, Failures: 0, Errors: 0, Skipped: 0, Time elapsed: 0.001 sec - in org.apache.commons.codec.EncoderExceptionTest
Running org.apache.commons.codec.net.BCodecTest
Tests run: 9, Failures: 0, Errors: 3, Skipped: 0, Time elapsed: 0.005 sec <<< FAILURE! - in org.apache.commons.codec.net.BCodecTest
testUTF8RoundTrip(org.apache.commons.codec.net.BCodecTest)  Time elapsed: 0.001 sec  <<< ERROR!
java.lang.NullPointerException: null

testBasicEncodeDecode(org.apache.commons.codec.net.BCodecTest)  Time elapsed: 0.001 sec  <<< ERROR!
java.lang.NullPointerException: null

testEncodeObjects(org.apache.commons.codec.net.BCodecTest)  Time elapsed: 0 sec  <<< ERROR!
java.lang.NullPointerException: null

Running org.apache.commons.codec.net.QCodecTest
Tests run: 12, Failures: 0, Errors: 0, Skipped: 0, Time elapsed: 0.007 sec - in org.apache.commons.codec.net.QCodecTest
Running org.apache.commons.codec.net.UtilsTest
Tests run: 1, Failures: 0, Errors: 0, Skipped: 0, Time elapsed: 0 sec - in org.apache.commons.codec.net.UtilsTest
Running org.apache.commons.codec.net.RFC1522CodecTest
Tests run: 2, Failures: 0, Errors: 0, Skipped: 0, Time elapsed: 0 sec - in org.apache.commons.codec.net.RFC1522CodecTest
Running org.apache.commons.codec.net.URLCodecTest
Tests run: 16, Failures: 0, Errors: 0, Skipped: 0, Time elapsed: 0.007 sec - in org.apache.commons.codec.net.URLCodecTest
Running org.apache.commons.codec.net.QuotedPrintableCodecTest
Tests run: 21, Failures: 0, Errors: 0, Skipped: 0, Time elapsed: 0.009 sec - in org.apache.commons.codec.net.QuotedPrintableCodecTest
Running org.apache.commons.codec.StringEncoderComparatorTest
Tests run: 3, Failures: 0, Errors: 0, Skipped: 0, Time elapsed: 0.003 sec - in org.apache.commons.codec.StringEncoderComparatorTest
Running org.apache.commons.codec.language.Caverphone1Test
Tests run: 9, Failures: 0, Errors: 0, Skipped: 0, Time elapsed: 0.03 sec - in org.apache.commons.codec.language.Caverphone1Test
Running org.apache.commons.codec.language.NysiisTest
Tests run: 23, Failures: 0, Errors: 0, Skipped: 0, Time elapsed: 0.019 sec - in org.apache.commons.codec.language.NysiisTest
Running org.apache.commons.codec.language.Caverphone2Test
Tests run: 13, Failures: 0, Errors: 0, Skipped: 0, Time elapsed: 0.132 sec - in org.apache.commons.codec.language.Caverphone2Test
Running org.apache.commons.codec.language.DaitchMokotoffSoundexTest
Tests run: 13, Failures: 0, Errors: 0, Skipped: 0, Time elapsed: 0.052 sec - in org.apache.commons.codec.language.DaitchMokotoffSoundexTest
Running org.apache.commons.codec.language.bm.BeiderMorseEncoderTest
Tests run: 22, Failures: 0, Errors: 0, Skipped: 0, Time elapsed: 3.073 sec - in org.apache.commons.codec.language.bm.BeiderMorseEncoderTest
Running org.apache.commons.codec.language.bm.PhoneticEngineTest
Tests run: 8, Failures: 0, Errors: 0, Skipped: 0, Time elapsed: 0.022 sec - in org.apache.commons.codec.language.bm.PhoneticEngineTest
Running org.apache.commons.codec.language.bm.PhoneticEngineRegressionTest
Tests run: 4, Failures: 0, Errors: 0, Skipped: 0, Time elapsed: 0.017 sec - in org.apache.commons.codec.language.bm.PhoneticEngineRegressionTest
Running org.apache.commons.codec.language.bm.RuleTest
Tests run: 3, Failures: 0, Errors: 0, Skipped: 0, Time elapsed: 0.002 sec - in org.apache.commons.codec.language.bm.RuleTest
Running org.apache.commons.codec.language.bm.LanguageGuessingTest
Tests run: 18, Failures: 0, Errors: 0, Skipped: 0, Time elapsed: 0.012 sec - in org.apache.commons.codec.language.bm.LanguageGuessingTest
Running org.apache.commons.codec.language.DoubleMetaphoneTest
Tests run: 16, Failures: 0, Errors: 0, Skipped: 0, Time elapsed: 0.045 sec - in org.apache.commons.codec.language.DoubleMetaphoneTest
Running org.apache.commons.codec.language.SoundexTest
Tests run: 28, Failures: 0, Errors: 0, Skipped: 0, Time elapsed: 0.009 sec - in org.apache.commons.codec.language.SoundexTest
Running org.apache.commons.codec.language.RefinedSoundexTest
Tests run: 10, Failures: 0, Errors: 0, Skipped: 0, Time elapsed: 0.002 sec - in org.apache.commons.codec.language.RefinedSoundexTest
Running org.apache.commons.codec.language.MatchRatingApproachEncoderTest
Tests run: 96, Failures: 0, Errors: 0, Skipped: 0, Time elapsed: 0.032 sec - in org.apache.commons.codec.language.MatchRatingApproachEncoderTest
Running org.apache.commons.codec.language.ColognePhoneticTest
Tests run: 13, Failures: 0, Errors: 0, Skipped: 0, Time elapsed: 0.004 sec - in org.apache.commons.codec.language.ColognePhoneticTest
Running org.apache.commons.codec.language.DoubleMetaphone2Test
Tests run: 6, Failures: 0, Errors: 0, Skipped: 0, Time elapsed: 0.026 sec - in org.apache.commons.codec.language.DoubleMetaphone2Test
Running org.apache.commons.codec.language.MetaphoneTest
Tests run: 34, Failures: 0, Errors: 0, Skipped: 0, Time elapsed: 0.086 sec - in org.apache.commons.codec.language.MetaphoneTest
Running org.apache.commons.codec.CharEncodingTest
Tests run: 7, Failures: 0, Errors: 0, Skipped: 0, Time elapsed: 0 sec - in org.apache.commons.codec.CharEncodingTest

Results :

Failed tests: 
  Base64OutputStreamTest.testBase64OutputStreamByteByByte:144->testByteByByte:249 Streaming byte-by-byte base64 encode
  Base64OutputStreamTest.testBase64OutputStreamByChunk:106->testByChunk:197 Streaming chunked base64 encode
  Base64Codec13Test.testStaticEncodeChunked:483 static Base64.encodeBase64Chunked() test-1
  Base64InputStreamTest.testBase64InputStreamByChunk:216->testByChunk:308 Streaming base64 encode
  Base64InputStreamTest.testBase64InputStreamByteByByte:254->testByteByByte:364 Streaming base64 encode
  Base64Test.testConstructor_Int_ByteArray_Boolean_UrlSafe:264 new Base64(64, \t, true) expected:<...ZXdZFZ_VrqXeVjtOAu2A[]> but was:<...ZXdZFZ_VrqXeVjtOAu2A[	]>
  Base64Test.testSingletonsChunked:831 expected:<AA==[
]> but was:<AA==[]>
  Base64Test.testTripletsChunked:1008 expected:<AAAA[
]> but was:<AAAA[]>
  Base64Test.testChunkedEncodeMultipleOf76:132 chunkedEncodeMultipleOf76
  Base64Test.testConstructor_Int_ByteArray_Boolean:250 new Base64(65, \t, false) expected:<...XdZFZ/VrqXeVjtOAu2A=[	]> but was:<...XdZFZ/VrqXeVjtOAu2A=[]>

Tests in error: 
  Base64Codec13Test.testEncoder:371 » NullPointer
  Base64Codec13Test.testBinaryEncoder:409 » NullPointer
  Base64Codec13Test.testStaticEncode:446 » NullPointer
  Base64Test.testPairs:547 » NullPointer
  Base64Test.testUUID:1147 » NullPointer
  Base64Test.testEncodeDecodeSmall:362 » NullPointer
  Base64Test.testCodeInteger1:149 » NullPointer
  Base64Test.testCodeInteger2:158 » NullPointer
  Base64Test.testCodeInteger3:169 » NullPointer
  Base64Test.testCodeInteger4:186 » NullPointer
  Base64Test.testObjectEncode:542 » NullPointer
  Base64Test.testUrlSafe:1081 » NullPointer
  Base64Test.testEncodeDecodeRandom:349 » NullPointer
  Base64Test.testKnownEncodings:446 » NullPointer
  Base64Test.testCodec112:380 » NullPointer
  Base64Test.testSingletons:718 » NullPointer
  Base64Test.testRfc4648Section10DecodeEncode:671->testDecodeEncode:681 » NullPointer
  Base64Test.testBase64:82 » NullPointer
  Base64Test.testByteToStringVariations:1197 » NullPointer
  Base64Test.testRfc4648Section10Encode:646 » NullPointer
  Base64Test.testRfc4648Section10EncodeDecode:702->testEncodeDecode:711 » NullPointer
  BCodecTest.testUTF8RoundTrip » NullPointer
  BCodecTest.testBasicEncodeDecode » NullPointer
  BCodecTest.testEncodeObjects » NullPointer

Tests run: 662, Failures: 10, Errors: 24, Skipped: 1

[INFO] ------------------------------------------------------------------------
[INFO] BUILD FAILURE
[INFO] ------------------------------------------------------------------------
[INFO] Total time: 13.744s
[INFO] Finished at: Sun Aug 02 07:03:11 BST 2015
[INFO] Final Memory: 20M/287M
[INFO] ------------------------------------------------------------------------
[ERROR] Failed to execute goal org.apache.maven.plugins:maven-surefire-plugin:2.17:test (default-test) on project commons-codec: There are test failures.
[ERROR] 
[ERROR] Please refer to /home/perham/Study/LittleDarwin/Cases/commons-codec-1.10-src/target/surefire-reports for the individual test results.
[ERROR] -> [Help 1]
[ERROR] 
[ERROR] To see the full stack trace of the errors, re-run Maven with the -e switch.
[ERROR] Re-run Maven using the -X switch to enable full debug logging.
[ERROR] 
[ERROR] For more information about the errors and possible solutions, please read the following articles:
[ERROR] [Help 1] http://cwiki.apache.org/confluence/display/MAVEN/MojoFailureException
