[INFO] Scanning for projects...
[INFO]                                                                         
[INFO] ------------------------------------------------------------------------
[INFO] Building Apache Commons Codec 1.10
[INFO] ------------------------------------------------------------------------
[INFO] 
[INFO] --- maven-enforcer-plugin:1.3.1:enforce (enforce-maven-3) @ commons-codec ---
[INFO] 
[INFO] --- maven-antrun-plugin:1.7:run (javadoc.resources) @ commons-codec ---
[INFO] Executing tasks

main:
[INFO] Executed tasks
[INFO] 
[INFO] --- maven-remote-resources-plugin:1.5:process (default) @ commons-codec ---
[INFO] 
[INFO] --- buildnumber-maven-plugin:1.3:create (default) @ commons-codec ---
[INFO] Executing: /bin/sh -c cd /home/perham/Study/LittleDarwin/Cases/commons-codec-1.10-src && svn --non-interactive info
[INFO] Working directory: /home/perham/Study/LittleDarwin/Cases/commons-codec-1.10-src
[INFO] Storing buildNumber: ?????? at timestamp: 1438495365105
[INFO] Executing: /bin/sh -c cd /home/perham/Study/LittleDarwin/Cases/commons-codec-1.10-src && svn --non-interactive info
[INFO] Working directory: /home/perham/Study/LittleDarwin/Cases/commons-codec-1.10-src
[INFO] Storing buildScmBranch: UNKNOWN_BRANCH
[INFO] 
[INFO] --- maven-resources-plugin:2.7:resources (default-resources) @ commons-codec ---
[INFO] Using 'UTF-8' encoding to copy filtered resources.
[INFO] Copying 128 resources
[INFO] Copying 2 resources to META-INF
[INFO] 
[INFO] --- maven-compiler-plugin:3.2:compile (default-compile) @ commons-codec ---
[INFO] Changes detected - recompiling the module!
[INFO] Compiling 60 source files to /home/perham/Study/LittleDarwin/Cases/commons-codec-1.10-src/target/classes
[INFO] /home/perham/Study/LittleDarwin/Cases/commons-codec-1.10-src/src/main/java/org/apache/commons/codec/digest/Sha2Crypt.java: Some input files use or override a deprecated API.
[INFO] /home/perham/Study/LittleDarwin/Cases/commons-codec-1.10-src/src/main/java/org/apache/commons/codec/digest/Sha2Crypt.java: Recompile with -Xlint:deprecation for details.
[INFO] 
[INFO] --- maven-bundle-plugin:2.5.3:manifest (bundle-manifest) @ commons-codec ---
[INFO] 
[INFO] --- maven-resources-plugin:2.7:testResources (default-testResources) @ commons-codec ---
[INFO] Using 'UTF-8' encoding to copy filtered resources.
[INFO] skip non existing resourceDirectory /home/perham/Study/LittleDarwin/Cases/commons-codec-1.10-src/src/test/resources
[INFO] Copying 2 resources to META-INF
[INFO] 
[INFO] --- maven-compiler-plugin:3.2:testCompile (default-testCompile) @ commons-codec ---
[INFO] Nothing to compile - all classes are up to date
[INFO] 
[INFO] --- maven-surefire-plugin:2.17:test (default-test) @ commons-codec ---
[INFO] Surefire report directory: /home/perham/Study/LittleDarwin/Cases/commons-codec-1.10-src/target/surefire-reports

-------------------------------------------------------
 T E S T S
-------------------------------------------------------
Running org.apache.commons.codec.digest.B64Test
Tests run: 2, Failures: 0, Errors: 0, Skipped: 0, Time elapsed: 0.029 sec - in org.apache.commons.codec.digest.B64Test
Running org.apache.commons.codec.digest.DigestUtilsTest
Tests run: 17, Failures: 0, Errors: 0, Skipped: 0, Time elapsed: 0.636 sec - in org.apache.commons.codec.digest.DigestUtilsTest
Running org.apache.commons.codec.digest.Sha512CryptTest
Tests run: 8, Failures: 0, Errors: 0, Skipped: 0, Time elapsed: 0.494 sec - in org.apache.commons.codec.digest.Sha512CryptTest
Running org.apache.commons.codec.digest.Apr1CryptTest
Tests run: 8, Failures: 0, Errors: 0, Skipped: 0, Time elapsed: 0.053 sec - in org.apache.commons.codec.digest.Apr1CryptTest
Running org.apache.commons.codec.digest.HmacUtilsTest
Tests run: 24, Failures: 0, Errors: 0, Skipped: 0, Time elapsed: 0.036 sec - in org.apache.commons.codec.digest.HmacUtilsTest
Running org.apache.commons.codec.digest.Sha2CryptTest
Tests run: 1, Failures: 0, Errors: 0, Skipped: 0, Time elapsed: 0 sec - in org.apache.commons.codec.digest.Sha2CryptTest
Running org.apache.commons.codec.digest.CryptTest
Tests run: 4, Failures: 0, Errors: 0, Skipped: 0, Time elapsed: 0.061 sec - in org.apache.commons.codec.digest.CryptTest
Running org.apache.commons.codec.digest.Sha256CryptTest
Tests run: 7, Failures: 0, Errors: 0, Skipped: 0, Time elapsed: 0.107 sec - in org.apache.commons.codec.digest.Sha256CryptTest
Running org.apache.commons.codec.digest.Md5CryptTest
Tests run: 7, Failures: 0, Errors: 0, Skipped: 0, Time elapsed: 0.014 sec - in org.apache.commons.codec.digest.Md5CryptTest
Running org.apache.commons.codec.digest.UnixCryptTest
Tests run: 9, Failures: 0, Errors: 0, Skipped: 0, Time elapsed: 0.01 sec - in org.apache.commons.codec.digest.UnixCryptTest
Running org.apache.commons.codec.CharsetsTest
Tests run: 7, Failures: 0, Errors: 0, Skipped: 0, Time elapsed: 0 sec - in org.apache.commons.codec.CharsetsTest
Running org.apache.commons.codec.binary.Base32Test
Tests run: 8, Failures: 0, Errors: 0, Skipped: 0, Time elapsed: 0.015 sec - in org.apache.commons.codec.binary.Base32Test
Running org.apache.commons.codec.binary.Base64OutputStreamTest
Tests run: 7, Failures: 4, Errors: 0, Skipped: 0, Time elapsed: 0.003 sec <<< FAILURE! - in org.apache.commons.codec.binary.Base64OutputStreamTest
testBase64OutputStreamByteByByte(org.apache.commons.codec.binary.Base64OutputStreamTest)  Time elapsed: 0.001 sec  <<< FAILURE!
java.lang.AssertionError: Streaming byte-by-byte base64 encode
	at org.junit.Assert.fail(Assert.java:88)
	at org.junit.Assert.assertTrue(Assert.java:41)
	at org.apache.commons.codec.binary.Base64OutputStreamTest.testByteByByte(Base64OutputStreamTest.java:249)
	at org.apache.commons.codec.binary.Base64OutputStreamTest.testBase64OutputStreamByteByByte(Base64OutputStreamTest.java:144)

testBase64EmptyOutputStreamMimeChunkSize(org.apache.commons.codec.binary.Base64OutputStreamTest)  Time elapsed: 0 sec  <<< FAILURE!
java.lang.AssertionError: Streaming byte-by-byte base64 encode
	at org.junit.Assert.fail(Assert.java:88)
	at org.junit.Assert.assertTrue(Assert.java:41)
	at org.apache.commons.codec.binary.Base64OutputStreamTest.testByteByByte(Base64OutputStreamTest.java:249)
	at org.apache.commons.codec.binary.Base64OutputStreamTest.testBase64EmptyOutputStream(Base64OutputStreamTest.java:91)
	at org.apache.commons.codec.binary.Base64OutputStreamTest.testBase64EmptyOutputStreamMimeChunkSize(Base64OutputStreamTest.java:74)

testBase64EmptyOutputStreamPemChunkSize(org.apache.commons.codec.binary.Base64OutputStreamTest)  Time elapsed: 0 sec  <<< FAILURE!
java.lang.AssertionError: Streaming byte-by-byte base64 encode
	at org.junit.Assert.fail(Assert.java:88)
	at org.junit.Assert.assertTrue(Assert.java:41)
	at org.apache.commons.codec.binary.Base64OutputStreamTest.testByteByByte(Base64OutputStreamTest.java:249)
	at org.apache.commons.codec.binary.Base64OutputStreamTest.testBase64EmptyOutputStream(Base64OutputStreamTest.java:91)
	at org.apache.commons.codec.binary.Base64OutputStreamTest.testBase64EmptyOutputStreamPemChunkSize(Base64OutputStreamTest.java:85)

testBase64OutputStreamByChunk(org.apache.commons.codec.binary.Base64OutputStreamTest)  Time elapsed: 0.001 sec  <<< FAILURE!
java.lang.AssertionError: Streaming chunked base64 encode
	at org.junit.Assert.fail(Assert.java:88)
	at org.junit.Assert.assertTrue(Assert.java:41)
	at org.apache.commons.codec.binary.Base64OutputStreamTest.testByChunk(Base64OutputStreamTest.java:197)
	at org.apache.commons.codec.binary.Base64OutputStreamTest.testBase64OutputStreamByChunk(Base64OutputStreamTest.java:106)

Running org.apache.commons.codec.binary.Base64Codec13Test
Tests run: 8, Failures: 1, Errors: 0, Skipped: 0, Time elapsed: 0.023 sec <<< FAILURE! - in org.apache.commons.codec.binary.Base64Codec13Test
testStaticEncodeChunked(org.apache.commons.codec.binary.Base64Codec13Test)  Time elapsed: 0 sec  <<< FAILURE!
java.lang.AssertionError: static Base64.encodeBase64Chunked() test-1
	at org.junit.Assert.fail(Assert.java:88)
	at org.junit.Assert.assertTrue(Assert.java:41)
	at org.apache.commons.codec.binary.Base64Codec13Test.testStaticEncodeChunked(Base64Codec13Test.java:483)

Running org.apache.commons.codec.binary.Base64InputStreamTest
Tests run: 19, Failures: 4, Errors: 0, Skipped: 0, Time elapsed: 0.01 sec <<< FAILURE! - in org.apache.commons.codec.binary.Base64InputStreamTest
testBase64InputStreamByChunk(org.apache.commons.codec.binary.Base64InputStreamTest)  Time elapsed: 0.001 sec  <<< FAILURE!
java.lang.AssertionError: Streaming base64 encode
	at org.junit.Assert.fail(Assert.java:88)
	at org.junit.Assert.assertTrue(Assert.java:41)
	at org.apache.commons.codec.binary.Base64InputStreamTest.testByChunk(Base64InputStreamTest.java:308)
	at org.apache.commons.codec.binary.Base64InputStreamTest.testBase64InputStreamByChunk(Base64InputStreamTest.java:216)

testBase64EmptyInputStreamPemChuckSize(org.apache.commons.codec.binary.Base64InputStreamTest)  Time elapsed: 0.001 sec  <<< FAILURE!
java.lang.AssertionError: EOF expected:<-1> but was:<13>
	at org.junit.Assert.fail(Assert.java:88)
	at org.junit.Assert.failNotEquals(Assert.java:743)
	at org.junit.Assert.assertEquals(Assert.java:118)
	at org.junit.Assert.assertEquals(Assert.java:555)
	at org.apache.commons.codec.binary.Base64InputStreamTest.testByteByByte(Base64InputStreamTest.java:362)
	at org.apache.commons.codec.binary.Base64InputStreamTest.testBase64EmptyInputStream(Base64InputStreamTest.java:201)
	at org.apache.commons.codec.binary.Base64InputStreamTest.testBase64EmptyInputStreamPemChuckSize(Base64InputStreamTest.java:195)

testBase64EmptyInputStreamMimeChuckSize(org.apache.commons.codec.binary.Base64InputStreamTest)  Time elapsed: 0 sec  <<< FAILURE!
java.lang.AssertionError: EOF expected:<-1> but was:<13>
	at org.junit.Assert.fail(Assert.java:88)
	at org.junit.Assert.failNotEquals(Assert.java:743)
	at org.junit.Assert.assertEquals(Assert.java:118)
	at org.junit.Assert.assertEquals(Assert.java:555)
	at org.apache.commons.codec.binary.Base64InputStreamTest.testByteByByte(Base64InputStreamTest.java:362)
	at org.apache.commons.codec.binary.Base64InputStreamTest.testBase64EmptyInputStream(Base64InputStreamTest.java:201)
	at org.apache.commons.codec.binary.Base64InputStreamTest.testBase64EmptyInputStreamMimeChuckSize(Base64InputStreamTest.java:184)

testBase64InputStreamByteByByte(org.apache.commons.codec.binary.Base64InputStreamTest)  Time elapsed: 0 sec  <<< FAILURE!
java.lang.AssertionError: Streaming base64 encode
	at org.junit.Assert.fail(Assert.java:88)
	at org.junit.Assert.assertTrue(Assert.java:41)
	at org.apache.commons.codec.binary.Base64InputStreamTest.testByteByByte(Base64InputStreamTest.java:364)
	at org.apache.commons.codec.binary.Base64InputStreamTest.testBase64InputStreamByteByByte(Base64InputStreamTest.java:254)

Running org.apache.commons.codec.binary.Base32InputStreamTest
Tests run: 16, Failures: 0, Errors: 0, Skipped: 0, Time elapsed: 0.144 sec - in org.apache.commons.codec.binary.Base32InputStreamTest
Running org.apache.commons.codec.binary.Base32OutputStreamTest
Tests run: 6, Failures: 0, Errors: 0, Skipped: 0, Time elapsed: 0.109 sec - in org.apache.commons.codec.binary.Base32OutputStreamTest
Running org.apache.commons.codec.binary.BinaryCodecTest
Tests run: 13, Failures: 0, Errors: 0, Skipped: 0, Time elapsed: 0.012 sec - in org.apache.commons.codec.binary.BinaryCodecTest
Running org.apache.commons.codec.binary.BaseNCodecTest
Tests run: 7, Failures: 0, Errors: 0, Skipped: 0, Time elapsed: 0.003 sec - in org.apache.commons.codec.binary.BaseNCodecTest
Running org.apache.commons.codec.binary.StringUtilsTest
Tests run: 17, Failures: 0, Errors: 0, Skipped: 0, Time elapsed: 0.03 sec - in org.apache.commons.codec.binary.StringUtilsTest
Running org.apache.commons.codec.binary.Base64Test
Tests run: 53, Failures: 6, Errors: 0, Skipped: 1, Time elapsed: 0.05 sec <<< FAILURE! - in org.apache.commons.codec.binary.Base64Test
testConstructor_Int_ByteArray_Boolean_UrlSafe(org.apache.commons.codec.binary.Base64Test)  Time elapsed: 0.002 sec  <<< FAILURE!
org.junit.ComparisonFailure: new Base64(64, \t, true) expected:<...ZXdZFZ_VrqXeVjtOAu2A[]> but was:<...ZXdZFZ_VrqXeVjtOAu2A[	]>
	at org.junit.Assert.assertEquals(Assert.java:115)
	at org.apache.commons.codec.binary.Base64Test.testConstructor_Int_ByteArray_Boolean_UrlSafe(Base64Test.java:264)

testSingletonsChunked(org.apache.commons.codec.binary.Base64Test)  Time elapsed: 0.001 sec  <<< FAILURE!
org.junit.ComparisonFailure: expected:<AA==[
]> but was:<AA==[]>
	at org.junit.Assert.assertEquals(Assert.java:115)
	at org.junit.Assert.assertEquals(Assert.java:144)
	at org.apache.commons.codec.binary.Base64Test.testSingletonsChunked(Base64Test.java:831)

testKnownEncodings(org.apache.commons.codec.binary.Base64Test)  Time elapsed: 0 sec  <<< FAILURE!
org.junit.ComparisonFailure: expected:<...xhaCBi
bGFoIGJsYWg=[
]> but was:<...xhaCBi
bGFoIGJsYWg=[]>
	at org.junit.Assert.assertEquals(Assert.java:115)
	at org.junit.Assert.assertEquals(Assert.java:144)
	at org.apache.commons.codec.binary.Base64Test.testKnownEncodings(Base64Test.java:448)

testTripletsChunked(org.apache.commons.codec.binary.Base64Test)  Time elapsed: 0 sec  <<< FAILURE!
org.junit.ComparisonFailure: expected:<AAAA[
]> but was:<AAAA[]>
	at org.junit.Assert.assertEquals(Assert.java:115)
	at org.junit.Assert.assertEquals(Assert.java:144)
	at org.apache.commons.codec.binary.Base64Test.testTripletsChunked(Base64Test.java:1008)

testChunkedEncodeMultipleOf76(org.apache.commons.codec.binary.Base64Test)  Time elapsed: 0.001 sec  <<< FAILURE!
java.lang.AssertionError: chunkedEncodeMultipleOf76
	at org.junit.Assert.fail(Assert.java:88)
	at org.junit.Assert.assertTrue(Assert.java:41)
	at org.apache.commons.codec.binary.Base64Test.testChunkedEncodeMultipleOf76(Base64Test.java:132)

testConstructor_Int_ByteArray_Boolean(org.apache.commons.codec.binary.Base64Test)  Time elapsed: 0.001 sec  <<< FAILURE!
org.junit.ComparisonFailure: new Base64(65, \t, false) expected:<...XdZFZ/VrqXeVjtOAu2A=[	]> but was:<...XdZFZ/VrqXeVjtOAu2A=[]>
	at org.junit.Assert.assertEquals(Assert.java:115)
	at org.apache.commons.codec.binary.Base64Test.testConstructor_Int_ByteArray_Boolean(Base64Test.java:250)

Running org.apache.commons.codec.binary.HexTest
Tests run: 19, Failures: 0, Errors: 0, Skipped: 0, Time elapsed: 0.181 sec - in org.apache.commons.codec.binary.HexTest
Running org.apache.commons.codec.DecoderExceptionTest
Tests run: 4, Failures: 0, Errors: 0, Skipped: 0, Time elapsed: 0 sec - in org.apache.commons.codec.DecoderExceptionTest
Running org.apache.commons.codec.EncoderExceptionTest
Tests run: 4, Failures: 0, Errors: 0, Skipped: 0, Time elapsed: 0.001 sec - in org.apache.commons.codec.EncoderExceptionTest
Running org.apache.commons.codec.net.BCodecTest
Tests run: 9, Failures: 0, Errors: 0, Skipped: 0, Time elapsed: 0.006 sec - in org.apache.commons.codec.net.BCodecTest
Running org.apache.commons.codec.net.QCodecTest
Tests run: 12, Failures: 0, Errors: 0, Skipped: 0, Time elapsed: 0.008 sec - in org.apache.commons.codec.net.QCodecTest
Running org.apache.commons.codec.net.UtilsTest
Tests run: 1, Failures: 0, Errors: 0, Skipped: 0, Time elapsed: 0 sec - in org.apache.commons.codec.net.UtilsTest
Running org.apache.commons.codec.net.RFC1522CodecTest
Tests run: 2, Failures: 0, Errors: 0, Skipped: 0, Time elapsed: 0.003 sec - in org.apache.commons.codec.net.RFC1522CodecTest
Running org.apache.commons.codec.net.URLCodecTest
Tests run: 16, Failures: 0, Errors: 0, Skipped: 0, Time elapsed: 0.005 sec - in org.apache.commons.codec.net.URLCodecTest
Running org.apache.commons.codec.net.QuotedPrintableCodecTest
Tests run: 21, Failures: 0, Errors: 0, Skipped: 0, Time elapsed: 0.012 sec - in org.apache.commons.codec.net.QuotedPrintableCodecTest
Running org.apache.commons.codec.StringEncoderComparatorTest
Tests run: 3, Failures: 0, Errors: 0, Skipped: 0, Time elapsed: 0.005 sec - in org.apache.commons.codec.StringEncoderComparatorTest
Running org.apache.commons.codec.language.Caverphone1Test
Tests run: 9, Failures: 0, Errors: 0, Skipped: 0, Time elapsed: 0.029 sec - in org.apache.commons.codec.language.Caverphone1Test
Running org.apache.commons.codec.language.NysiisTest
Tests run: 23, Failures: 0, Errors: 0, Skipped: 0, Time elapsed: 0.02 sec - in org.apache.commons.codec.language.NysiisTest
Running org.apache.commons.codec.language.Caverphone2Test
Tests run: 13, Failures: 0, Errors: 0, Skipped: 0, Time elapsed: 0.128 sec - in org.apache.commons.codec.language.Caverphone2Test
Running org.apache.commons.codec.language.DaitchMokotoffSoundexTest
Tests run: 13, Failures: 0, Errors: 0, Skipped: 0, Time elapsed: 0.046 sec - in org.apache.commons.codec.language.DaitchMokotoffSoundexTest
Running org.apache.commons.codec.language.bm.BeiderMorseEncoderTest
Tests run: 22, Failures: 0, Errors: 0, Skipped: 0, Time elapsed: 3.083 sec - in org.apache.commons.codec.language.bm.BeiderMorseEncoderTest
Running org.apache.commons.codec.language.bm.PhoneticEngineTest
Tests run: 8, Failures: 0, Errors: 0, Skipped: 0, Time elapsed: 0.019 sec - in org.apache.commons.codec.language.bm.PhoneticEngineTest
Running org.apache.commons.codec.language.bm.PhoneticEngineRegressionTest
Tests run: 4, Failures: 0, Errors: 0, Skipped: 0, Time elapsed: 0.016 sec - in org.apache.commons.codec.language.bm.PhoneticEngineRegressionTest
Running org.apache.commons.codec.language.bm.RuleTest
Tests run: 3, Failures: 0, Errors: 0, Skipped: 0, Time elapsed: 0.001 sec - in org.apache.commons.codec.language.bm.RuleTest
Running org.apache.commons.codec.language.bm.LanguageGuessingTest
Tests run: 18, Failures: 0, Errors: 0, Skipped: 0, Time elapsed: 0.006 sec - in org.apache.commons.codec.language.bm.LanguageGuessingTest
Running org.apache.commons.codec.language.DoubleMetaphoneTest
Tests run: 16, Failures: 0, Errors: 0, Skipped: 0, Time elapsed: 0.045 sec - in org.apache.commons.codec.language.DoubleMetaphoneTest
Running org.apache.commons.codec.language.SoundexTest
Tests run: 28, Failures: 0, Errors: 0, Skipped: 0, Time elapsed: 0.01 sec - in org.apache.commons.codec.language.SoundexTest
Running org.apache.commons.codec.language.RefinedSoundexTest
Tests run: 10, Failures: 0, Errors: 0, Skipped: 0, Time elapsed: 0.003 sec - in org.apache.commons.codec.language.RefinedSoundexTest
Running org.apache.commons.codec.language.MatchRatingApproachEncoderTest
Tests run: 96, Failures: 0, Errors: 0, Skipped: 0, Time elapsed: 0.033 sec - in org.apache.commons.codec.language.MatchRatingApproachEncoderTest
Running org.apache.commons.codec.language.ColognePhoneticTest
Tests run: 13, Failures: 0, Errors: 0, Skipped: 0, Time elapsed: 0.003 sec - in org.apache.commons.codec.language.ColognePhoneticTest
Running org.apache.commons.codec.language.DoubleMetaphone2Test
Tests run: 6, Failures: 0, Errors: 0, Skipped: 0, Time elapsed: 0.027 sec - in org.apache.commons.codec.language.DoubleMetaphone2Test
Running org.apache.commons.codec.language.MetaphoneTest
Tests run: 34, Failures: 0, Errors: 0, Skipped: 0, Time elapsed: 0.084 sec - in org.apache.commons.codec.language.MetaphoneTest
Running org.apache.commons.codec.CharEncodingTest
Tests run: 7, Failures: 0, Errors: 0, Skipped: 0, Time elapsed: 0.001 sec - in org.apache.commons.codec.CharEncodingTest

Results :

Failed tests: 
  Base64OutputStreamTest.testBase64OutputStreamByteByByte:144->testByteByByte:249 Streaming byte-by-byte base64 encode
  Base64OutputStreamTest.testBase64EmptyOutputStreamMimeChunkSize:74->testBase64EmptyOutputStream:91->testByteByByte:249 Streaming byte-by-byte base64 encode
  Base64OutputStreamTest.testBase64EmptyOutputStreamPemChunkSize:85->testBase64EmptyOutputStream:91->testByteByByte:249 Streaming byte-by-byte base64 encode
  Base64OutputStreamTest.testBase64OutputStreamByChunk:106->testByChunk:197 Streaming chunked base64 encode
  Base64Codec13Test.testStaticEncodeChunked:483 static Base64.encodeBase64Chunked() test-1
  Base64InputStreamTest.testBase64InputStreamByChunk:216->testByChunk:308 Streaming base64 encode
  Base64InputStreamTest.testBase64EmptyInputStreamPemChuckSize:195->testBase64EmptyInputStream:201->testByteByByte:362 EOF expected:<-1> but was:<13>
  Base64InputStreamTest.testBase64EmptyInputStreamMimeChuckSize:184->testBase64EmptyInputStream:201->testByteByByte:362 EOF expected:<-1> but was:<13>
  Base64InputStreamTest.testBase64InputStreamByteByByte:254->testByteByByte:364 Streaming base64 encode
  Base64Test.testConstructor_Int_ByteArray_Boolean_UrlSafe:264 new Base64(64, \t, true) expected:<...ZXdZFZ_VrqXeVjtOAu2A[]> but was:<...ZXdZFZ_VrqXeVjtOAu2A[	]>
  Base64Test.testSingletonsChunked:831 expected:<AA==[
]> but was:<AA==[]>
  Base64Test.testKnownEncodings:448 expected:<...xhaCBi
bGFoIGJsYWg=[
]> but was:<...xhaCBi
bGFoIGJsYWg=[]>
  Base64Test.testTripletsChunked:1008 expected:<AAAA[
]> but was:<AAAA[]>
  Base64Test.testChunkedEncodeMultipleOf76:132 chunkedEncodeMultipleOf76
  Base64Test.testConstructor_Int_ByteArray_Boolean:250 new Base64(65, \t, false) expected:<...XdZFZ/VrqXeVjtOAu2A=[	]> but was:<...XdZFZ/VrqXeVjtOAu2A=[]>

Tests run: 662, Failures: 15, Errors: 0, Skipped: 1

[INFO] ------------------------------------------------------------------------
[INFO] BUILD FAILURE
[INFO] ------------------------------------------------------------------------
[INFO] Total time: 13.164s
[INFO] Finished at: Sun Aug 02 07:02:55 BST 2015
[INFO] Final Memory: 22M/287M
[INFO] ------------------------------------------------------------------------
[ERROR] Failed to execute goal org.apache.maven.plugins:maven-surefire-plugin:2.17:test (default-test) on project commons-codec: There are test failures.
[ERROR] 
[ERROR] Please refer to /home/perham/Study/LittleDarwin/Cases/commons-codec-1.10-src/target/surefire-reports for the individual test results.
[ERROR] -> [Help 1]
[ERROR] 
[ERROR] To see the full stack trace of the errors, re-run Maven with the -e switch.
[ERROR] Re-run Maven using the -X switch to enable full debug logging.
[ERROR] 
[ERROR] For more information about the errors and possible solutions, please read the following articles:
[ERROR] [Help 1] http://cwiki.apache.org/confluence/display/MAVEN/MojoFailureException
