[INFO] Scanning for projects...
[INFO]                                                                         
[INFO] ------------------------------------------------------------------------
[INFO] Building Apache Commons Codec 1.10
[INFO] ------------------------------------------------------------------------
[INFO] 
[INFO] --- maven-enforcer-plugin:1.3.1:enforce (enforce-maven-3) @ commons-codec ---
[INFO] 
[INFO] --- maven-antrun-plugin:1.7:run (javadoc.resources) @ commons-codec ---
[INFO] Executing tasks

main:
[INFO] Executed tasks
[INFO] 
[INFO] --- maven-remote-resources-plugin:1.5:process (default) @ commons-codec ---
[INFO] 
[INFO] --- buildnumber-maven-plugin:1.3:create (default) @ commons-codec ---
[INFO] Executing: /bin/sh -c cd /home/perham/Study/LittleDarwin/Cases/commons-codec-1.10-src && svn --non-interactive info
[INFO] Working directory: /home/perham/Study/LittleDarwin/Cases/commons-codec-1.10-src
[INFO] Storing buildNumber: ?????? at timestamp: 1438495318596
[INFO] Executing: /bin/sh -c cd /home/perham/Study/LittleDarwin/Cases/commons-codec-1.10-src && svn --non-interactive info
[INFO] Working directory: /home/perham/Study/LittleDarwin/Cases/commons-codec-1.10-src
[INFO] Storing buildScmBranch: UNKNOWN_BRANCH
[INFO] 
[INFO] --- maven-resources-plugin:2.7:resources (default-resources) @ commons-codec ---
[INFO] Using 'UTF-8' encoding to copy filtered resources.
[INFO] Copying 128 resources
[INFO] Copying 2 resources to META-INF
[INFO] 
[INFO] --- maven-compiler-plugin:3.2:compile (default-compile) @ commons-codec ---
[INFO] Changes detected - recompiling the module!
[INFO] Compiling 60 source files to /home/perham/Study/LittleDarwin/Cases/commons-codec-1.10-src/target/classes
[INFO] /home/perham/Study/LittleDarwin/Cases/commons-codec-1.10-src/src/main/java/org/apache/commons/codec/digest/Sha2Crypt.java: Some input files use or override a deprecated API.
[INFO] /home/perham/Study/LittleDarwin/Cases/commons-codec-1.10-src/src/main/java/org/apache/commons/codec/digest/Sha2Crypt.java: Recompile with -Xlint:deprecation for details.
[INFO] 
[INFO] --- maven-bundle-plugin:2.5.3:manifest (bundle-manifest) @ commons-codec ---
[INFO] 
[INFO] --- maven-resources-plugin:2.7:testResources (default-testResources) @ commons-codec ---
[INFO] Using 'UTF-8' encoding to copy filtered resources.
[INFO] skip non existing resourceDirectory /home/perham/Study/LittleDarwin/Cases/commons-codec-1.10-src/src/test/resources
[INFO] Copying 2 resources to META-INF
[INFO] 
[INFO] --- maven-compiler-plugin:3.2:testCompile (default-testCompile) @ commons-codec ---
[INFO] Nothing to compile - all classes are up to date
[INFO] 
[INFO] --- maven-surefire-plugin:2.17:test (default-test) @ commons-codec ---
[INFO] Surefire report directory: /home/perham/Study/LittleDarwin/Cases/commons-codec-1.10-src/target/surefire-reports

-------------------------------------------------------
 T E S T S
-------------------------------------------------------
Running org.apache.commons.codec.digest.B64Test
Tests run: 2, Failures: 0, Errors: 0, Skipped: 0, Time elapsed: 0.029 sec - in org.apache.commons.codec.digest.B64Test
Running org.apache.commons.codec.digest.DigestUtilsTest
Tests run: 17, Failures: 0, Errors: 0, Skipped: 0, Time elapsed: 0.667 sec - in org.apache.commons.codec.digest.DigestUtilsTest
Running org.apache.commons.codec.digest.Sha512CryptTest
Tests run: 8, Failures: 0, Errors: 0, Skipped: 0, Time elapsed: 0.493 sec - in org.apache.commons.codec.digest.Sha512CryptTest
Running org.apache.commons.codec.digest.Apr1CryptTest
Tests run: 8, Failures: 0, Errors: 0, Skipped: 0, Time elapsed: 0.084 sec - in org.apache.commons.codec.digest.Apr1CryptTest
Running org.apache.commons.codec.digest.HmacUtilsTest
Tests run: 24, Failures: 0, Errors: 0, Skipped: 0, Time elapsed: 0.051 sec - in org.apache.commons.codec.digest.HmacUtilsTest
Running org.apache.commons.codec.digest.Sha2CryptTest
Tests run: 1, Failures: 0, Errors: 0, Skipped: 0, Time elapsed: 0 sec - in org.apache.commons.codec.digest.Sha2CryptTest
Running org.apache.commons.codec.digest.CryptTest
Tests run: 4, Failures: 0, Errors: 0, Skipped: 0, Time elapsed: 0.11 sec - in org.apache.commons.codec.digest.CryptTest
Running org.apache.commons.codec.digest.Sha256CryptTest
Tests run: 7, Failures: 0, Errors: 0, Skipped: 0, Time elapsed: 0.098 sec - in org.apache.commons.codec.digest.Sha256CryptTest
Running org.apache.commons.codec.digest.Md5CryptTest
Tests run: 7, Failures: 0, Errors: 0, Skipped: 0, Time elapsed: 0.019 sec - in org.apache.commons.codec.digest.Md5CryptTest
Running org.apache.commons.codec.digest.UnixCryptTest
Tests run: 9, Failures: 0, Errors: 0, Skipped: 0, Time elapsed: 0.006 sec - in org.apache.commons.codec.digest.UnixCryptTest
Running org.apache.commons.codec.CharsetsTest
Tests run: 7, Failures: 0, Errors: 0, Skipped: 0, Time elapsed: 0.001 sec - in org.apache.commons.codec.CharsetsTest
Running org.apache.commons.codec.binary.Base32Test
Tests run: 8, Failures: 0, Errors: 0, Skipped: 0, Time elapsed: 0.006 sec - in org.apache.commons.codec.binary.Base32Test
Running org.apache.commons.codec.binary.Base64OutputStreamTest
Tests run: 7, Failures: 2, Errors: 0, Skipped: 0, Time elapsed: 0.011 sec <<< FAILURE! - in org.apache.commons.codec.binary.Base64OutputStreamTest
testBase64OutputStreamByteByByte(org.apache.commons.codec.binary.Base64OutputStreamTest)  Time elapsed: 0.001 sec  <<< FAILURE!
java.lang.AssertionError: Streaming byte-by-byte base64 encode
	at org.junit.Assert.fail(Assert.java:88)
	at org.junit.Assert.assertTrue(Assert.java:41)
	at org.apache.commons.codec.binary.Base64OutputStreamTest.testByteByByte(Base64OutputStreamTest.java:249)
	at org.apache.commons.codec.binary.Base64OutputStreamTest.testBase64OutputStreamByteByByte(Base64OutputStreamTest.java:144)

testBase64OutputStreamByChunk(org.apache.commons.codec.binary.Base64OutputStreamTest)  Time elapsed: 0 sec  <<< FAILURE!
java.lang.AssertionError: Streaming chunked base64 encode
	at org.junit.Assert.fail(Assert.java:88)
	at org.junit.Assert.assertTrue(Assert.java:41)
	at org.apache.commons.codec.binary.Base64OutputStreamTest.testByChunk(Base64OutputStreamTest.java:197)
	at org.apache.commons.codec.binary.Base64OutputStreamTest.testBase64OutputStreamByChunk(Base64OutputStreamTest.java:106)

Running org.apache.commons.codec.binary.Base64Codec13Test
Tests run: 8, Failures: 4, Errors: 0, Skipped: 0, Time elapsed: 0.014 sec <<< FAILURE! - in org.apache.commons.codec.binary.Base64Codec13Test
testEncoder(org.apache.commons.codec.binary.Base64Codec13Test)  Time elapsed: 0 sec  <<< FAILURE!
java.lang.AssertionError: Encoder test-1
	at org.junit.Assert.fail(Assert.java:88)
	at org.junit.Assert.assertTrue(Assert.java:41)
	at org.apache.commons.codec.binary.Base64Codec13Test.testEncoder(Base64Codec13Test.java:372)

testBinaryEncoder(org.apache.commons.codec.binary.Base64Codec13Test)  Time elapsed: 0 sec  <<< FAILURE!
java.lang.AssertionError: BinaryEncoder test-1
	at org.junit.Assert.fail(Assert.java:88)
	at org.junit.Assert.assertTrue(Assert.java:41)
	at org.apache.commons.codec.binary.Base64Codec13Test.testBinaryEncoder(Base64Codec13Test.java:410)

testStaticEncodeChunked(org.apache.commons.codec.binary.Base64Codec13Test)  Time elapsed: 0 sec  <<< FAILURE!
java.lang.AssertionError: static Base64.encodeBase64Chunked() test-1
	at org.junit.Assert.fail(Assert.java:88)
	at org.junit.Assert.assertTrue(Assert.java:41)
	at org.apache.commons.codec.binary.Base64Codec13Test.testStaticEncodeChunked(Base64Codec13Test.java:483)

testStaticEncode(org.apache.commons.codec.binary.Base64Codec13Test)  Time elapsed: 0.001 sec  <<< FAILURE!
java.lang.AssertionError: static Base64.encodeBase64() test-1
	at org.junit.Assert.fail(Assert.java:88)
	at org.junit.Assert.assertTrue(Assert.java:41)
	at org.apache.commons.codec.binary.Base64Codec13Test.testStaticEncode(Base64Codec13Test.java:447)

Running org.apache.commons.codec.binary.Base64InputStreamTest
Tests run: 19, Failures: 3, Errors: 0, Skipped: 0, Time elapsed: 0.011 sec <<< FAILURE! - in org.apache.commons.codec.binary.Base64InputStreamTest
testBase64InputStreamByChunk(org.apache.commons.codec.binary.Base64InputStreamTest)  Time elapsed: 0.001 sec  <<< FAILURE!
java.lang.AssertionError: Streaming base64 encode
	at org.junit.Assert.fail(Assert.java:88)
	at org.junit.Assert.assertTrue(Assert.java:41)
	at org.apache.commons.codec.binary.Base64InputStreamTest.testByChunk(Base64InputStreamTest.java:308)
	at org.apache.commons.codec.binary.Base64InputStreamTest.testBase64InputStreamByChunk(Base64InputStreamTest.java:216)

testCodec130(org.apache.commons.codec.binary.Base64InputStreamTest)  Time elapsed: 0.001 sec  <<< FAILURE!
org.junit.ComparisonFailure: expected:<[ello Wor]ld> but was:<[ H Heelllloo W Woorlrld]ld>
	at org.junit.Assert.assertEquals(Assert.java:115)
	at org.junit.Assert.assertEquals(Assert.java:144)
	at org.apache.commons.codec.binary.Base64InputStreamTest.testCodec130(Base64InputStreamTest.java:73)

testBase64InputStreamByteByByte(org.apache.commons.codec.binary.Base64InputStreamTest)  Time elapsed: 0 sec  <<< FAILURE!
java.lang.AssertionError: EOF expected:<-1> but was:<66>
	at org.junit.Assert.fail(Assert.java:88)
	at org.junit.Assert.failNotEquals(Assert.java:743)
	at org.junit.Assert.assertEquals(Assert.java:118)
	at org.junit.Assert.assertEquals(Assert.java:555)
	at org.apache.commons.codec.binary.Base64InputStreamTest.testByteByByte(Base64InputStreamTest.java:362)
	at org.apache.commons.codec.binary.Base64InputStreamTest.testBase64InputStreamByteByByte(Base64InputStreamTest.java:254)

Running org.apache.commons.codec.binary.Base32InputStreamTest
Tests run: 16, Failures: 0, Errors: 0, Skipped: 0, Time elapsed: 0.144 sec - in org.apache.commons.codec.binary.Base32InputStreamTest
Running org.apache.commons.codec.binary.Base32OutputStreamTest
Tests run: 6, Failures: 0, Errors: 0, Skipped: 0, Time elapsed: 0.1 sec - in org.apache.commons.codec.binary.Base32OutputStreamTest
Running org.apache.commons.codec.binary.BinaryCodecTest
Tests run: 13, Failures: 0, Errors: 0, Skipped: 0, Time elapsed: 0.01 sec - in org.apache.commons.codec.binary.BinaryCodecTest
Running org.apache.commons.codec.binary.BaseNCodecTest
Tests run: 7, Failures: 0, Errors: 0, Skipped: 0, Time elapsed: 0.002 sec - in org.apache.commons.codec.binary.BaseNCodecTest
Running org.apache.commons.codec.binary.StringUtilsTest
Tests run: 17, Failures: 0, Errors: 0, Skipped: 0, Time elapsed: 0.024 sec - in org.apache.commons.codec.binary.StringUtilsTest
Running org.apache.commons.codec.binary.Base64Test
Tests run: 53, Failures: 26, Errors: 0, Skipped: 1, Time elapsed: 0.039 sec <<< FAILURE! - in org.apache.commons.codec.binary.Base64Test
testTriplets(org.apache.commons.codec.binary.Base64Test)  Time elapsed: 0.001 sec  <<< FAILURE!
org.junit.ComparisonFailure: expected:<AAAA[]> but was:<AAAA[AAAA]>
	at org.junit.Assert.assertEquals(Assert.java:115)
	at org.junit.Assert.assertEquals(Assert.java:144)
	at org.apache.commons.codec.binary.Base64Test.testTriplets(Base64Test.java:940)

testConstructor_Int_ByteArray_Boolean_UrlSafe(org.apache.commons.codec.binary.Base64Test)  Time elapsed: 0.003 sec  <<< FAILURE!
org.junit.ComparisonFailure: new Base64(64, \t, true) expected:<[AAD0APSDg80rzSsFBS90L3S4uIgCiAKenpy3nLc9PXZKdkokJCY4Jjhray1bLVsm	Ji9IL0j3956-nr7n58OGw4a8vNrC2sLOzrm-ub6MjKQqpCo2NsiPyI99fdhZ2Fk2	Nr3EvcQODtz83PxRUfKl8qVnZyWtJa2YmFDuUO6Jid9z33NyckT3RPdwcEnlSeX0	9PhH-Efc3MARwBHY2NuP248tLWG_Yb-Ghlg2WDZxcRPhE-FiYl5cXlzCwsn_yf-a	mn6ofqgaGlOwU7D6-l6lXqVvbwM1AzVWVjLVMtXNzTb_Nv9cXDILMgvp6SADIAOg	oK9Fr0VHR31xfXEqKv-W_5bf3zwAPABHR2xNbE1eXgYwBjApKfX49fhMTC4CLgIm	Jh2KHYr8_G7Obs5_f5wsnCzPzyraKto3N7CqsKpSUjnaOdrT0_0n_SewsKzyrPL6	-obvhu9bWzr5OvlgYAQsBCyrq-b95v1KSi-_L78mJo6Ljovj450xnTFHR-ND40NC	QkuIS4i5uQe7B7uqqn07fTsFBSC9IL0KCqIMogysrMS_xL_w8C6CLoKNjR1MHUz2	9nNgc2BhYTIIMgj-_kZWRla5uV7dXt0EBB2BHYHIyIgeiB56el13XXeFhVRMVEzx	8ZFRkVG1td4p3im4uH75fvlNTd9s32ySkieDJ4P7-xBcEFzNzchgyGAcHIxnjGe8	vG30bfR1dZLUktS1tRxFHEXU1Ds-Oz68vCf8J_yJiVBbUFsTE4x6jHqvr4pkimSU	lKgCqAL4-Ja1lrXb2x6tHq18fIdsh2yBgRr_Gv_4-GavZq-Kin-Pf4_NzSTSJNIP	D2rfat-YmGrVatWsrIYzhjPf33zgfOACAtNJ00mmpnxZfFns7IVthW2cnHULdQsQ	EL9Cv0KKip_3n_dlZQf_B_8pKUFGQUZ0dIk2iTZ-fixLLEtKShreGt7l5Rs2Gzbz	86emp6ZAQHgPeA_V1XtSe1Lf31q2WrYpKcImwia8vD7CPsIiIlwyXDJfX72SvZKd	nbnUudSFhTEEMQRgYDhxOHFMTGHRYdHm5rGTsZNzc4Nag1p8fAj3CPeRkSS2JLZl	ZY4rjisAAJI_kj9MTGNbY1sCAgzEDMQ4OPKD8oMAAAblBuUfHx-TH5PR0f1t_W1Y	WLW2tbYTExq-Gr5ubicNJw3Ozi9oL2ja2hITEhNUVGdkZ2TW1jBuMG4lJRWVFZVT	U8z0zPRHRyW8JbyVlZNZk1ne3qKBooFnZ4DQgNDMzEcARwAPDyI4IjjOzlWeVZ5q	aqn9qf1hYYztjO1AQOrn6ufa2sEhwSHT01AKUAqHh5MlkyWgoCQSJBLQ0C4sLiy-	vnOic6IDA5rlmuXv74zNjM1YWO8H7weTkxhCGEJTU6VppWmkpO1C7UK0tEClQKV2	drlnuWeFhV8RXxGpqe717vVCQrZ-tn4tLVPyU_IyMk8UTxQtLY-Zj5l3d5vGm8ad	nRucG5zv75VblVvm5uDI4MhHR0giSCJCQhAJEAmmpmrUatTCwpYLlgtycq6Irojk	5L0EvQSdnW3sbezt7QDYANiSkokqiSr6-gThBOFDQ26Xbpc1NXZMdkxgYIL4gvig	oCeaJ5o0NGpAakAaGpeUl5SZmaCMoIx0dACgAKBzc1koWSjp6Zr-mv7i4hA6EDrL	y98O3w56eqJxonGHh0OZQ5n8_IJigmLl5Xz0fPR4eMDUwNR_fy2ILYgyMnzlfOVX	V-ys7KxRUd1x3XGzs8CgwKDQ0KmLqYuurlrAWsCUlId9h33T087UztTQ0M40zjTi	4r75vvkuLtjR2NFVVdSC1IKGhhisGKwVFXhjeGO2thsLGwvMzCD-IP56epyKnIpq	aveW95Ztbe1H7UcqKn5CfkLIyArNCs3U1ERtRG3z81GTUZNBQXk8eTy8vIt-i37F	xQSVBJXq6mOzY7NUVB1XHVd3d8RXxFdSUsm2ybYsLLADsAN7e5tUm1TU1AlHCUcY	GFtjW2MWFr8Lvwv19fLa8tqsrGmbaZurq-9073S_v3aXdpd6erVxtXHHx6_fr9-S	khxoHGjo6JLHkseysib7Jvvx8bFXsVdpaVUpVSnW1o69jr2FhUYMRgw9PXMFcwUX	F7pjumNgYLBBsEG_v2nTadPPzyXfJd___3eod6hkZHnneefd3c0KzQorK489jz1n	ZywNLA1sbBRKFEoTEzUTNRMlJbQUtBTV1fUX9RfGxufM58x5ediK2Io6OjITMhP4	-N_i3-LPz-X15fWwsF3vXe8iIl1FXUVkZELKQsooKHZZdlnMzKkCqQIjI4gSiBJA	QGwfbB_n50JOQk4GBqW7pbvLyxEOEQ6DgyHhIeGSkgEFAQXY2Ad-B36GhlTJVMnC	wupF6kXk5AUtBS2WlnhKeEpeXjNKM0psbO3m7eb09DFAMUBYWEQpRCm_v359fn3_	__it-K29vUoCSgKOjrCJsIn396eDp4MVFV8iXyLGxrZvtm-ZmWNfY18wMCpeKl7O	zsmQyZD7--YL5gunp9rt2u1-fhlmGWZ3d1GiUaJGRrFisWJbW7dyt3IPDw5XDlfr	64b_hv-mpgAdAB2YmKWjpaPGxq3QrdDq6mSQZJDX100WTRbo6HC4cLhpaWQGZAaq	qtko2SjV1SP-I_4EBKJhomGHhzTqNOoBAX-vf6_8_PqJ-olgYCOlI6VyclFbUVta	WqrcqtwiItld2V3W1kVnRWf19Wupa6l3d5WOlY7T04C7gLtg]u2A	> but was:<[9IPNKwUvdLiIAp6ctz12SiQmOGstWyYvSPeevufDhrzaws65voykKjbIj33YWTa9	xA7c_FHypWclrZhQ7onfc3JE93BJ5fT4R9zAEdjbjy1hv4ZYNnET4WJeXMLJ_5p-	qBpTsPpepW8DNVYy1c02_1wyC-kgA6CvRUd9cSr_lt88AEdsTV4GMCn1-EwuAiYd	ivxuzn-cLM8q2jewqlI52tP9J7Cs8vqG71s6-WAELKvm_UovvyaOi-OdMUfjQ0JL	iLkHu6p9OwUgvQqiDKzEv_Augo0dTPZzYGEyCP5GVrle3QQdgciIHnpdd4VUTPGR	UbXeKbh--U3fbJIng_sQXM3IYByMZ7xt9HWS1LUcRdQ7Prwn_IlQWxOMeq-KZJSo	AviWtdserXyHbIEa__hmr4p_j80k0g9q35hq1ayGM9984ALTSaZ8WeyFbZx1CxC_	Qoqf92UH_ylBRnSJNn4sS0oa3uUbNvOnpkB4D9V7Ut9atinCJrw-wiJcMl-9kp25	1IUxBGA4cUxh0eaxk3ODWnwI95EktmWOKwCSP0xjWwIMxDjygwAG5R8fk9H9bVi1	thMavm4nDc4vaNoSE1RnZNYwbiUVlVPM9EclvJWTWd6igWeA0MxHAA8iOM5Vnmqp	_WGM7UDq59rBIdNQCoeTJaAkEtAuLL5zogOa5e-MzVjvB5MYQlOlaaTtQrRApXa5	Z4VfEanu9UK2fi1T8jJPFC2PmXebxp0bnO-VW-bgyEdIIkIQCaZq1MKWC3KuiOS9	BJ1t7O0A2JKJKvoE4UNulzV2TGCC-KAnmjRqQBqXlJmgjHQAoHNZKOma_uIQOsvf	DnqicYdDmfyCYuV89HjA1H8tiDJ85VfsrFHdcbPAoNCpi65awJSHfdPO1NDONOK-	-S7Y0VXUgoYYrBV4Y7YbC8wg_nqcimr3lm3tRyp-QsgKzdREbfNRk0F5PLyLfsUE	lepjs1QdV3fEV1LJtiywA3ubVNQJRxhbYxa_C_Xy2qxpm6vvdL92l3q1ccev35Ic	aOiSx7Im-_GxV2lVKdaOvYVGDD1zBRe6Y2CwQb9p088l3_93qGR5593NCiuPPWcs	DWwUShM1EyW0FNX1F8bnzHnYijoyE_jf4s_l9bBd7yJdRWRCyih2WcypAiOIEkBs	H-dCTgalu8sRDoMh4ZIBBdgHfoZUycLqReQFLZZ4Sl4zSmzt5vQxQFhEKb9-ff_4	rb1KAo6wifengxVfIsa2b5ljXzAqXs7JkPvmC6fa7X4ZZndRokaxYlu3cg8OV-uG	_6YAHZilo8at0OpkkNdNFuhwuGlkBqrZKNUj_gSiYYc06gF_r_z6iWAjpXJRW1qq	3CLZXdZFZ_VrqXeVjtOA]u2A	>
	at org.junit.Assert.assertEquals(Assert.java:115)
	at org.apache.commons.codec.binary.Base64Test.testConstructor_Int_ByteArray_Boolean_UrlSafe(Base64Test.java:264)

testSingletonsChunked(org.apache.commons.codec.binary.Base64Test)  Time elapsed: 0 sec  <<< FAILURE!
org.junit.ComparisonFailure: expected:<AA[]==
> but was:<AA[AAAA]==
>
	at org.junit.Assert.assertEquals(Assert.java:115)
	at org.junit.Assert.assertEquals(Assert.java:144)
	at org.apache.commons.codec.binary.Base64Test.testSingletonsChunked(Base64Test.java:831)

testPairs(org.apache.commons.codec.binary.Base64Test)  Time elapsed: 0 sec  <<< FAILURE!
org.junit.ComparisonFailure: expected:<AAA[]=> but was:<AAA[AAAAAAAA]=>
	at org.junit.Assert.assertEquals(Assert.java:115)
	at org.junit.Assert.assertEquals(Assert.java:144)
	at org.apache.commons.codec.binary.Base64Test.testPairs(Base64Test.java:547)

testUUID(org.apache.commons.codec.binary.Base64Test)  Time elapsed: 0.001 sec  <<< FAILURE!
java.lang.AssertionError: standard encode uuid
	at org.junit.Assert.fail(Assert.java:88)
	at org.junit.Assert.assertTrue(Assert.java:41)
	at org.apache.commons.codec.binary.Base64Test.testUUID(Base64Test.java:1180)

testEncodeDecodeSmall(org.apache.commons.codec.binary.Base64Test)  Time elapsed: 0 sec  <<< FAILURE!
java.lang.AssertionError: -60 equals 0,0,-60,-60
	at org.junit.Assert.fail(Assert.java:88)
	at org.junit.Assert.assertTrue(Assert.java:41)
	at org.apache.commons.codec.binary.Base64Test.testEncodeDecodeSmall(Base64Test.java:365)

testObjectDecodeWithValidParameter(org.apache.commons.codec.binary.Base64Test)  Time elapsed: 0 sec  <<< FAILURE!
org.junit.ComparisonFailure: dest string does not equal original expected:<[Hello World!]> but was:<[  H Heelllloo W Woorlrld]>
	at org.junit.Assert.assertEquals(Assert.java:115)
	at org.apache.commons.codec.binary.Base64Test.testObjectDecodeWithValidParameter(Base64Test.java:511)

testCodeInteger1(org.apache.commons.codec.binary.Base64Test)  Time elapsed: 0.002 sec  <<< FAILURE!
org.junit.ComparisonFailure: expected:<[li7dzDacuo67Jg7mtqEm2TRu]OMU=> but was:<[AACWAJYuLt3M3cw2Npy6nLqOjrsmuyYODua25rahoSbZJtk0NG44bjjF]OMU=>
	at org.junit.Assert.assertEquals(Assert.java:115)
	at org.junit.Assert.assertEquals(Assert.java:144)
	at org.apache.commons.codec.binary.Base64Test.testCodeInteger1(Base64Test.java:149)

testCodeInteger2(org.apache.commons.codec.binary.Base64Test)  Time elapsed: 0 sec  <<< FAILURE!
org.junit.ComparisonFailure: expected:<[9B5ypLY9pMOmtxCeTDHgwdNF]eGs=> but was:<[AAD0APQeHnKkcqS2tj2kPaTDw6a3prcQEJ5MnkwxMeDB4MHT00V4RXhr]eGs=>
	at org.junit.Assert.assertEquals(Assert.java:115)
	at org.junit.Assert.assertEquals(Assert.java:144)
	at org.apache.commons.codec.binary.Base64Test.testCodeInteger2(Base64Test.java:158)

testCodeInteger3(org.apache.commons.codec.binary.Base64Test)  Time elapsed: 0.001 sec  <<< FAILURE!
org.junit.ComparisonFailure: expected:<[FKIhdgaG5LGKiEtF1vHy4f3y700zaD6QwDS3IrNVGzNp2rY+1LFWTK6D44AyiC1n8uWz1itkYMZF0/aKDK0Y]jg==> but was:<[AAAUABSioiF2IXYGBobkhuSxsYqIiohLS0XWRdbx8fLh8uH9/fLv8u9NTTNoM2g+PpDAkMA0NLcityKzs1UbVRszM2naadq2tj7UPtSxsVZMVkyuroPjg+OAgDKIMogtLWfyZ/Ll5bPWs9YrK2RgZGDGxkXTRdP29ooMigytrRiO]jg==>
	at org.junit.Assert.assertEquals(Assert.java:115)
	at org.junit.Assert.assertEquals(Assert.java:144)
	at org.apache.commons.codec.binary.Base64Test.testCodeInteger3(Base64Test.java:169)

testCodeInteger4(org.apache.commons.codec.binary.Base64Test)  Time elapsed: 0.001 sec  <<< FAILURE!
org.junit.ComparisonFailure: expected:<[ctA8YGxrtngg/zKVvqEOefnwmViFztcnPBYPlJsvh6yKI4iDm68fnp4Mi3RrJ6bZAygFrUIQLxLjV+OJtgJAEto0xAs+Mehuq1DkSFEpP3oDzCTOsrOiS1DwQe4oIb7zVk/9l7aPtJMHW0LVlMdwZNFNNJoqMcT2ZfCPrfvY]vQ0=> but was:<[AAByAHLQ0DxgPGBsbGu2a7Z4eCD/IP8yMpW+lb6hoQ55Dnn5+fCZ8JlYWIXOhc7X1yc8JzwWFg+UD5Sbmy+HL4esrIojiiOIiIObg5uvrx+eH56engyLDIt0dGsnayemptkD2QMoKAWtBa1CQhAvEC8SEuNX41fj44m2ibYCAkASQBLa2jTENMQLCz4xPjHo6G6rbqtQUORI5EhRUSk/KT96egPMA8wkJM6yzrKzs6JLoktQUPBB8EHu7ighKCG+vvNW81ZPT/2X/Ze2to+0j7STkwdbB1tCQtWU1ZTHx3BkcGTR0U00TTSamioxKjHExPZl9mXw8I+tj637+9i92L0N]vQ0=>
	at org.junit.Assert.assertEquals(Assert.java:115)
	at org.junit.Assert.assertEquals(Assert.java:144)
	at org.apache.commons.codec.binary.Base64Test.testCodeInteger4(Base64Test.java:186)

testObjectEncode(org.apache.commons.codec.binary.Base64Test)  Time elapsed: 0.001 sec  <<< FAILURE!
org.junit.ComparisonFailure: expected:<[SGVsbG8gV29y]bGQ=> but was:<[AABIAEhlZWxsbGxvbyBXIFdvb3Jscmxk]bGQ=>
	at org.junit.Assert.assertEquals(Assert.java:115)
	at org.junit.Assert.assertEquals(Assert.java:144)
	at org.apache.commons.codec.binary.Base64Test.testObjectEncode(Base64Test.java:542)

testUrlSafe(org.apache.commons.codec.binary.Base64Test)  Time elapsed: 0.001 sec  <<< FAILURE!
java.lang.AssertionError: url-safe i=1
	at org.junit.Assert.fail(Assert.java:88)
	at org.junit.Assert.assertTrue(Assert.java:41)
	at org.apache.commons.codec.binary.Base64Test.testUrlSafe(Base64Test.java:1085)

testEncodeDecodeRandom(org.apache.commons.codec.binary.Base64Test)  Time elapsed: 0.002 sec  <<< FAILURE!
java.lang.AssertionError: null
	at org.junit.Assert.fail(Assert.java:86)
	at org.junit.Assert.assertTrue(Assert.java:41)
	at org.junit.Assert.assertTrue(Assert.java:52)
	at org.apache.commons.codec.binary.Base64Test.testEncodeDecodeRandom(Base64Test.java:352)

testDecodeWithWhitespace(org.apache.commons.codec.binary.Base64Test)  Time elapsed: 0 sec  <<< FAILURE!
org.junit.ComparisonFailure: Dest string doesn't equal the original expected:<[I am a late night coder.]> but was:<[  I I  amam  a a llatatee n niighghtt c coodeder]>
	at org.junit.Assert.assertEquals(Assert.java:115)
	at org.apache.commons.codec.binary.Base64Test.testDecodeWithWhitespace(Base64Test.java:324)

testKnownEncodings(org.apache.commons.codec.binary.Base64Test)  Time elapsed: 0 sec  <<< FAILURE!
org.junit.ComparisonFailure: expected:<[VGhlIHF1aWNrIGJyb3duIGZveCBqdW1wZWQgb3ZlciB0aGUgbGF6eSBkb2dz]Lg==> but was:<[AABUAFRoaGUgZSBxcXVpdWljY2sgayBiYnJvcm93d24gbiBmZm94b3ggIGp1anVtbXBlcGVkZCBvIG92dmVyZXIgIHRodGhlZSBsIGxhYXp5enkgIGRvZG9nZ3Mu]Lg==>
	at org.junit.Assert.assertEquals(Assert.java:115)
	at org.junit.Assert.assertEquals(Assert.java:144)
	at org.apache.commons.codec.binary.Base64Test.testKnownEncodings(Base64Test.java:446)

testSingletons(org.apache.commons.codec.binary.Base64Test)  Time elapsed: 0 sec  <<< FAILURE!
org.junit.ComparisonFailure: expected:<AA[]==> but was:<AA[AAAA]==>
	at org.junit.Assert.assertEquals(Assert.java:115)
	at org.junit.Assert.assertEquals(Assert.java:144)
	at org.apache.commons.codec.binary.Base64Test.testSingletons(Base64Test.java:718)

testTripletsChunked(org.apache.commons.codec.binary.Base64Test)  Time elapsed: 0.001 sec  <<< FAILURE!
org.junit.ComparisonFailure: expected:<AAAA[]
> but was:<AAAA[AAAA]
>
	at org.junit.Assert.assertEquals(Assert.java:115)
	at org.junit.Assert.assertEquals(Assert.java:144)
	at org.apache.commons.codec.binary.Base64Test.testTripletsChunked(Base64Test.java:1008)

testRfc4648Section10DecodeEncode(org.apache.commons.codec.binary.Base64Test)  Time elapsed: 0 sec  <<< FAILURE!
org.junit.ComparisonFailure: expected:<[]Zg==> but was:<[AABm]Zg==>
	at org.junit.Assert.assertEquals(Assert.java:115)
	at org.junit.Assert.assertEquals(Assert.java:144)
	at org.apache.commons.codec.binary.Base64Test.testDecodeEncode(Base64Test.java:682)
	at org.apache.commons.codec.binary.Base64Test.testRfc4648Section10DecodeEncode(Base64Test.java:671)

testChunkedEncodeMultipleOf76(org.apache.commons.codec.binary.Base64Test)  Time elapsed: 0.002 sec  <<< FAILURE!
java.lang.AssertionError: chunkedEncodeMultipleOf76
	at org.junit.Assert.fail(Assert.java:88)
	at org.junit.Assert.assertTrue(Assert.java:41)
	at org.apache.commons.codec.binary.Base64Test.testChunkedEncodeMultipleOf76(Base64Test.java:132)

testBase64(org.apache.commons.codec.binary.Base64Test)  Time elapsed: 0 sec  <<< FAILURE!
org.junit.ComparisonFailure: encoding hello world expected:<[SGVsbG8gV29y]bGQ=> but was:<[AABIAEhlZWxsbGxvbyBXIFdvb3Jscmxk]bGQ=>
	at org.junit.Assert.assertEquals(Assert.java:115)
	at org.apache.commons.codec.binary.Base64Test.testBase64(Base64Test.java:84)

testConstructor_Int_ByteArray_Boolean(org.apache.commons.codec.binary.Base64Test)  Time elapsed: 0.003 sec  <<< FAILURE!
org.junit.ComparisonFailure: new Base64(65, \t, false) expected:<[9IPNKwUvdLiIAp6ctz12SiQmOGstWyYvSPeevufDhrzaws65voykKjbIj33YWTa9	xA7c/FHypWclrZhQ7onfc3JE93BJ5fT4R9zAEdjbjy1hv4ZYNnET4WJeXMLJ/5p+	qBpTsPpepW8DNVYy1c02/1wyC+kgA6CvRUd9cSr/lt88AEdsTV4GMCn1+EwuAiYd	ivxuzn+cLM8q2jewqlI52tP9J7Cs8vqG71s6+WAELKvm/UovvyaOi+OdMUfjQ0JL	iLkHu6p9OwUgvQqiDKzEv/Augo0dTPZzYGEyCP5GVrle3QQdgciIHnpdd4VUTPGR	UbXeKbh++U3fbJIng/sQXM3IYByMZ7xt9HWS1LUcRdQ7Prwn/IlQWxOMeq+KZJSo	AviWtdserXyHbIEa//hmr4p/j80k0g9q35hq1ayGM9984ALTSaZ8WeyFbZx1CxC/	Qoqf92UH/ylBRnSJNn4sS0oa3uUbNvOnpkB4D9V7Ut9atinCJrw+wiJcMl+9kp25	1IUxBGA4cUxh0eaxk3ODWnwI95EktmWOKwCSP0xjWwIMxDjygwAG5R8fk9H9bVi1	thMavm4nDc4vaNoSE1RnZNYwbiUVlVPM9EclvJWTWd6igWeA0MxHAA8iOM5Vnmqp	/WGM7UDq59rBIdNQCoeTJaAkEtAuLL5zogOa5e+MzVjvB5MYQlOlaaTtQrRApXa5	Z4VfEanu9UK2fi1T8jJPFC2PmXebxp0bnO+VW+bgyEdIIkIQCaZq1MKWC3KuiOS9	BJ1t7O0A2JKJKvoE4UNulzV2TGCC+KAnmjRqQBqXlJmgjHQAoHNZKOma/uIQOsvf	DnqicYdDmfyCYuV89HjA1H8tiDJ85VfsrFHdcbPAoNCpi65awJSHfdPO1NDONOK+	+S7Y0VXUgoYYrBV4Y7YbC8wg/nqcimr3lm3tRyp+QsgKzdREbfNRk0F5PLyLfsUE	lepjs1QdV3fEV1LJtiywA3ubVNQJRxhbYxa/C/Xy2qxpm6vvdL92l3q1ccev35Ic	aOiSx7Im+/GxV2lVKdaOvYVGDD1zBRe6Y2CwQb9p088l3/93qGR5593NCiuPPWcs	DWwUShM1EyW0FNX1F8bnzHnYijoyE/jf4s/l9bBd7yJdRWRCyih2WcypAiOIEkBs	H+dCTgalu8sRDoMh4ZIBBdgHfoZUycLqReQFLZZ4Sl4zSmzt5vQxQFhEKb9+ff/4	rb1KAo6wifengxVfIsa2b5ljXzAqXs7JkPvmC6fa7X4ZZndRokaxYlu3cg8OV+uG	/6YAHZilo8at0OpkkNdNFuhwuGlkBqrZKNUj/gSiYYc06gF/r/z6iWAjpXJRW1qq	3CLZXdZFZ/VrqXeVjtOA]u2A=	> but was:<[AAD0APSDg80rzSsFBS90L3S4uIgCiAKenpy3nLc9PXZKdkokJCY4Jjhray1bLVsm	Ji9IL0j3956+nr7n58OGw4a8vNrC2sLOzrm+ub6MjKQqpCo2NsiPyI99fdhZ2Fk2	Nr3EvcQODtz83PxRUfKl8qVnZyWtJa2YmFDuUO6Jid9z33NyckT3RPdwcEnlSeX0	9PhH+Efc3MARwBHY2NuP248tLWG/Yb+Ghlg2WDZxcRPhE+FiYl5cXlzCwsn/yf+a	mn6ofqgaGlOwU7D6+l6lXqVvbwM1AzVWVjLVMtXNzTb/Nv9cXDILMgvp6SADIAOg	oK9Fr0VHR31xfXEqKv+W/5bf3zwAPABHR2xNbE1eXgYwBjApKfX49fhMTC4CLgIm	Jh2KHYr8/G7Obs5/f5wsnCzPzyraKto3N7CqsKpSUjnaOdrT0/0n/SewsKzyrPL6	+obvhu9bWzr5OvlgYAQsBCyrq+b95v1KSi+/L78mJo6Ljovj450xnTFHR+ND40NC	QkuIS4i5uQe7B7uqqn07fTsFBSC9IL0KCqIMogysrMS/xL/w8C6CLoKNjR1MHUz2	9nNgc2BhYTIIMgj+/kZWRla5uV7dXt0EBB2BHYHIyIgeiB56el13XXeFhVRMVEzx	8ZFRkVG1td4p3im4uH75fvlNTd9s32ySkieDJ4P7+xBcEFzNzchgyGAcHIxnjGe8	vG30bfR1dZLUktS1tRxFHEXU1Ds+Oz68vCf8J/yJiVBbUFsTE4x6jHqvr4pkimSU	lKgCqAL4+Ja1lrXb2x6tHq18fIdsh2yBgRr/Gv/4+GavZq+Kin+Pf4/NzSTSJNIP	D2rfat+YmGrVatWsrIYzhjPf33zgfOACAtNJ00mmpnxZfFns7IVthW2cnHULdQsQ	EL9Cv0KKip/3n/dlZQf/B/8pKUFGQUZ0dIk2iTZ+fixLLEtKShreGt7l5Rs2Gzbz	86emp6ZAQHgPeA/V1XtSe1Lf31q2WrYpKcImwia8vD7CPsIiIlwyXDJfX72SvZKd	nbnUudSFhTEEMQRgYDhxOHFMTGHRYdHm5rGTsZNzc4Nag1p8fAj3CPeRkSS2JLZl	ZY4rjisAAJI/kj9MTGNbY1sCAgzEDMQ4OPKD8oMAAAblBuUfHx+TH5PR0f1t/W1Y	WLW2tbYTExq+Gr5ubicNJw3Ozi9oL2ja2hITEhNUVGdkZ2TW1jBuMG4lJRWVFZVT	U8z0zPRHRyW8JbyVlZNZk1ne3qKBooFnZ4DQgNDMzEcARwAPDyI4IjjOzlWeVZ5q	aqn9qf1hYYztjO1AQOrn6ufa2sEhwSHT01AKUAqHh5MlkyWgoCQSJBLQ0C4sLiy+	vnOic6IDA5rlmuXv74zNjM1YWO8H7weTkxhCGEJTU6VppWmkpO1C7UK0tEClQKV2	drlnuWeFhV8RXxGpqe717vVCQrZ+tn4tLVPyU/IyMk8UTxQtLY+Zj5l3d5vGm8ad	nRucG5zv75VblVvm5uDI4MhHR0giSCJCQhAJEAmmpmrUatTCwpYLlgtycq6Irojk	5L0EvQSdnW3sbezt7QDYANiSkokqiSr6+gThBOFDQ26Xbpc1NXZMdkxgYIL4gvig	oCeaJ5o0NGpAakAaGpeUl5SZmaCMoIx0dACgAKBzc1koWSjp6Zr+mv7i4hA6EDrL	y98O3w56eqJxonGHh0OZQ5n8/IJigmLl5Xz0fPR4eMDUwNR/fy2ILYgyMnzlfOVX	V+ys7KxRUd1x3XGzs8CgwKDQ0KmLqYuurlrAWsCUlId9h33T087UztTQ0M40zjTi	4r75vvkuLtjR2NFVVdSC1IKGhhisGKwVFXhjeGO2thsLGwvMzCD+IP56epyKnIpq	aveW95Ztbe1H7UcqKn5CfkLIyArNCs3U1ERtRG3z81GTUZNBQXk8eTy8vIt+i37F	xQSVBJXq6mOzY7NUVB1XHVd3d8RXxFdSUsm2ybYsLLADsAN7e5tUm1TU1AlHCUcY	GFtjW2MWFr8Lvwv19fLa8tqsrGmbaZurq+9073S/v3aXdpd6erVxtXHHx6/fr9+S	khxoHGjo6JLHkseysib7Jvvx8bFXsVdpaVUpVSnW1o69jr2FhUYMRgw9PXMFcwUX	F7pjumNgYLBBsEG/v2nTadPPzyXfJd///3eod6hkZHnneefd3c0KzQorK489jz1n	ZywNLA1sbBRKFEoTEzUTNRMlJbQUtBTV1fUX9RfGxufM58x5ediK2Io6OjITMhP4	+N/i3+LPz+X15fWwsF3vXe8iIl1FXUVkZELKQsooKHZZdlnMzKkCqQIjI4gSiBJA	QGwfbB/n50JOQk4GBqW7pbvLyxEOEQ6DgyHhIeGSkgEFAQXY2Ad+B36GhlTJVMnC	wupF6kXk5AUtBS2WlnhKeEpeXjNKM0psbO3m7eb09DFAMUBYWEQpRCm/v359fn3/	//it+K29vUoCSgKOjrCJsIn396eDp4MVFV8iXyLGxrZvtm+ZmWNfY18wMCpeKl7O	zsmQyZD7++YL5gunp9rt2u1+fhlmGWZ3d1GiUaJGRrFisWJbW7dyt3IPDw5XDlfr	64b/hv+mpgAdAB2YmKWjpaPGxq3QrdDq6mSQZJDX100WTRbo6HC4cLhpaWQGZAaq	qtko2SjV1SP+I/4EBKJhomGHhzTqNOoBAX+vf6/8/PqJ+olgYCOlI6VyclFbUVta	WqrcqtwiItld2V3W1kVnRWf19Wupa6l3d5WOlY7T04C7gLtg]u2A=	>
	at org.junit.Assert.assertEquals(Assert.java:115)
	at org.apache.commons.codec.binary.Base64Test.testConstructor_Int_ByteArray_Boolean(Base64Test.java:250)

testByteToStringVariations(org.apache.commons.codec.binary.Base64Test)  Time elapsed: 0 sec  <<< FAILURE!
org.junit.ComparisonFailure: byteToString Hello World expected:<[SGVsbG8gV29y]bGQ=> but was:<[AABIAEhlZWxsbGxvbyBXIFdvb3Jscmxk]bGQ=>
	at org.junit.Assert.assertEquals(Assert.java:115)
	at org.apache.commons.codec.binary.Base64Test.testByteToStringVariations(Base64Test.java:1197)

testObjectEncodeWithValidParameter(org.apache.commons.codec.binary.Base64Test)  Time elapsed: 0 sec  <<< FAILURE!
org.junit.ComparisonFailure: dest string does not equal original expected:<[Hello World!]> but was:<[  H Heelllloo W Woorlrld]>
	at org.junit.Assert.assertEquals(Assert.java:115)
	at org.apache.commons.codec.binary.Base64Test.testObjectEncodeWithValidParameter(Base64Test.java:536)

testRfc4648Section10Encode(org.apache.commons.codec.binary.Base64Test)  Time elapsed: 0 sec  <<< FAILURE!
org.junit.ComparisonFailure: expected:<[]Zg==> but was:<[AABm]Zg==>
	at org.junit.Assert.assertEquals(Assert.java:115)
	at org.junit.Assert.assertEquals(Assert.java:144)
	at org.apache.commons.codec.binary.Base64Test.testRfc4648Section10Encode(Base64Test.java:646)

testRfc4648Section10EncodeDecode(org.apache.commons.codec.binary.Base64Test)  Time elapsed: 0.001 sec  <<< FAILURE!
org.junit.ComparisonFailure: expected:<[]f> but was:<[  f]f>
	at org.junit.Assert.assertEquals(Assert.java:115)
	at org.junit.Assert.assertEquals(Assert.java:144)
	at org.apache.commons.codec.binary.Base64Test.testEncodeDecode(Base64Test.java:713)
	at org.apache.commons.codec.binary.Base64Test.testRfc4648Section10EncodeDecode(Base64Test.java:702)

Running org.apache.commons.codec.binary.HexTest
Tests run: 19, Failures: 0, Errors: 0, Skipped: 0, Time elapsed: 0.164 sec - in org.apache.commons.codec.binary.HexTest
Running org.apache.commons.codec.DecoderExceptionTest
Tests run: 4, Failures: 0, Errors: 0, Skipped: 0, Time elapsed: 0 sec - in org.apache.commons.codec.DecoderExceptionTest
Running org.apache.commons.codec.EncoderExceptionTest
Tests run: 4, Failures: 0, Errors: 0, Skipped: 0, Time elapsed: 0.001 sec - in org.apache.commons.codec.EncoderExceptionTest
Running org.apache.commons.codec.net.BCodecTest
Tests run: 9, Failures: 3, Errors: 0, Skipped: 0, Time elapsed: 0.006 sec <<< FAILURE! - in org.apache.commons.codec.net.BCodecTest
testUTF8RoundTrip(org.apache.commons.codec.net.BCodecTest)  Time elapsed: 0.002 sec  <<< FAILURE!
org.junit.ComparisonFailure: expected:<=?UTF-8?B?[0JLRgdC10Lxf0L/RgNC40LLQtdGC]?=> but was:<=?UTF-8?B?[AADQANCSktGB0YHQ0LXQtdC8vF/QX9C/v9GA0YDQ0LjQuNCystC10LXR]?=>
	at org.junit.Assert.assertEquals(Assert.java:115)
	at org.junit.Assert.assertEquals(Assert.java:144)
	at org.apache.commons.codec.net.BCodecTest.testUTF8RoundTrip(BCodecTest.java:69)

testBasicEncodeDecode(org.apache.commons.codec.net.BCodecTest)  Time elapsed: 0 sec  <<< FAILURE!
org.junit.ComparisonFailure: Basic B encoding test expected:<=?UTF-8?B?[SGVsbG8gdGh]lcmU=?=> but was:<=?UTF-8?B?[AABIAEhlZWxsbGxvbyB0IHRoaGVyZXJ]lcmU=?=>
	at org.junit.Assert.assertEquals(Assert.java:115)
	at org.apache.commons.codec.net.BCodecTest.testBasicEncodeDecode(BCodecTest.java:81)

testEncodeObjects(org.apache.commons.codec.net.BCodecTest)  Time elapsed: 0 sec  <<< FAILURE!
org.junit.ComparisonFailure: Basic B encoding test expected:<=?UTF-8?B?[d2hhdCBu]b3Q=?=> but was:<=?UTF-8?B?[AAB3AHdoaGF0YXQgIG5vbm90]b3Q=?=>
	at org.junit.Assert.assertEquals(Assert.java:115)
	at org.apache.commons.codec.net.BCodecTest.testEncodeObjects(BCodecTest.java:114)

Running org.apache.commons.codec.net.QCodecTest
Tests run: 12, Failures: 0, Errors: 0, Skipped: 0, Time elapsed: 0.006 sec - in org.apache.commons.codec.net.QCodecTest
Running org.apache.commons.codec.net.UtilsTest
Tests run: 1, Failures: 0, Errors: 0, Skipped: 0, Time elapsed: 0.001 sec - in org.apache.commons.codec.net.UtilsTest
Running org.apache.commons.codec.net.RFC1522CodecTest
Tests run: 2, Failures: 0, Errors: 0, Skipped: 0, Time elapsed: 0 sec - in org.apache.commons.codec.net.RFC1522CodecTest
Running org.apache.commons.codec.net.URLCodecTest
Tests run: 16, Failures: 0, Errors: 0, Skipped: 0, Time elapsed: 0.004 sec - in org.apache.commons.codec.net.URLCodecTest
Running org.apache.commons.codec.net.QuotedPrintableCodecTest
Tests run: 21, Failures: 0, Errors: 0, Skipped: 0, Time elapsed: 0.009 sec - in org.apache.commons.codec.net.QuotedPrintableCodecTest
Running org.apache.commons.codec.StringEncoderComparatorTest
Tests run: 3, Failures: 0, Errors: 0, Skipped: 0, Time elapsed: 0.007 sec - in org.apache.commons.codec.StringEncoderComparatorTest
Running org.apache.commons.codec.language.Caverphone1Test
Tests run: 9, Failures: 0, Errors: 0, Skipped: 0, Time elapsed: 0.024 sec - in org.apache.commons.codec.language.Caverphone1Test
Running org.apache.commons.codec.language.NysiisTest
Tests run: 23, Failures: 0, Errors: 0, Skipped: 0, Time elapsed: 0.022 sec - in org.apache.commons.codec.language.NysiisTest
Running org.apache.commons.codec.language.Caverphone2Test
Tests run: 13, Failures: 0, Errors: 0, Skipped: 0, Time elapsed: 0.142 sec - in org.apache.commons.codec.language.Caverphone2Test
Running org.apache.commons.codec.language.DaitchMokotoffSoundexTest
Tests run: 13, Failures: 0, Errors: 0, Skipped: 0, Time elapsed: 0.054 sec - in org.apache.commons.codec.language.DaitchMokotoffSoundexTest
Running org.apache.commons.codec.language.bm.BeiderMorseEncoderTest
Tests run: 22, Failures: 0, Errors: 0, Skipped: 0, Time elapsed: 3.014 sec - in org.apache.commons.codec.language.bm.BeiderMorseEncoderTest
Running org.apache.commons.codec.language.bm.PhoneticEngineTest
Tests run: 8, Failures: 0, Errors: 0, Skipped: 0, Time elapsed: 0.019 sec - in org.apache.commons.codec.language.bm.PhoneticEngineTest
Running org.apache.commons.codec.language.bm.PhoneticEngineRegressionTest
Tests run: 4, Failures: 0, Errors: 0, Skipped: 0, Time elapsed: 0.015 sec - in org.apache.commons.codec.language.bm.PhoneticEngineRegressionTest
Running org.apache.commons.codec.language.bm.RuleTest
Tests run: 3, Failures: 0, Errors: 0, Skipped: 0, Time elapsed: 0.002 sec - in org.apache.commons.codec.language.bm.RuleTest
Running org.apache.commons.codec.language.bm.LanguageGuessingTest
Tests run: 18, Failures: 0, Errors: 0, Skipped: 0, Time elapsed: 0.011 sec - in org.apache.commons.codec.language.bm.LanguageGuessingTest
Running org.apache.commons.codec.language.DoubleMetaphoneTest
Tests run: 16, Failures: 0, Errors: 0, Skipped: 0, Time elapsed: 0.057 sec - in org.apache.commons.codec.language.DoubleMetaphoneTest
Running org.apache.commons.codec.language.SoundexTest
Tests run: 28, Failures: 0, Errors: 0, Skipped: 0, Time elapsed: 0.012 sec - in org.apache.commons.codec.language.SoundexTest
Running org.apache.commons.codec.language.RefinedSoundexTest
Tests run: 10, Failures: 0, Errors: 0, Skipped: 0, Time elapsed: 0.003 sec - in org.apache.commons.codec.language.RefinedSoundexTest
Running org.apache.commons.codec.language.MatchRatingApproachEncoderTest
Tests run: 96, Failures: 0, Errors: 0, Skipped: 0, Time elapsed: 0.035 sec - in org.apache.commons.codec.language.MatchRatingApproachEncoderTest
Running org.apache.commons.codec.language.ColognePhoneticTest
Tests run: 13, Failures: 0, Errors: 0, Skipped: 0, Time elapsed: 0.004 sec - in org.apache.commons.codec.language.ColognePhoneticTest
Running org.apache.commons.codec.language.DoubleMetaphone2Test
Tests run: 6, Failures: 0, Errors: 0, Skipped: 0, Time elapsed: 0.038 sec - in org.apache.commons.codec.language.DoubleMetaphone2Test
Running org.apache.commons.codec.language.MetaphoneTest
Tests run: 34, Failures: 0, Errors: 0, Skipped: 0, Time elapsed: 0.118 sec - in org.apache.commons.codec.language.MetaphoneTest
Running org.apache.commons.codec.CharEncodingTest
Tests run: 7, Failures: 0, Errors: 0, Skipped: 0, Time elapsed: 0.001 sec - in org.apache.commons.codec.CharEncodingTest

Results :

Failed tests: 
  Base64OutputStreamTest.testBase64OutputStreamByteByByte:144->testByteByByte:249 Streaming byte-by-byte base64 encode
  Base64OutputStreamTest.testBase64OutputStreamByChunk:106->testByChunk:197 Streaming chunked base64 encode
  Base64Codec13Test.testEncoder:372 Encoder test-1
  Base64Codec13Test.testBinaryEncoder:410 BinaryEncoder test-1
  Base64Codec13Test.testStaticEncodeChunked:483 static Base64.encodeBase64Chunked() test-1
  Base64Codec13Test.testStaticEncode:447 static Base64.encodeBase64() test-1
  Base64InputStreamTest.testBase64InputStreamByChunk:216->testByChunk:308 Streaming base64 encode
  Base64InputStreamTest.testCodec130:73 expected:<[ello Wor]ld> but was:<[ H Heelllloo W Woorlrld]ld>
  Base64InputStreamTest.testBase64InputStreamByteByByte:254->testByteByByte:362 EOF expected:<-1> but was:<66>
  Base64Test.testTriplets:940 expected:<AAAA[]> but was:<AAAA[AAAA]>
  Base64Test.testConstructor_Int_ByteArray_Boolean_UrlSafe:264 new Base64(64, \t, true) expected:<[AAD0APSDg80rzSsFBS90L3S4uIgCiAKenpy3nLc9PXZKdkokJCY4Jjhray1bLVsm	Ji9IL0j3956-nr7n58OGw4a8vNrC2sLOzrm-ub6MjKQqpCo2NsiPyI99fdhZ2Fk2	Nr3EvcQODtz83PxRUfKl8qVnZyWtJa2YmFDuUO6Jid9z33NyckT3RPdwcEnlSeX0	9PhH-Efc3MARwBHY2NuP248tLWG_Yb-Ghlg2WDZxcRPhE-FiYl5cXlzCwsn_yf-a	mn6ofqgaGlOwU7D6-l6lXqVvbwM1AzVWVjLVMtXNzTb_Nv9cXDILMgvp6SADIAOg	oK9Fr0VHR31xfXEqKv-W_5bf3zwAPABHR2xNbE1eXgYwBjApKfX49fhMTC4CLgIm	Jh2KHYr8_G7Obs5_f5wsnCzPzyraKto3N7CqsKpSUjnaOdrT0_0n_SewsKzyrPL6	-obvhu9bWzr5OvlgYAQsBCyrq-b95v1KSi-_L78mJo6Ljovj450xnTFHR-ND40NC	QkuIS4i5uQe7B7uqqn07fTsFBSC9IL0KCqIMogysrMS_xL_w8C6CLoKNjR1MHUz2	9nNgc2BhYTIIMgj-_kZWRla5uV7dXt0EBB2BHYHIyIgeiB56el13XXeFhVRMVEzx	8ZFRkVG1td4p3im4uH75fvlNTd9s32ySkieDJ4P7-xBcEFzNzchgyGAcHIxnjGe8	vG30bfR1dZLUktS1tRxFHEXU1Ds-Oz68vCf8J_yJiVBbUFsTE4x6jHqvr4pkimSU	lKgCqAL4-Ja1lrXb2x6tHq18fIdsh2yBgRr_Gv_4-GavZq-Kin-Pf4_NzSTSJNIP	D2rfat-YmGrVatWsrIYzhjPf33zgfOACAtNJ00mmpnxZfFns7IVthW2cnHULdQsQ	EL9Cv0KKip_3n_dlZQf_B_8pKUFGQUZ0dIk2iTZ-fixLLEtKShreGt7l5Rs2Gzbz	86emp6ZAQHgPeA_V1XtSe1Lf31q2WrYpKcImwia8vD7CPsIiIlwyXDJfX72SvZKd	nbnUudSFhTEEMQRgYDhxOHFMTGHRYdHm5rGTsZNzc4Nag1p8fAj3CPeRkSS2JLZl	ZY4rjisAAJI_kj9MTGNbY1sCAgzEDMQ4OPKD8oMAAAblBuUfHx-TH5PR0f1t_W1Y	WLW2tbYTExq-Gr5ubicNJw3Ozi9oL2ja2hITEhNUVGdkZ2TW1jBuMG4lJRWVFZVT	U8z0zPRHRyW8JbyVlZNZk1ne3qKBooFnZ4DQgNDMzEcARwAPDyI4IjjOzlWeVZ5q	aqn9qf1hYYztjO1AQOrn6ufa2sEhwSHT01AKUAqHh5MlkyWgoCQSJBLQ0C4sLiy-	vnOic6IDA5rlmuXv74zNjM1YWO8H7weTkxhCGEJTU6VppWmkpO1C7UK0tEClQKV2	drlnuWeFhV8RXxGpqe717vVCQrZ-tn4tLVPyU_IyMk8UTxQtLY-Zj5l3d5vGm8ad	nRucG5zv75VblVvm5uDI4MhHR0giSCJCQhAJEAmmpmrUatTCwpYLlgtycq6Irojk	5L0EvQSdnW3sbezt7QDYANiSkokqiSr6-gThBOFDQ26Xbpc1NXZMdkxgYIL4gvig	oCeaJ5o0NGpAakAaGpeUl5SZmaCMoIx0dACgAKBzc1koWSjp6Zr-mv7i4hA6EDrL	y98O3w56eqJxonGHh0OZQ5n8_IJigmLl5Xz0fPR4eMDUwNR_fy2ILYgyMnzlfOVX	V-ys7KxRUd1x3XGzs8CgwKDQ0KmLqYuurlrAWsCUlId9h33T087UztTQ0M40zjTi	4r75vvkuLtjR2NFVVdSC1IKGhhisGKwVFXhjeGO2thsLGwvMzCD-IP56epyKnIpq	aveW95Ztbe1H7UcqKn5CfkLIyArNCs3U1ERtRG3z81GTUZNBQXk8eTy8vIt-i37F	xQSVBJXq6mOzY7NUVB1XHVd3d8RXxFdSUsm2ybYsLLADsAN7e5tUm1TU1AlHCUcY	GFtjW2MWFr8Lvwv19fLa8tqsrGmbaZurq-9073S_v3aXdpd6erVxtXHHx6_fr9-S	khxoHGjo6JLHkseysib7Jvvx8bFXsVdpaVUpVSnW1o69jr2FhUYMRgw9PXMFcwUX	F7pjumNgYLBBsEG_v2nTadPPzyXfJd___3eod6hkZHnneefd3c0KzQorK489jz1n	ZywNLA1sbBRKFEoTEzUTNRMlJbQUtBTV1fUX9RfGxufM58x5ediK2Io6OjITMhP4	-N_i3-LPz-X15fWwsF3vXe8iIl1FXUVkZELKQsooKHZZdlnMzKkCqQIjI4gSiBJA	QGwfbB_n50JOQk4GBqW7pbvLyxEOEQ6DgyHhIeGSkgEFAQXY2Ad-B36GhlTJVMnC	wupF6kXk5AUtBS2WlnhKeEpeXjNKM0psbO3m7eb09DFAMUBYWEQpRCm_v359fn3_	__it-K29vUoCSgKOjrCJsIn396eDp4MVFV8iXyLGxrZvtm-ZmWNfY18wMCpeKl7O	zsmQyZD7--YL5gunp9rt2u1-fhlmGWZ3d1GiUaJGRrFisWJbW7dyt3IPDw5XDlfr	64b_hv-mpgAdAB2YmKWjpaPGxq3QrdDq6mSQZJDX100WTRbo6HC4cLhpaWQGZAaq	qtko2SjV1SP-I_4EBKJhomGHhzTqNOoBAX-vf6_8_PqJ-olgYCOlI6VyclFbUVta	WqrcqtwiItld2V3W1kVnRWf19Wupa6l3d5WOlY7T04C7gLtg]u2A	> but was:<[9IPNKwUvdLiIAp6ctz12SiQmOGstWyYvSPeevufDhrzaws65voykKjbIj33YWTa9	xA7c_FHypWclrZhQ7onfc3JE93BJ5fT4R9zAEdjbjy1hv4ZYNnET4WJeXMLJ_5p-	qBpTsPpepW8DNVYy1c02_1wyC-kgA6CvRUd9cSr_lt88AEdsTV4GMCn1-EwuAiYd	ivxuzn-cLM8q2jewqlI52tP9J7Cs8vqG71s6-WAELKvm_UovvyaOi-OdMUfjQ0JL	iLkHu6p9OwUgvQqiDKzEv_Augo0dTPZzYGEyCP5GVrle3QQdgciIHnpdd4VUTPGR	UbXeKbh--U3fbJIng_sQXM3IYByMZ7xt9HWS1LUcRdQ7Prwn_IlQWxOMeq-KZJSo	AviWtdserXyHbIEa__hmr4p_j80k0g9q35hq1ayGM9984ALTSaZ8WeyFbZx1CxC_	Qoqf92UH_ylBRnSJNn4sS0oa3uUbNvOnpkB4D9V7Ut9atinCJrw-wiJcMl-9kp25	1IUxBGA4cUxh0eaxk3ODWnwI95EktmWOKwCSP0xjWwIMxDjygwAG5R8fk9H9bVi1	thMavm4nDc4vaNoSE1RnZNYwbiUVlVPM9EclvJWTWd6igWeA0MxHAA8iOM5Vnmqp	_WGM7UDq59rBIdNQCoeTJaAkEtAuLL5zogOa5e-MzVjvB5MYQlOlaaTtQrRApXa5	Z4VfEanu9UK2fi1T8jJPFC2PmXebxp0bnO-VW-bgyEdIIkIQCaZq1MKWC3KuiOS9	BJ1t7O0A2JKJKvoE4UNulzV2TGCC-KAnmjRqQBqXlJmgjHQAoHNZKOma_uIQOsvf	DnqicYdDmfyCYuV89HjA1H8tiDJ85VfsrFHdcbPAoNCpi65awJSHfdPO1NDONOK-	-S7Y0VXUgoYYrBV4Y7YbC8wg_nqcimr3lm3tRyp-QsgKzdREbfNRk0F5PLyLfsUE	lepjs1QdV3fEV1LJtiywA3ubVNQJRxhbYxa_C_Xy2qxpm6vvdL92l3q1ccev35Ic	aOiSx7Im-_GxV2lVKdaOvYVGDD1zBRe6Y2CwQb9p088l3_93qGR5593NCiuPPWcs	DWwUShM1EyW0FNX1F8bnzHnYijoyE_jf4s_l9bBd7yJdRWRCyih2WcypAiOIEkBs	H-dCTgalu8sRDoMh4ZIBBdgHfoZUycLqReQFLZZ4Sl4zSmzt5vQxQFhEKb9-ff_4	rb1KAo6wifengxVfIsa2b5ljXzAqXs7JkPvmC6fa7X4ZZndRokaxYlu3cg8OV-uG	_6YAHZilo8at0OpkkNdNFuhwuGlkBqrZKNUj_gSiYYc06gF_r_z6iWAjpXJRW1qq	3CLZXdZFZ_VrqXeVjtOA]u2A	>
  Base64Test.testSingletonsChunked:831 expected:<AA[]==
> but was:<AA[AAAA]==
>
  Base64Test.testPairs:547 expected:<AAA[]=> but was:<AAA[AAAAAAAA]=>
  Base64Test.testUUID:1180 standard encode uuid
  Base64Test.testEncodeDecodeSmall:365 -60 equals 0,0,-60,-60
  Base64Test.testObjectDecodeWithValidParameter:511 dest string does not equal original expected:<[Hello World!]> but was:<[  H Heelllloo W Woorlrld]>
  Base64Test.testCodeInteger1:149 expected:<[li7dzDacuo67Jg7mtqEm2TRu]OMU=> but was:<[AACWAJYuLt3M3cw2Npy6nLqOjrsmuyYODua25rahoSbZJtk0NG44bjjF]OMU=>
  Base64Test.testCodeInteger2:158 expected:<[9B5ypLY9pMOmtxCeTDHgwdNF]eGs=> but was:<[AAD0APQeHnKkcqS2tj2kPaTDw6a3prcQEJ5MnkwxMeDB4MHT00V4RXhr]eGs=>
  Base64Test.testCodeInteger3:169 expected:<[FKIhdgaG5LGKiEtF1vHy4f3y700zaD6QwDS3IrNVGzNp2rY+1LFWTK6D44AyiC1n8uWz1itkYMZF0/aKDK0Y]jg==> but was:<[AAAUABSioiF2IXYGBobkhuSxsYqIiohLS0XWRdbx8fLh8uH9/fLv8u9NTTNoM2g+PpDAkMA0NLcityKzs1UbVRszM2naadq2tj7UPtSxsVZMVkyuroPjg+OAgDKIMogtLWfyZ/Ll5bPWs9YrK2RgZGDGxkXTRdP29ooMigytrRiO]jg==>
  Base64Test.testCodeInteger4:186 expected:<[ctA8YGxrtngg/zKVvqEOefnwmViFztcnPBYPlJsvh6yKI4iDm68fnp4Mi3RrJ6bZAygFrUIQLxLjV+OJtgJAEto0xAs+Mehuq1DkSFEpP3oDzCTOsrOiS1DwQe4oIb7zVk/9l7aPtJMHW0LVlMdwZNFNNJoqMcT2ZfCPrfvY]vQ0=> but was:<[AAByAHLQ0DxgPGBsbGu2a7Z4eCD/IP8yMpW+lb6hoQ55Dnn5+fCZ8JlYWIXOhc7X1yc8JzwWFg+UD5Sbmy+HL4esrIojiiOIiIObg5uvrx+eH56engyLDIt0dGsnayemptkD2QMoKAWtBa1CQhAvEC8SEuNX41fj44m2ibYCAkASQBLa2jTENMQLCz4xPjHo6G6rbqtQUORI5EhRUSk/KT96egPMA8wkJM6yzrKzs6JLoktQUPBB8EHu7ighKCG+vvNW81ZPT/2X/Ze2to+0j7STkwdbB1tCQtWU1ZTHx3BkcGTR0U00TTSamioxKjHExPZl9mXw8I+tj637+9i92L0N]vQ0=>
  Base64Test.testObjectEncode:542 expected:<[SGVsbG8gV29y]bGQ=> but was:<[AABIAEhlZWxsbGxvbyBXIFdvb3Jscmxk]bGQ=>
  Base64Test.testUrlSafe:1085 url-safe i=1
  Base64Test.testEncodeDecodeRandom:352 null
  Base64Test.testDecodeWithWhitespace:324 Dest string doesn't equal the original expected:<[I am a late night coder.]> but was:<[  I I  amam  a a llatatee n niighghtt c coodeder]>
  Base64Test.testKnownEncodings:446 expected:<[VGhlIHF1aWNrIGJyb3duIGZveCBqdW1wZWQgb3ZlciB0aGUgbGF6eSBkb2dz]Lg==> but was:<[AABUAFRoaGUgZSBxcXVpdWljY2sgayBiYnJvcm93d24gbiBmZm94b3ggIGp1anVtbXBlcGVkZCBvIG92dmVyZXIgIHRodGhlZSBsIGxhYXp5enkgIGRvZG9nZ3Mu]Lg==>
  Base64Test.testSingletons:718 expected:<AA[]==> but was:<AA[AAAA]==>
  Base64Test.testTripletsChunked:1008 expected:<AAAA[]
> but was:<AAAA[AAAA]
>
  Base64Test.testRfc4648Section10DecodeEncode:671->testDecodeEncode:682 expected:<[]Zg==> but was:<[AABm]Zg==>
  Base64Test.testChunkedEncodeMultipleOf76:132 chunkedEncodeMultipleOf76
  Base64Test.testBase64:84 encoding hello world expected:<[SGVsbG8gV29y]bGQ=> but was:<[AABIAEhlZWxsbGxvbyBXIFdvb3Jscmxk]bGQ=>
  Base64Test.testConstructor_Int_ByteArray_Boolean:250 new Base64(65, \t, false) expected:<[9IPNKwUvdLiIAp6ctz12SiQmOGstWyYvSPeevufDhrzaws65voykKjbIj33YWTa9	xA7c/FHypWclrZhQ7onfc3JE93BJ5fT4R9zAEdjbjy1hv4ZYNnET4WJeXMLJ/5p+	qBpTsPpepW8DNVYy1c02/1wyC+kgA6CvRUd9cSr/lt88AEdsTV4GMCn1+EwuAiYd	ivxuzn+cLM8q2jewqlI52tP9J7Cs8vqG71s6+WAELKvm/UovvyaOi+OdMUfjQ0JL	iLkHu6p9OwUgvQqiDKzEv/Augo0dTPZzYGEyCP5GVrle3QQdgciIHnpdd4VUTPGR	UbXeKbh++U3fbJIng/sQXM3IYByMZ7xt9HWS1LUcRdQ7Prwn/IlQWxOMeq+KZJSo	AviWtdserXyHbIEa//hmr4p/j80k0g9q35hq1ayGM9984ALTSaZ8WeyFbZx1CxC/	Qoqf92UH/ylBRnSJNn4sS0oa3uUbNvOnpkB4D9V7Ut9atinCJrw+wiJcMl+9kp25	1IUxBGA4cUxh0eaxk3ODWnwI95EktmWOKwCSP0xjWwIMxDjygwAG5R8fk9H9bVi1	thMavm4nDc4vaNoSE1RnZNYwbiUVlVPM9EclvJWTWd6igWeA0MxHAA8iOM5Vnmqp	/WGM7UDq59rBIdNQCoeTJaAkEtAuLL5zogOa5e+MzVjvB5MYQlOlaaTtQrRApXa5	Z4VfEanu9UK2fi1T8jJPFC2PmXebxp0bnO+VW+bgyEdIIkIQCaZq1MKWC3KuiOS9	BJ1t7O0A2JKJKvoE4UNulzV2TGCC+KAnmjRqQBqXlJmgjHQAoHNZKOma/uIQOsvf	DnqicYdDmfyCYuV89HjA1H8tiDJ85VfsrFHdcbPAoNCpi65awJSHfdPO1NDONOK+	+S7Y0VXUgoYYrBV4Y7YbC8wg/nqcimr3lm3tRyp+QsgKzdREbfNRk0F5PLyLfsUE	lepjs1QdV3fEV1LJtiywA3ubVNQJRxhbYxa/C/Xy2qxpm6vvdL92l3q1ccev35Ic	aOiSx7Im+/GxV2lVKdaOvYVGDD1zBRe6Y2CwQb9p088l3/93qGR5593NCiuPPWcs	DWwUShM1EyW0FNX1F8bnzHnYijoyE/jf4s/l9bBd7yJdRWRCyih2WcypAiOIEkBs	H+dCTgalu8sRDoMh4ZIBBdgHfoZUycLqReQFLZZ4Sl4zSmzt5vQxQFhEKb9+ff/4	rb1KAo6wifengxVfIsa2b5ljXzAqXs7JkPvmC6fa7X4ZZndRokaxYlu3cg8OV+uG	/6YAHZilo8at0OpkkNdNFuhwuGlkBqrZKNUj/gSiYYc06gF/r/z6iWAjpXJRW1qq	3CLZXdZFZ/VrqXeVjtOA]u2A=	> but was:<[AAD0APSDg80rzSsFBS90L3S4uIgCiAKenpy3nLc9PXZKdkokJCY4Jjhray1bLVsm	Ji9IL0j3956+nr7n58OGw4a8vNrC2sLOzrm+ub6MjKQqpCo2NsiPyI99fdhZ2Fk2	Nr3EvcQODtz83PxRUfKl8qVnZyWtJa2YmFDuUO6Jid9z33NyckT3RPdwcEnlSeX0	9PhH+Efc3MARwBHY2NuP248tLWG/Yb+Ghlg2WDZxcRPhE+FiYl5cXlzCwsn/yf+a	mn6ofqgaGlOwU7D6+l6lXqVvbwM1AzVWVjLVMtXNzTb/Nv9cXDILMgvp6SADIAOg	oK9Fr0VHR31xfXEqKv+W/5bf3zwAPABHR2xNbE1eXgYwBjApKfX49fhMTC4CLgIm	Jh2KHYr8/G7Obs5/f5wsnCzPzyraKto3N7CqsKpSUjnaOdrT0/0n/SewsKzyrPL6	+obvhu9bWzr5OvlgYAQsBCyrq+b95v1KSi+/L78mJo6Ljovj450xnTFHR+ND40NC	QkuIS4i5uQe7B7uqqn07fTsFBSC9IL0KCqIMogysrMS/xL/w8C6CLoKNjR1MHUz2	9nNgc2BhYTIIMgj+/kZWRla5uV7dXt0EBB2BHYHIyIgeiB56el13XXeFhVRMVEzx	8ZFRkVG1td4p3im4uH75fvlNTd9s32ySkieDJ4P7+xBcEFzNzchgyGAcHIxnjGe8	vG30bfR1dZLUktS1tRxFHEXU1Ds+Oz68vCf8J/yJiVBbUFsTE4x6jHqvr4pkimSU	lKgCqAL4+Ja1lrXb2x6tHq18fIdsh2yBgRr/Gv/4+GavZq+Kin+Pf4/NzSTSJNIP	D2rfat+YmGrVatWsrIYzhjPf33zgfOACAtNJ00mmpnxZfFns7IVthW2cnHULdQsQ	EL9Cv0KKip/3n/dlZQf/B/8pKUFGQUZ0dIk2iTZ+fixLLEtKShreGt7l5Rs2Gzbz	86emp6ZAQHgPeA/V1XtSe1Lf31q2WrYpKcImwia8vD7CPsIiIlwyXDJfX72SvZKd	nbnUudSFhTEEMQRgYDhxOHFMTGHRYdHm5rGTsZNzc4Nag1p8fAj3CPeRkSS2JLZl	ZY4rjisAAJI/kj9MTGNbY1sCAgzEDMQ4OPKD8oMAAAblBuUfHx+TH5PR0f1t/W1Y	WLW2tbYTExq+Gr5ubicNJw3Ozi9oL2ja2hITEhNUVGdkZ2TW1jBuMG4lJRWVFZVT	U8z0zPRHRyW8JbyVlZNZk1ne3qKBooFnZ4DQgNDMzEcARwAPDyI4IjjOzlWeVZ5q	aqn9qf1hYYztjO1AQOrn6ufa2sEhwSHT01AKUAqHh5MlkyWgoCQSJBLQ0C4sLiy+	vnOic6IDA5rlmuXv74zNjM1YWO8H7weTkxhCGEJTU6VppWmkpO1C7UK0tEClQKV2	drlnuWeFhV8RXxGpqe717vVCQrZ+tn4tLVPyU/IyMk8UTxQtLY+Zj5l3d5vGm8ad	nRucG5zv75VblVvm5uDI4MhHR0giSCJCQhAJEAmmpmrUatTCwpYLlgtycq6Irojk	5L0EvQSdnW3sbezt7QDYANiSkokqiSr6+gThBOFDQ26Xbpc1NXZMdkxgYIL4gvig	oCeaJ5o0NGpAakAaGpeUl5SZmaCMoIx0dACgAKBzc1koWSjp6Zr+mv7i4hA6EDrL	y98O3w56eqJxonGHh0OZQ5n8/IJigmLl5Xz0fPR4eMDUwNR/fy2ILYgyMnzlfOVX	V+ys7KxRUd1x3XGzs8CgwKDQ0KmLqYuurlrAWsCUlId9h33T087UztTQ0M40zjTi	4r75vvkuLtjR2NFVVdSC1IKGhhisGKwVFXhjeGO2thsLGwvMzCD+IP56epyKnIpq	aveW95Ztbe1H7UcqKn5CfkLIyArNCs3U1ERtRG3z81GTUZNBQXk8eTy8vIt+i37F	xQSVBJXq6mOzY7NUVB1XHVd3d8RXxFdSUsm2ybYsLLADsAN7e5tUm1TU1AlHCUcY	GFtjW2MWFr8Lvwv19fLa8tqsrGmbaZurq+9073S/v3aXdpd6erVxtXHHx6/fr9+S	khxoHGjo6JLHkseysib7Jvvx8bFXsVdpaVUpVSnW1o69jr2FhUYMRgw9PXMFcwUX	F7pjumNgYLBBsEG/v2nTadPPzyXfJd///3eod6hkZHnneefd3c0KzQorK489jz1n	ZywNLA1sbBRKFEoTEzUTNRMlJbQUtBTV1fUX9RfGxufM58x5ediK2Io6OjITMhP4	+N/i3+LPz+X15fWwsF3vXe8iIl1FXUVkZELKQsooKHZZdlnMzKkCqQIjI4gSiBJA	QGwfbB/n50JOQk4GBqW7pbvLyxEOEQ6DgyHhIeGSkgEFAQXY2Ad+B36GhlTJVMnC	wupF6kXk5AUtBS2WlnhKeEpeXjNKM0psbO3m7eb09DFAMUBYWEQpRCm/v359fn3/	//it+K29vUoCSgKOjrCJsIn396eDp4MVFV8iXyLGxrZvtm+ZmWNfY18wMCpeKl7O	zsmQyZD7++YL5gunp9rt2u1+fhlmGWZ3d1GiUaJGRrFisWJbW7dyt3IPDw5XDlfr	64b/hv+mpgAdAB2YmKWjpaPGxq3QrdDq6mSQZJDX100WTRbo6HC4cLhpaWQGZAaq	qtko2SjV1SP+I/4EBKJhomGHhzTqNOoBAX+vf6/8/PqJ+olgYCOlI6VyclFbUVta	WqrcqtwiItld2V3W1kVnRWf19Wupa6l3d5WOlY7T04C7gLtg]u2A=	>
  Base64Test.testByteToStringVariations:1197 byteToString Hello World expected:<[SGVsbG8gV29y]bGQ=> but was:<[AABIAEhlZWxsbGxvbyBXIFdvb3Jscmxk]bGQ=>
  Base64Test.testObjectEncodeWithValidParameter:536 dest string does not equal original expected:<[Hello World!]> but was:<[  H Heelllloo W Woorlrld]>
  Base64Test.testRfc4648Section10Encode:646 expected:<[]Zg==> but was:<[AABm]Zg==>
  Base64Test.testRfc4648Section10EncodeDecode:702->testEncodeDecode:713 expected:<[]f> but was:<[  f]f>
  BCodecTest.testUTF8RoundTrip:69 expected:<=?UTF-8?B?[0JLRgdC10Lxf0L/RgNC40LLQtdGC]?=> but was:<=?UTF-8?B?[AADQANCSktGB0YHQ0LXQtdC8vF/QX9C/v9GA0YDQ0LjQuNCystC10LXR]?=>
  BCodecTest.testBasicEncodeDecode:81 Basic B encoding test expected:<=?UTF-8?B?[SGVsbG8gdGh]lcmU=?=> but was:<=?UTF-8?B?[AABIAEhlZWxsbGxvbyB0IHRoaGVyZXJ]lcmU=?=>
  BCodecTest.testEncodeObjects:114 Basic B encoding test expected:<=?UTF-8?B?[d2hhdCBu]b3Q=?=> but was:<=?UTF-8?B?[AAB3AHdoaGF0YXQgIG5vbm90]b3Q=?=>

Tests run: 662, Failures: 38, Errors: 0, Skipped: 1

[INFO] ------------------------------------------------------------------------
[INFO] BUILD FAILURE
[INFO] ------------------------------------------------------------------------
[INFO] Total time: 13.522s
[INFO] Finished at: Sun Aug 02 07:02:09 BST 2015
[INFO] Final Memory: 20M/344M
[INFO] ------------------------------------------------------------------------
[ERROR] Failed to execute goal org.apache.maven.plugins:maven-surefire-plugin:2.17:test (default-test) on project commons-codec: There are test failures.
[ERROR] 
[ERROR] Please refer to /home/perham/Study/LittleDarwin/Cases/commons-codec-1.10-src/target/surefire-reports for the individual test results.
[ERROR] -> [Help 1]
[ERROR] 
[ERROR] To see the full stack trace of the errors, re-run Maven with the -e switch.
[ERROR] Re-run Maven using the -X switch to enable full debug logging.
[ERROR] 
[ERROR] For more information about the errors and possible solutions, please read the following articles:
[ERROR] [Help 1] http://cwiki.apache.org/confluence/display/MAVEN/MojoFailureException
