[INFO] Scanning for projects...
[INFO]                                                                         
[INFO] ------------------------------------------------------------------------
[INFO] Building Apache Commons Codec 1.10
[INFO] ------------------------------------------------------------------------
[INFO] 
[INFO] --- maven-enforcer-plugin:1.3.1:enforce (enforce-maven-3) @ commons-codec ---
[INFO] 
[INFO] --- maven-antrun-plugin:1.7:run (javadoc.resources) @ commons-codec ---
[INFO] Executing tasks

main:
[INFO] Executed tasks
[INFO] 
[INFO] --- maven-remote-resources-plugin:1.5:process (default) @ commons-codec ---
[INFO] 
[INFO] --- buildnumber-maven-plugin:1.3:create (default) @ commons-codec ---
[INFO] Executing: /bin/sh -c cd /home/perham/Study/LittleDarwin/Cases/commons-codec-1.10-src && svn --non-interactive info
[INFO] Working directory: /home/perham/Study/LittleDarwin/Cases/commons-codec-1.10-src
[INFO] Storing buildNumber: ?????? at timestamp: 1438495212204
[INFO] Executing: /bin/sh -c cd /home/perham/Study/LittleDarwin/Cases/commons-codec-1.10-src && svn --non-interactive info
[INFO] Working directory: /home/perham/Study/LittleDarwin/Cases/commons-codec-1.10-src
[INFO] Storing buildScmBranch: UNKNOWN_BRANCH
[INFO] 
[INFO] --- maven-resources-plugin:2.7:resources (default-resources) @ commons-codec ---
[INFO] Using 'UTF-8' encoding to copy filtered resources.
[INFO] Copying 128 resources
[INFO] Copying 2 resources to META-INF
[INFO] 
[INFO] --- maven-compiler-plugin:3.2:compile (default-compile) @ commons-codec ---
[INFO] Changes detected - recompiling the module!
[INFO] Compiling 60 source files to /home/perham/Study/LittleDarwin/Cases/commons-codec-1.10-src/target/classes
[INFO] /home/perham/Study/LittleDarwin/Cases/commons-codec-1.10-src/src/main/java/org/apache/commons/codec/digest/Sha2Crypt.java: Some input files use or override a deprecated API.
[INFO] /home/perham/Study/LittleDarwin/Cases/commons-codec-1.10-src/src/main/java/org/apache/commons/codec/digest/Sha2Crypt.java: Recompile with -Xlint:deprecation for details.
[INFO] 
[INFO] --- maven-bundle-plugin:2.5.3:manifest (bundle-manifest) @ commons-codec ---
[INFO] 
[INFO] --- maven-resources-plugin:2.7:testResources (default-testResources) @ commons-codec ---
[INFO] Using 'UTF-8' encoding to copy filtered resources.
[INFO] skip non existing resourceDirectory /home/perham/Study/LittleDarwin/Cases/commons-codec-1.10-src/src/test/resources
[INFO] Copying 2 resources to META-INF
[INFO] 
[INFO] --- maven-compiler-plugin:3.2:testCompile (default-testCompile) @ commons-codec ---
[INFO] Nothing to compile - all classes are up to date
[INFO] 
[INFO] --- maven-surefire-plugin:2.17:test (default-test) @ commons-codec ---
[INFO] Surefire report directory: /home/perham/Study/LittleDarwin/Cases/commons-codec-1.10-src/target/surefire-reports

-------------------------------------------------------
 T E S T S
-------------------------------------------------------
Running org.apache.commons.codec.digest.B64Test
Tests run: 2, Failures: 0, Errors: 0, Skipped: 0, Time elapsed: 0.028 sec - in org.apache.commons.codec.digest.B64Test
Running org.apache.commons.codec.digest.DigestUtilsTest
Tests run: 17, Failures: 0, Errors: 0, Skipped: 0, Time elapsed: 0.641 sec - in org.apache.commons.codec.digest.DigestUtilsTest
Running org.apache.commons.codec.digest.Sha512CryptTest
Tests run: 8, Failures: 0, Errors: 0, Skipped: 0, Time elapsed: 0.534 sec - in org.apache.commons.codec.digest.Sha512CryptTest
Running org.apache.commons.codec.digest.Apr1CryptTest
Tests run: 8, Failures: 0, Errors: 0, Skipped: 0, Time elapsed: 0.072 sec - in org.apache.commons.codec.digest.Apr1CryptTest
Running org.apache.commons.codec.digest.HmacUtilsTest
Tests run: 24, Failures: 0, Errors: 0, Skipped: 0, Time elapsed: 0.045 sec - in org.apache.commons.codec.digest.HmacUtilsTest
Running org.apache.commons.codec.digest.Sha2CryptTest
Tests run: 1, Failures: 0, Errors: 0, Skipped: 0, Time elapsed: 0 sec - in org.apache.commons.codec.digest.Sha2CryptTest
Running org.apache.commons.codec.digest.CryptTest
Tests run: 4, Failures: 0, Errors: 0, Skipped: 0, Time elapsed: 0.075 sec - in org.apache.commons.codec.digest.CryptTest
Running org.apache.commons.codec.digest.Sha256CryptTest
Tests run: 7, Failures: 0, Errors: 0, Skipped: 0, Time elapsed: 0.104 sec - in org.apache.commons.codec.digest.Sha256CryptTest
Running org.apache.commons.codec.digest.Md5CryptTest
Tests run: 7, Failures: 0, Errors: 0, Skipped: 0, Time elapsed: 0.018 sec - in org.apache.commons.codec.digest.Md5CryptTest
Running org.apache.commons.codec.digest.UnixCryptTest
Tests run: 9, Failures: 0, Errors: 0, Skipped: 0, Time elapsed: 0.009 sec - in org.apache.commons.codec.digest.UnixCryptTest
Running org.apache.commons.codec.CharsetsTest
Tests run: 7, Failures: 0, Errors: 0, Skipped: 0, Time elapsed: 0.001 sec - in org.apache.commons.codec.CharsetsTest
Running org.apache.commons.codec.binary.Base32Test
Tests run: 8, Failures: 0, Errors: 0, Skipped: 0, Time elapsed: 0.006 sec - in org.apache.commons.codec.binary.Base32Test
Running org.apache.commons.codec.binary.Base64OutputStreamTest
Tests run: 7, Failures: 0, Errors: 5, Skipped: 0, Time elapsed: 0.012 sec <<< FAILURE! - in org.apache.commons.codec.binary.Base64OutputStreamTest
testCodec98NPE(org.apache.commons.codec.binary.Base64OutputStreamTest)  Time elapsed: 0.01 sec  <<< ERROR!
java.lang.ArrayIndexOutOfBoundsException: 1
	at org.apache.commons.codec.binary.Base64.decode(Base64.java:80)
	at org.apache.commons.codec.binary.BaseNCodecOutputStream.close(BaseNCodecOutputStream.java:147)
	at org.apache.commons.codec.binary.Base64OutputStreamTest.testCodec98NPE(Base64OutputStreamTest.java:56)

testBase64OutputStreamByteByByte(org.apache.commons.codec.binary.Base64OutputStreamTest)  Time elapsed: 0 sec  <<< ERROR!
java.lang.ArrayIndexOutOfBoundsException: 1
	at org.apache.commons.codec.binary.Base64.decode(Base64.java:80)
	at org.apache.commons.codec.binary.BaseNCodecOutputStream.close(BaseNCodecOutputStream.java:147)
	at org.apache.commons.codec.binary.Base64OutputStreamTest.testByteByByte(Base64OutputStreamTest.java:257)
	at org.apache.commons.codec.binary.Base64OutputStreamTest.testBase64OutputStreamByteByByte(Base64OutputStreamTest.java:144)

testBase64EmptyOutputStreamMimeChunkSize(org.apache.commons.codec.binary.Base64OutputStreamTest)  Time elapsed: 0 sec  <<< ERROR!
java.lang.ArrayIndexOutOfBoundsException: 1
	at org.apache.commons.codec.binary.Base64.decode(Base64.java:80)
	at org.apache.commons.codec.binary.BaseNCodecOutputStream.close(BaseNCodecOutputStream.java:147)
	at org.apache.commons.codec.binary.Base64OutputStreamTest.testByteByByte(Base64OutputStreamTest.java:257)
	at org.apache.commons.codec.binary.Base64OutputStreamTest.testBase64EmptyOutputStream(Base64OutputStreamTest.java:91)
	at org.apache.commons.codec.binary.Base64OutputStreamTest.testBase64EmptyOutputStreamMimeChunkSize(Base64OutputStreamTest.java:74)

testBase64EmptyOutputStreamPemChunkSize(org.apache.commons.codec.binary.Base64OutputStreamTest)  Time elapsed: 0 sec  <<< ERROR!
java.lang.ArrayIndexOutOfBoundsException: 1
	at org.apache.commons.codec.binary.Base64.decode(Base64.java:80)
	at org.apache.commons.codec.binary.BaseNCodecOutputStream.close(BaseNCodecOutputStream.java:147)
	at org.apache.commons.codec.binary.Base64OutputStreamTest.testByteByByte(Base64OutputStreamTest.java:257)
	at org.apache.commons.codec.binary.Base64OutputStreamTest.testBase64EmptyOutputStream(Base64OutputStreamTest.java:91)
	at org.apache.commons.codec.binary.Base64OutputStreamTest.testBase64EmptyOutputStreamPemChunkSize(Base64OutputStreamTest.java:85)

testBase64OutputStreamByChunk(org.apache.commons.codec.binary.Base64OutputStreamTest)  Time elapsed: 0.001 sec  <<< ERROR!
java.lang.ArrayIndexOutOfBoundsException: 1
	at org.apache.commons.codec.binary.Base64.decode(Base64.java:80)
	at org.apache.commons.codec.binary.BaseNCodecOutputStream.close(BaseNCodecOutputStream.java:147)
	at org.apache.commons.codec.binary.Base64OutputStreamTest.testByChunk(Base64OutputStreamTest.java:203)
	at org.apache.commons.codec.binary.Base64OutputStreamTest.testBase64OutputStreamByChunk(Base64OutputStreamTest.java:106)

Running org.apache.commons.codec.binary.Base64Codec13Test
Tests run: 8, Failures: 0, Errors: 4, Skipped: 0, Time elapsed: 0.016 sec <<< FAILURE! - in org.apache.commons.codec.binary.Base64Codec13Test
testDecoder(org.apache.commons.codec.binary.Base64Codec13Test)  Time elapsed: 0 sec  <<< ERROR!
java.lang.ArrayIndexOutOfBoundsException: 4
	at org.apache.commons.codec.binary.Base64.decode(Base64.java:80)
	at org.apache.commons.codec.binary.BaseNCodec.decode(BaseNCodec.java:411)
	at org.apache.commons.codec.binary.BaseNCodec.decode(BaseNCodec.java:378)
	at org.apache.commons.codec.binary.Base64Codec13Test.testDecoder(Base64Codec13Test.java:390)

testBinaryDecoder(org.apache.commons.codec.binary.Base64Codec13Test)  Time elapsed: 0.001 sec  <<< ERROR!
java.lang.ArrayIndexOutOfBoundsException: 4
	at org.apache.commons.codec.binary.Base64.decode(Base64.java:80)
	at org.apache.commons.codec.binary.BaseNCodec.decode(BaseNCodec.java:411)
	at org.apache.commons.codec.binary.Base64Codec13Test.testBinaryDecoder(Base64Codec13Test.java:428)

testStaticDecodeChunked(org.apache.commons.codec.binary.Base64Codec13Test)  Time elapsed: 0 sec  <<< ERROR!
java.lang.ArrayIndexOutOfBoundsException: 6
	at org.apache.commons.codec.binary.Base64.decode(Base64.java:80)
	at org.apache.commons.codec.binary.BaseNCodec.decode(BaseNCodec.java:411)
	at org.apache.commons.codec.binary.Base64.decodeBase64(Base64.java:119)
	at org.apache.commons.codec.binary.Base64Codec13Test.testStaticDecodeChunked(Base64Codec13Test.java:501)

testStaticDecode(org.apache.commons.codec.binary.Base64Codec13Test)  Time elapsed: 0.001 sec  <<< ERROR!
java.lang.ArrayIndexOutOfBoundsException: 4
	at org.apache.commons.codec.binary.Base64.decode(Base64.java:80)
	at org.apache.commons.codec.binary.BaseNCodec.decode(BaseNCodec.java:411)
	at org.apache.commons.codec.binary.Base64.decodeBase64(Base64.java:119)
	at org.apache.commons.codec.binary.Base64Codec13Test.testStaticDecode(Base64Codec13Test.java:464)

Running org.apache.commons.codec.binary.Base64InputStreamTest
Tests run: 19, Failures: 0, Errors: 13, Skipped: 0, Time elapsed: 0.015 sec <<< FAILURE! - in org.apache.commons.codec.binary.Base64InputStreamTest
testSkipToEnd(org.apache.commons.codec.binary.Base64InputStreamTest)  Time elapsed: 0.001 sec  <<< ERROR!
java.lang.ArrayIndexOutOfBoundsException: 8192
	at org.apache.commons.codec.binary.Base64.decode(Base64.java:80)
	at org.apache.commons.codec.binary.BaseNCodecInputStream.read(BaseNCodecInputStream.java:162)
	at org.apache.commons.codec.binary.BaseNCodecInputStream.skip(BaseNCodecInputStream.java:202)
	at org.apache.commons.codec.binary.Base64InputStreamTest.testSkipToEnd(Base64InputStreamTest.java:552)

testSkipNone(org.apache.commons.codec.binary.Base64InputStreamTest)  Time elapsed: 0.001 sec  <<< ERROR!
java.lang.ArrayIndexOutOfBoundsException: 8192
	at org.apache.commons.codec.binary.Base64.decode(Base64.java:80)
	at org.apache.commons.codec.binary.BaseNCodecInputStream.read(BaseNCodecInputStream.java:162)
	at org.apache.commons.codec.binary.Base64InputStreamTest.testSkipNone(Base64InputStreamTest.java:518)

testCodec98NPE(org.apache.commons.codec.binary.Base64InputStreamTest)  Time elapsed: 0.002 sec  <<< ERROR!
java.lang.ArrayIndexOutOfBoundsException: 8192
	at org.apache.commons.codec.binary.Base64.decode(Base64.java:80)
	at org.apache.commons.codec.binary.BaseNCodecInputStream.read(BaseNCodecInputStream.java:162)
	at org.apache.commons.codec.binary.Base64TestData.fill(Base64TestData.java:172)
	at org.apache.commons.codec.binary.Base64TestData.streamToBytes(Base64TestData.java:149)
	at org.apache.commons.codec.binary.Base64InputStreamTest.testCodec98NPE(Base64InputStreamTest.java:151)

testBase64InputStreamByChunk(org.apache.commons.codec.binary.Base64InputStreamTest)  Time elapsed: 0.001 sec  <<< ERROR!
java.lang.ArrayIndexOutOfBoundsException: 8192
	at org.apache.commons.codec.binary.Base64.decode(Base64.java:80)
	at org.apache.commons.codec.binary.BaseNCodecInputStream.read(BaseNCodecInputStream.java:162)
	at org.apache.commons.codec.binary.Base64TestData.fill(Base64TestData.java:172)
	at org.apache.commons.codec.binary.Base64TestData.streamToBytes(Base64TestData.java:149)
	at org.apache.commons.codec.binary.Base64TestData.streamToBytes(Base64TestData.java:144)
	at org.apache.commons.codec.binary.Base64InputStreamTest.testByChunk(Base64InputStreamTest.java:314)
	at org.apache.commons.codec.binary.Base64InputStreamTest.testBase64InputStreamByChunk(Base64InputStreamTest.java:216)

testInputStreamReader(org.apache.commons.codec.binary.Base64InputStreamTest)  Time elapsed: 0.001 sec  <<< ERROR!
java.lang.ArrayIndexOutOfBoundsException: 8192
	at org.apache.commons.codec.binary.Base64.decode(Base64.java:80)
	at org.apache.commons.codec.binary.BaseNCodecInputStream.read(BaseNCodecInputStream.java:162)
	at sun.nio.cs.StreamDecoder.readBytes(StreamDecoder.java:283)
	at sun.nio.cs.StreamDecoder.implRead(StreamDecoder.java:325)
	at sun.nio.cs.StreamDecoder.read(StreamDecoder.java:177)
	at java.io.InputStreamReader.read(InputStreamReader.java:184)
	at java.io.BufferedReader.fill(BufferedReader.java:154)
	at java.io.BufferedReader.readLine(BufferedReader.java:317)
	at java.io.BufferedReader.readLine(BufferedReader.java:382)
	at org.apache.commons.codec.binary.Base64InputStreamTest.testInputStreamReader(Base64InputStreamTest.java:133)

testCodec101(org.apache.commons.codec.binary.Base64InputStreamTest)  Time elapsed: 0.001 sec  <<< ERROR!
java.lang.ArrayIndexOutOfBoundsException: 8192
	at org.apache.commons.codec.binary.Base64.decode(Base64.java:80)
	at org.apache.commons.codec.binary.BaseNCodecInputStream.read(BaseNCodecInputStream.java:162)
	at java.io.FilterInputStream.read(FilterInputStream.java:107)
	at org.apache.commons.codec.binary.Base64InputStreamTest.testCodec101(Base64InputStreamTest.java:103)

testCodec130(org.apache.commons.codec.binary.Base64InputStreamTest)  Time elapsed: 0 sec  <<< ERROR!
java.lang.ArrayIndexOutOfBoundsException: null

testAvailable(org.apache.commons.codec.binary.Base64InputStreamTest)  Time elapsed: 0 sec  <<< ERROR!
java.lang.ArrayIndexOutOfBoundsException: null

testBase64EmptyInputStreamPemChuckSize(org.apache.commons.codec.binary.Base64InputStreamTest)  Time elapsed: 0 sec  <<< ERROR!
java.lang.ArrayIndexOutOfBoundsException: null

testBase64EmptyInputStreamMimeChuckSize(org.apache.commons.codec.binary.Base64InputStreamTest)  Time elapsed: 0.001 sec  <<< ERROR!
java.lang.ArrayIndexOutOfBoundsException: null

testSkipPastEnd(org.apache.commons.codec.binary.Base64InputStreamTest)  Time elapsed: 0 sec  <<< ERROR!
java.lang.ArrayIndexOutOfBoundsException: null

testSkipBig(org.apache.commons.codec.binary.Base64InputStreamTest)  Time elapsed: 0.001 sec  <<< ERROR!
java.lang.ArrayIndexOutOfBoundsException: null

testBase64InputStreamByteByByte(org.apache.commons.codec.binary.Base64InputStreamTest)  Time elapsed: 0 sec  <<< ERROR!
java.lang.ArrayIndexOutOfBoundsException: null

Running org.apache.commons.codec.binary.Base32InputStreamTest
Tests run: 16, Failures: 0, Errors: 0, Skipped: 0, Time elapsed: 0.137 sec - in org.apache.commons.codec.binary.Base32InputStreamTest
Running org.apache.commons.codec.binary.Base32OutputStreamTest
Tests run: 6, Failures: 0, Errors: 0, Skipped: 0, Time elapsed: 0.091 sec - in org.apache.commons.codec.binary.Base32OutputStreamTest
Running org.apache.commons.codec.binary.BinaryCodecTest
Tests run: 13, Failures: 0, Errors: 0, Skipped: 0, Time elapsed: 0.008 sec - in org.apache.commons.codec.binary.BinaryCodecTest
Running org.apache.commons.codec.binary.BaseNCodecTest
Tests run: 7, Failures: 0, Errors: 0, Skipped: 0, Time elapsed: 0.001 sec - in org.apache.commons.codec.binary.BaseNCodecTest
Running org.apache.commons.codec.binary.StringUtilsTest
Tests run: 17, Failures: 0, Errors: 0, Skipped: 0, Time elapsed: 0.026 sec - in org.apache.commons.codec.binary.StringUtilsTest
Running org.apache.commons.codec.binary.Base64Test
Tests run: 53, Failures: 1, Errors: 15, Skipped: 1, Time elapsed: 0.037 sec <<< FAILURE! - in org.apache.commons.codec.binary.Base64Test
testStringToByteVariations(org.apache.commons.codec.binary.Base64Test)  Time elapsed: 0 sec  <<< ERROR!
java.lang.ArrayIndexOutOfBoundsException: null

testKnownDecodings(org.apache.commons.codec.binary.Base64Test)  Time elapsed: 0 sec  <<< ERROR!
java.lang.ArrayIndexOutOfBoundsException: null

testUUID(org.apache.commons.codec.binary.Base64Test)  Time elapsed: 0.001 sec  <<< ERROR!
java.lang.ArrayIndexOutOfBoundsException: null

testEncodeDecodeSmall(org.apache.commons.codec.binary.Base64Test)  Time elapsed: 0 sec  <<< ERROR!
java.lang.ArrayIndexOutOfBoundsException: null

testObjectDecodeWithValidParameter(org.apache.commons.codec.binary.Base64Test)  Time elapsed: 0 sec  <<< ERROR!
java.lang.ArrayIndexOutOfBoundsException: null

testUrlSafe(org.apache.commons.codec.binary.Base64Test)  Time elapsed: 0.001 sec  <<< ERROR!
java.lang.ArrayIndexOutOfBoundsException: null

testEncodeDecodeRandom(org.apache.commons.codec.binary.Base64Test)  Time elapsed: 0.002 sec  <<< ERROR!
java.lang.ArrayIndexOutOfBoundsException: null

testDecodeWithWhitespace(org.apache.commons.codec.binary.Base64Test)  Time elapsed: 0 sec  <<< ERROR!
java.lang.ArrayIndexOutOfBoundsException: null

testDecodePadOnlyChunked(org.apache.commons.codec.binary.Base64Test)  Time elapsed: 0 sec  <<< ERROR!
java.lang.ArrayIndexOutOfBoundsException: null

testDecodePadMarkerIndex3(org.apache.commons.codec.binary.Base64Test)  Time elapsed: 0.001 sec  <<< ERROR!
java.lang.ArrayIndexOutOfBoundsException: null

testRfc4648Section10DecodeEncode(org.apache.commons.codec.binary.Base64Test)  Time elapsed: 0 sec  <<< ERROR!
java.lang.ArrayIndexOutOfBoundsException: null

testNonBase64Test(org.apache.commons.codec.binary.Base64Test)  Time elapsed: 0.001 sec  <<< FAILURE!
java.lang.AssertionError: Exception was thrown when trying to decode invalid base64 encoded data - RFC 2045 requires that all non base64 character be discarded, an exception should not have been thrown
	at org.junit.Assert.fail(Assert.java:88)
	at org.apache.commons.codec.binary.Base64Test.testNonBase64Test(Base64Test.java:480)

testObjectEncodeWithValidParameter(org.apache.commons.codec.binary.Base64Test)  Time elapsed: 0.001 sec  <<< ERROR!
java.lang.ArrayIndexOutOfBoundsException: null

testRfc4648Section10DecodeWithCrLf(org.apache.commons.codec.binary.Base64Test)  Time elapsed: 0 sec  <<< ERROR!
java.lang.ArrayIndexOutOfBoundsException: null

testRfc4648Section10Decode(org.apache.commons.codec.binary.Base64Test)  Time elapsed: 0 sec  <<< ERROR!
java.lang.ArrayIndexOutOfBoundsException: null

testRfc4648Section10EncodeDecode(org.apache.commons.codec.binary.Base64Test)  Time elapsed: 0 sec  <<< ERROR!
java.lang.ArrayIndexOutOfBoundsException: null

Running org.apache.commons.codec.binary.HexTest
Tests run: 19, Failures: 0, Errors: 0, Skipped: 0, Time elapsed: 0.173 sec - in org.apache.commons.codec.binary.HexTest
Running org.apache.commons.codec.DecoderExceptionTest
Tests run: 4, Failures: 0, Errors: 0, Skipped: 0, Time elapsed: 0 sec - in org.apache.commons.codec.DecoderExceptionTest
Running org.apache.commons.codec.EncoderExceptionTest
Tests run: 4, Failures: 0, Errors: 0, Skipped: 0, Time elapsed: 0.001 sec - in org.apache.commons.codec.EncoderExceptionTest
Running org.apache.commons.codec.net.BCodecTest
Tests run: 9, Failures: 0, Errors: 1, Skipped: 0, Time elapsed: 0.005 sec <<< FAILURE! - in org.apache.commons.codec.net.BCodecTest
testUTF8RoundTrip(org.apache.commons.codec.net.BCodecTest)  Time elapsed: 0.001 sec  <<< ERROR!
java.lang.ArrayIndexOutOfBoundsException: null

Running org.apache.commons.codec.net.QCodecTest
Tests run: 12, Failures: 0, Errors: 0, Skipped: 0, Time elapsed: 0.007 sec - in org.apache.commons.codec.net.QCodecTest
Running org.apache.commons.codec.net.UtilsTest
Tests run: 1, Failures: 0, Errors: 0, Skipped: 0, Time elapsed: 0 sec - in org.apache.commons.codec.net.UtilsTest
Running org.apache.commons.codec.net.RFC1522CodecTest
Tests run: 2, Failures: 0, Errors: 0, Skipped: 0, Time elapsed: 0 sec - in org.apache.commons.codec.net.RFC1522CodecTest
Running org.apache.commons.codec.net.URLCodecTest
Tests run: 16, Failures: 0, Errors: 0, Skipped: 0, Time elapsed: 0.009 sec - in org.apache.commons.codec.net.URLCodecTest
Running org.apache.commons.codec.net.QuotedPrintableCodecTest
Tests run: 21, Failures: 0, Errors: 0, Skipped: 0, Time elapsed: 0.01 sec - in org.apache.commons.codec.net.QuotedPrintableCodecTest
Running org.apache.commons.codec.StringEncoderComparatorTest
Tests run: 3, Failures: 0, Errors: 0, Skipped: 0, Time elapsed: 0.003 sec - in org.apache.commons.codec.StringEncoderComparatorTest
Running org.apache.commons.codec.language.Caverphone1Test
Tests run: 9, Failures: 0, Errors: 0, Skipped: 0, Time elapsed: 0.028 sec - in org.apache.commons.codec.language.Caverphone1Test
Running org.apache.commons.codec.language.NysiisTest
Tests run: 23, Failures: 0, Errors: 0, Skipped: 0, Time elapsed: 0.017 sec - in org.apache.commons.codec.language.NysiisTest
Running org.apache.commons.codec.language.Caverphone2Test
Tests run: 13, Failures: 0, Errors: 0, Skipped: 0, Time elapsed: 0.127 sec - in org.apache.commons.codec.language.Caverphone2Test
Running org.apache.commons.codec.language.DaitchMokotoffSoundexTest
Tests run: 13, Failures: 0, Errors: 0, Skipped: 0, Time elapsed: 0.046 sec - in org.apache.commons.codec.language.DaitchMokotoffSoundexTest
Running org.apache.commons.codec.language.bm.BeiderMorseEncoderTest
Tests run: 22, Failures: 0, Errors: 0, Skipped: 0, Time elapsed: 3.103 sec - in org.apache.commons.codec.language.bm.BeiderMorseEncoderTest
Running org.apache.commons.codec.language.bm.PhoneticEngineTest
Tests run: 8, Failures: 0, Errors: 0, Skipped: 0, Time elapsed: 0.019 sec - in org.apache.commons.codec.language.bm.PhoneticEngineTest
Running org.apache.commons.codec.language.bm.PhoneticEngineRegressionTest
Tests run: 4, Failures: 0, Errors: 0, Skipped: 0, Time elapsed: 0.016 sec - in org.apache.commons.codec.language.bm.PhoneticEngineRegressionTest
Running org.apache.commons.codec.language.bm.RuleTest
Tests run: 3, Failures: 0, Errors: 0, Skipped: 0, Time elapsed: 0.002 sec - in org.apache.commons.codec.language.bm.RuleTest
Running org.apache.commons.codec.language.bm.LanguageGuessingTest
Tests run: 18, Failures: 0, Errors: 0, Skipped: 0, Time elapsed: 0.012 sec - in org.apache.commons.codec.language.bm.LanguageGuessingTest
Running org.apache.commons.codec.language.DoubleMetaphoneTest
Tests run: 16, Failures: 0, Errors: 0, Skipped: 0, Time elapsed: 0.054 sec - in org.apache.commons.codec.language.DoubleMetaphoneTest
Running org.apache.commons.codec.language.SoundexTest
Tests run: 28, Failures: 0, Errors: 0, Skipped: 0, Time elapsed: 0.01 sec - in org.apache.commons.codec.language.SoundexTest
Running org.apache.commons.codec.language.RefinedSoundexTest
Tests run: 10, Failures: 0, Errors: 0, Skipped: 0, Time elapsed: 0.002 sec - in org.apache.commons.codec.language.RefinedSoundexTest
Running org.apache.commons.codec.language.MatchRatingApproachEncoderTest
Tests run: 96, Failures: 0, Errors: 0, Skipped: 0, Time elapsed: 0.032 sec - in org.apache.commons.codec.language.MatchRatingApproachEncoderTest
Running org.apache.commons.codec.language.ColognePhoneticTest
Tests run: 13, Failures: 0, Errors: 0, Skipped: 0, Time elapsed: 0.001 sec - in org.apache.commons.codec.language.ColognePhoneticTest
Running org.apache.commons.codec.language.DoubleMetaphone2Test
Tests run: 6, Failures: 0, Errors: 0, Skipped: 0, Time elapsed: 0.026 sec - in org.apache.commons.codec.language.DoubleMetaphone2Test
Running org.apache.commons.codec.language.MetaphoneTest
Tests run: 34, Failures: 0, Errors: 0, Skipped: 0, Time elapsed: 0.123 sec - in org.apache.commons.codec.language.MetaphoneTest
Running org.apache.commons.codec.CharEncodingTest
Tests run: 7, Failures: 0, Errors: 0, Skipped: 0, Time elapsed: 0 sec - in org.apache.commons.codec.CharEncodingTest

Results :

Failed tests: 
  Base64Test.testNonBase64Test:480 Exception was thrown when trying to decode invalid base64 encoded data - RFC 2045 requires that all non base64 character be discarded, an exception should not have been thrown

Tests in error: 
  Base64OutputStreamTest.testCodec98NPE:56 » ArrayIndexOutOfBounds 1
  Base64OutputStreamTest.testBase64OutputStreamByteByByte:144->testByteByByte:257 » ArrayIndexOutOfBounds
  Base64OutputStreamTest.testBase64EmptyOutputStreamMimeChunkSize:74->testBase64EmptyOutputStream:91->testByteByByte:257 » ArrayIndexOutOfBounds
  Base64OutputStreamTest.testBase64EmptyOutputStreamPemChunkSize:85->testBase64EmptyOutputStream:91->testByteByByte:257 » ArrayIndexOutOfBounds
  Base64OutputStreamTest.testBase64OutputStreamByChunk:106->testByChunk:203 » ArrayIndexOutOfBounds
  Base64Codec13Test.testDecoder:390 » ArrayIndexOutOfBounds 4
  Base64Codec13Test.testBinaryDecoder:428 » ArrayIndexOutOfBounds 4
  Base64Codec13Test.testStaticDecodeChunked:501 » ArrayIndexOutOfBounds 6
  Base64Codec13Test.testStaticDecode:464 » ArrayIndexOutOfBounds 4
  Base64InputStreamTest.testSkipToEnd:552 » ArrayIndexOutOfBounds 8192
  Base64InputStreamTest.testSkipNone:518 » ArrayIndexOutOfBounds 8192
  Base64InputStreamTest.testCodec98NPE:151 » ArrayIndexOutOfBounds 8192
  Base64InputStreamTest.testBase64InputStreamByChunk:216->testByChunk:314 » ArrayIndexOutOfBounds
  Base64InputStreamTest.testInputStreamReader:133 » ArrayIndexOutOfBounds 8192
  Base64InputStreamTest.testCodec101:103 » ArrayIndexOutOfBounds 8192
  Base64InputStreamTest.testCodec130 » ArrayIndexOutOfBounds
  Base64InputStreamTest.testAvailable » ArrayIndexOutOfBounds
  Base64InputStreamTest.testBase64EmptyInputStreamPemChuckSize » ArrayIndexOutOfBounds
  Base64InputStreamTest.testBase64EmptyInputStreamMimeChuckSize » ArrayIndexOutOfBounds
  Base64InputStreamTest.testSkipPastEnd » ArrayIndexOutOfBounds
  Base64InputStreamTest.testSkipBig » ArrayIndexOutOfBounds
  Base64InputStreamTest.testBase64InputStreamByteByByte » ArrayIndexOutOfBounds
  Base64Test.testStringToByteVariations » ArrayIndexOutOfBounds
  Base64Test.testKnownDecodings » ArrayIndexOutOfBounds
  Base64Test.testUUID » ArrayIndexOutOfBounds
  Base64Test.testEncodeDecodeSmall » ArrayIndexOutOfBounds
  Base64Test.testObjectDecodeWithValidParameter » ArrayIndexOutOfBounds
  Base64Test.testUrlSafe » ArrayIndexOutOfBounds
  Base64Test.testEncodeDecodeRandom » ArrayIndexOutOfBounds
  Base64Test.testDecodeWithWhitespace » ArrayIndexOutOfBounds
  Base64Test.testDecodePadOnlyChunked » ArrayIndexOutOfBounds
  Base64Test.testDecodePadMarkerIndex3 » ArrayIndexOutOfBounds
  Base64Test.testRfc4648Section10DecodeEncode » ArrayIndexOutOfBounds
  Base64Test.testObjectEncodeWithValidParameter » ArrayIndexOutOfBounds
  Base64Test.testRfc4648Section10DecodeWithCrLf » ArrayIndexOutOfBounds
  Base64Test.testRfc4648Section10Decode » ArrayIndexOutOfBounds
  Base64Test.testRfc4648Section10EncodeDecode » ArrayIndexOutOfBounds
  BCodecTest.testUTF8RoundTrip » ArrayIndexOutOfBounds

Tests run: 662, Failures: 1, Errors: 38, Skipped: 1

[INFO] ------------------------------------------------------------------------
[INFO] BUILD FAILURE
[INFO] ------------------------------------------------------------------------
[INFO] Total time: 13.267s
[INFO] Finished at: Sun Aug 02 07:00:22 BST 2015
[INFO] Final Memory: 26M/340M
[INFO] ------------------------------------------------------------------------
[ERROR] Failed to execute goal org.apache.maven.plugins:maven-surefire-plugin:2.17:test (default-test) on project commons-codec: There are test failures.
[ERROR] 
[ERROR] Please refer to /home/perham/Study/LittleDarwin/Cases/commons-codec-1.10-src/target/surefire-reports for the individual test results.
[ERROR] -> [Help 1]
[ERROR] 
[ERROR] To see the full stack trace of the errors, re-run Maven with the -e switch.
[ERROR] Re-run Maven using the -X switch to enable full debug logging.
[ERROR] 
[ERROR] For more information about the errors and possible solutions, please read the following articles:
[ERROR] [Help 1] http://cwiki.apache.org/confluence/display/MAVEN/MojoFailureException
