[INFO] Scanning for projects...
[INFO]                                                                         
[INFO] ------------------------------------------------------------------------
[INFO] Building Apache Commons Codec 1.10
[INFO] ------------------------------------------------------------------------
[INFO] 
[INFO] --- maven-enforcer-plugin:1.3.1:enforce (enforce-maven-3) @ commons-codec ---
[INFO] 
[INFO] --- maven-antrun-plugin:1.7:run (javadoc.resources) @ commons-codec ---
[INFO] Executing tasks

main:
[INFO] Executed tasks
[INFO] 
[INFO] --- maven-remote-resources-plugin:1.5:process (default) @ commons-codec ---
[INFO] 
[INFO] --- buildnumber-maven-plugin:1.3:create (default) @ commons-codec ---
[INFO] Executing: /bin/sh -c cd /home/perham/Study/LittleDarwin/Cases/commons-codec-1.10-src && svn --non-interactive info
[INFO] Working directory: /home/perham/Study/LittleDarwin/Cases/commons-codec-1.10-src
[INFO] Storing buildNumber: ?????? at timestamp: 1438493010189
[INFO] Executing: /bin/sh -c cd /home/perham/Study/LittleDarwin/Cases/commons-codec-1.10-src && svn --non-interactive info
[INFO] Working directory: /home/perham/Study/LittleDarwin/Cases/commons-codec-1.10-src
[INFO] Storing buildScmBranch: UNKNOWN_BRANCH
[INFO] 
[INFO] --- maven-resources-plugin:2.7:resources (default-resources) @ commons-codec ---
[INFO] Using 'UTF-8' encoding to copy filtered resources.
[INFO] Copying 128 resources
[INFO] Copying 2 resources to META-INF
[INFO] 
[INFO] --- maven-compiler-plugin:3.2:compile (default-compile) @ commons-codec ---
[INFO] Changes detected - recompiling the module!
[INFO] Compiling 60 source files to /home/perham/Study/LittleDarwin/Cases/commons-codec-1.10-src/target/classes
[INFO] /home/perham/Study/LittleDarwin/Cases/commons-codec-1.10-src/src/main/java/org/apache/commons/codec/digest/Sha2Crypt.java: Some input files use or override a deprecated API.
[INFO] /home/perham/Study/LittleDarwin/Cases/commons-codec-1.10-src/src/main/java/org/apache/commons/codec/digest/Sha2Crypt.java: Recompile with -Xlint:deprecation for details.
[INFO] 
[INFO] --- maven-bundle-plugin:2.5.3:manifest (bundle-manifest) @ commons-codec ---
[INFO] 
[INFO] --- maven-resources-plugin:2.7:testResources (default-testResources) @ commons-codec ---
[INFO] Using 'UTF-8' encoding to copy filtered resources.
[INFO] skip non existing resourceDirectory /home/perham/Study/LittleDarwin/Cases/commons-codec-1.10-src/src/test/resources
[INFO] Copying 2 resources to META-INF
[INFO] 
[INFO] --- maven-compiler-plugin:3.2:testCompile (default-testCompile) @ commons-codec ---
[INFO] Nothing to compile - all classes are up to date
[INFO] 
[INFO] --- maven-surefire-plugin:2.17:test (default-test) @ commons-codec ---
[INFO] Surefire report directory: /home/perham/Study/LittleDarwin/Cases/commons-codec-1.10-src/target/surefire-reports

-------------------------------------------------------
 T E S T S
-------------------------------------------------------
Running org.apache.commons.codec.digest.B64Test
Tests run: 2, Failures: 0, Errors: 0, Skipped: 0, Time elapsed: 0.026 sec - in org.apache.commons.codec.digest.B64Test
Running org.apache.commons.codec.digest.DigestUtilsTest
Tests run: 17, Failures: 0, Errors: 0, Skipped: 0, Time elapsed: 0.67 sec - in org.apache.commons.codec.digest.DigestUtilsTest
Running org.apache.commons.codec.digest.Sha512CryptTest
Tests run: 8, Failures: 0, Errors: 0, Skipped: 0, Time elapsed: 0.504 sec - in org.apache.commons.codec.digest.Sha512CryptTest
Running org.apache.commons.codec.digest.Apr1CryptTest
Tests run: 8, Failures: 0, Errors: 0, Skipped: 0, Time elapsed: 0.058 sec - in org.apache.commons.codec.digest.Apr1CryptTest
Running org.apache.commons.codec.digest.HmacUtilsTest
Tests run: 24, Failures: 0, Errors: 0, Skipped: 0, Time elapsed: 0.049 sec - in org.apache.commons.codec.digest.HmacUtilsTest
Running org.apache.commons.codec.digest.Sha2CryptTest
Tests run: 1, Failures: 0, Errors: 0, Skipped: 0, Time elapsed: 0 sec - in org.apache.commons.codec.digest.Sha2CryptTest
Running org.apache.commons.codec.digest.CryptTest
Tests run: 4, Failures: 0, Errors: 0, Skipped: 0, Time elapsed: 0.06 sec - in org.apache.commons.codec.digest.CryptTest
Running org.apache.commons.codec.digest.Sha256CryptTest
Tests run: 7, Failures: 0, Errors: 0, Skipped: 0, Time elapsed: 0.114 sec - in org.apache.commons.codec.digest.Sha256CryptTest
Running org.apache.commons.codec.digest.Md5CryptTest
Tests run: 7, Failures: 0, Errors: 0, Skipped: 0, Time elapsed: 0.015 sec - in org.apache.commons.codec.digest.Md5CryptTest
Running org.apache.commons.codec.digest.UnixCryptTest
Tests run: 9, Failures: 0, Errors: 0, Skipped: 0, Time elapsed: 0.012 sec - in org.apache.commons.codec.digest.UnixCryptTest
Running org.apache.commons.codec.CharsetsTest
Tests run: 7, Failures: 0, Errors: 0, Skipped: 0, Time elapsed: 0 sec - in org.apache.commons.codec.CharsetsTest
Running org.apache.commons.codec.binary.Base32Test
Tests run: 8, Failures: 0, Errors: 0, Skipped: 0, Time elapsed: 0.008 sec - in org.apache.commons.codec.binary.Base32Test
Running org.apache.commons.codec.binary.Base64OutputStreamTest
Tests run: 7, Failures: 2, Errors: 0, Skipped: 0, Time elapsed: 0.009 sec <<< FAILURE! - in org.apache.commons.codec.binary.Base64OutputStreamTest
testBase64OutputStreamByteByByte(org.apache.commons.codec.binary.Base64OutputStreamTest)  Time elapsed: 0.006 sec  <<< FAILURE!
java.lang.AssertionError: Streaming byte-by-byte base64 encode
	at org.junit.Assert.fail(Assert.java:88)
	at org.junit.Assert.assertTrue(Assert.java:41)
	at org.apache.commons.codec.binary.Base64OutputStreamTest.testByteByByte(Base64OutputStreamTest.java:249)
	at org.apache.commons.codec.binary.Base64OutputStreamTest.testBase64OutputStreamByteByByte(Base64OutputStreamTest.java:144)

testBase64OutputStreamByChunk(org.apache.commons.codec.binary.Base64OutputStreamTest)  Time elapsed: 0.001 sec  <<< FAILURE!
java.lang.AssertionError: Streaming chunked base64 encode
	at org.junit.Assert.fail(Assert.java:88)
	at org.junit.Assert.assertTrue(Assert.java:41)
	at org.apache.commons.codec.binary.Base64OutputStreamTest.testByChunk(Base64OutputStreamTest.java:197)
	at org.apache.commons.codec.binary.Base64OutputStreamTest.testBase64OutputStreamByChunk(Base64OutputStreamTest.java:106)

Running org.apache.commons.codec.binary.Base64Codec13Test
Tests run: 8, Failures: 4, Errors: 0, Skipped: 0, Time elapsed: 0.017 sec <<< FAILURE! - in org.apache.commons.codec.binary.Base64Codec13Test
testEncoder(org.apache.commons.codec.binary.Base64Codec13Test)  Time elapsed: 0 sec  <<< FAILURE!
java.lang.AssertionError: Encoder test-1
	at org.junit.Assert.fail(Assert.java:88)
	at org.junit.Assert.assertTrue(Assert.java:41)
	at org.apache.commons.codec.binary.Base64Codec13Test.testEncoder(Base64Codec13Test.java:372)

testBinaryEncoder(org.apache.commons.codec.binary.Base64Codec13Test)  Time elapsed: 0 sec  <<< FAILURE!
java.lang.AssertionError: BinaryEncoder test-1
	at org.junit.Assert.fail(Assert.java:88)
	at org.junit.Assert.assertTrue(Assert.java:41)
	at org.apache.commons.codec.binary.Base64Codec13Test.testBinaryEncoder(Base64Codec13Test.java:410)

testStaticEncodeChunked(org.apache.commons.codec.binary.Base64Codec13Test)  Time elapsed: 0 sec  <<< FAILURE!
java.lang.AssertionError: static Base64.encodeBase64Chunked() test-1
	at org.junit.Assert.fail(Assert.java:88)
	at org.junit.Assert.assertTrue(Assert.java:41)
	at org.apache.commons.codec.binary.Base64Codec13Test.testStaticEncodeChunked(Base64Codec13Test.java:483)

testStaticEncode(org.apache.commons.codec.binary.Base64Codec13Test)  Time elapsed: 0.001 sec  <<< FAILURE!
java.lang.AssertionError: static Base64.encodeBase64() test-1
	at org.junit.Assert.fail(Assert.java:88)
	at org.junit.Assert.assertTrue(Assert.java:41)
	at org.apache.commons.codec.binary.Base64Codec13Test.testStaticEncode(Base64Codec13Test.java:447)

Running org.apache.commons.codec.binary.Base64InputStreamTest
Tests run: 19, Failures: 3, Errors: 0, Skipped: 0, Time elapsed: 0.011 sec <<< FAILURE! - in org.apache.commons.codec.binary.Base64InputStreamTest
testBase64InputStreamByChunk(org.apache.commons.codec.binary.Base64InputStreamTest)  Time elapsed: 0 sec  <<< FAILURE!
java.lang.AssertionError: Streaming base64 encode
	at org.junit.Assert.fail(Assert.java:88)
	at org.junit.Assert.assertTrue(Assert.java:41)
	at org.apache.commons.codec.binary.Base64InputStreamTest.testByChunk(Base64InputStreamTest.java:308)
	at org.apache.commons.codec.binary.Base64InputStreamTest.testBase64InputStreamByChunk(Base64InputStreamTest.java:216)

testCodec130(org.apache.commons.codec.binary.Base64InputStreamTest)  Time elapsed: 0.001 sec  <<< FAILURE!
org.junit.ComparisonFailure: expected:<[ello Wo]rld> but was:<[ H HeHelellllolo o W WoWororl]rld>
	at org.junit.Assert.assertEquals(Assert.java:115)
	at org.junit.Assert.assertEquals(Assert.java:144)
	at org.apache.commons.codec.binary.Base64InputStreamTest.testCodec130(Base64InputStreamTest.java:73)

testBase64InputStreamByteByByte(org.apache.commons.codec.binary.Base64InputStreamTest)  Time elapsed: 0.001 sec  <<< FAILURE!
java.lang.AssertionError: EOF expected:<-1> but was:<120>
	at org.junit.Assert.fail(Assert.java:88)
	at org.junit.Assert.failNotEquals(Assert.java:743)
	at org.junit.Assert.assertEquals(Assert.java:118)
	at org.junit.Assert.assertEquals(Assert.java:555)
	at org.apache.commons.codec.binary.Base64InputStreamTest.testByteByByte(Base64InputStreamTest.java:362)
	at org.apache.commons.codec.binary.Base64InputStreamTest.testBase64InputStreamByteByByte(Base64InputStreamTest.java:254)

Running org.apache.commons.codec.binary.Base32InputStreamTest
Tests run: 16, Failures: 0, Errors: 0, Skipped: 0, Time elapsed: 0.156 sec - in org.apache.commons.codec.binary.Base32InputStreamTest
Running org.apache.commons.codec.binary.Base32OutputStreamTest
Tests run: 6, Failures: 0, Errors: 0, Skipped: 0, Time elapsed: 0.108 sec - in org.apache.commons.codec.binary.Base32OutputStreamTest
Running org.apache.commons.codec.binary.BinaryCodecTest
Tests run: 13, Failures: 0, Errors: 0, Skipped: 0, Time elapsed: 0.013 sec - in org.apache.commons.codec.binary.BinaryCodecTest
Running org.apache.commons.codec.binary.BaseNCodecTest
Tests run: 7, Failures: 0, Errors: 0, Skipped: 0, Time elapsed: 0.003 sec - in org.apache.commons.codec.binary.BaseNCodecTest
Running org.apache.commons.codec.binary.StringUtilsTest
Tests run: 17, Failures: 0, Errors: 0, Skipped: 0, Time elapsed: 0.029 sec - in org.apache.commons.codec.binary.StringUtilsTest
Running org.apache.commons.codec.binary.Base64Test
Tests run: 53, Failures: 26, Errors: 0, Skipped: 1, Time elapsed: 0.045 sec <<< FAILURE! - in org.apache.commons.codec.binary.Base64Test
testTriplets(org.apache.commons.codec.binary.Base64Test)  Time elapsed: 0.001 sec  <<< FAILURE!
org.junit.ComparisonFailure: expected:<AAAA[]> but was:<AAAA[AAAAAAAA]>
	at org.junit.Assert.assertEquals(Assert.java:115)
	at org.junit.Assert.assertEquals(Assert.java:144)
	at org.apache.commons.codec.binary.Base64Test.testTriplets(Base64Test.java:940)

testConstructor_Int_ByteArray_Boolean_UrlSafe(org.apache.commons.codec.binary.Base64Test)  Time elapsed: 0.004 sec  <<< FAILURE!
org.junit.ComparisonFailure: new Base64(64, \t, true) expected:<[AAD0APSD9IPNg80rzSsFKwUvBS90L3S4dLiIuIgCiAKeAp6cnpy3nLc9tz12PXZK	dkokSiQmJCY4JjhrOGstay1bLVsmWyYvJi9IL0j3SPee956-nr7nvufD58OGw4a8	hrzavNrC2sLOws65zrm-ub6MvoykjKQqpCo2KjbINsiPyI99j33YfdhZ2Fk2WTa9	Nr3EvcQOxA7cDtz83PxR_FHyUfKl8qVnpWclZyWtJa2YrZhQmFDuUO6J7onfid9z	33Nyc3JEckT3RPdw93BJcEnlSeX05fT49PhH-EfcR9zA3MARwBHYEdjb2NuP248t	jy1hLWG_Yb-Gv4ZYhlg2WDZxNnETcRPhE-Fi4WJeYl5cXlzCXMLJwsn_yf-a_5p-	mn6ofqgaqBpTGlOwU7D6sPpe-l6lXqVvpW8DbwM1AzVWNVYyVjLVMtXN1c02zTb_	Nv9c_1wyXDILMgvpC-kg6SADIAOgA6CvoK9Fr0VHRUd9R31xfXEqcSr_Kv-W_5bf	lt883zwAPABHAEdsR2xNbE1eTV4GXgYwBjApMCn1KfX49fhM-EwuTC4CLgImAiYd	Jh2KHYr8ivxu_G7Obs5_zn-cf5wsnCzPLM8qzyraKto32jewN7CqsKpSqlI5Ujna	OdrT2tP90_0n_SewJ7CssKzyrPL68vqG-obvhu9b71s6Wzr5Ovlg-WAEYAQsBCyr	LKvmq-b95v1K_UovSi-_L78mvyaOJo6Ljovji-Od450xnTFHMUfjR-ND40NCQ0JL	QkuIS4i5iLkHuQe7B7uqu6p9qn07fTsFOwUgBSC9IL0KvQqiCqIMogysDKzErMS_	xL_wv_Au8C6CLoKNgo0djR1MHUz2TPZz9nNgc2BhYGEyYTIIMgj-CP5G_kZWRla5	VrleuV7dXt0E3QQdBB2BHYHIgciIyIgeiB56Hnpdel13XXeFd4VUhVRMVEzxTPGR	8ZFRkVG1UbXetd4p3im4Kbh-uH75fvlN-U3fTd9s32ySbJInkieDJ4P7g_sQ-xBc	EFzNXM3IzchgyGAcYByMHIxnjGe8Z7xtvG30bfR19HWSdZLUktS11LUctRxFHEXU	RdQ71Ds-Oz68PrwnvCf8J_yJ_IlQiVBbUFsTWxOME4x6jHqveq-Kr4pkimSUZJSo	lKgCqAL4AviW-Ja1lrXbtdse2x6tHq18rXyHfIdsh2yBbIEagRr_Gv_4__hm-Gav	Zq-Kr4p_in-Pf4_Nj80kzSTSJNIP0g9qD2rfat-Y35hqmGrVatWs1ayGrIYzhjPf	M99833zgfOAC4ALTAtNJ00mmSaZ8pnxZfFnsWeyF7IVthW2cbZx1nHULdQsQCxC_	EL9Cv0KKQoqfip_3n_dl92UHZQf_B_8p_ylBKUFGQUZ0RnSJdIk2iTZ-Nn4sfixL	LEtKS0oaShreGt7l3uUb5Rs2GzbzNvOn86emp6ZApkB4QHgPeA_VD9V71XtSe1Lf	Ut9a31q2WrYptinCKcImwia8Jrw-vD7CPsIiwiJcIlwyXDJfMl-9X72SvZKdkp25	nbnUudSF1IUxhTEEMQRgBGA4YDhxOHFMcUxhTGHRYdHm0eax5rGTsZNzk3ODc4Na	g1p8WnwIfAj3CPeR95EkkSS2JLZltmWOZY4rjisAKwCSAJI_kj9MP0xjTGNbY1sC	WwIMAgzEDMQ4xDjyOPKD8oMAgwAGAAblBuUf5R8fHx-TH5PRk9H90f1t_W1YbVi1	WLW2tbYTthMaExq-Gr5uvm4nbicNJw3ODc4vzi9oL2jaaNoS2hITEhNUE1RnVGdk	Z2TWZNYw1jBuMG4lbiUVJRWVFZVTlVPMU8z0zPRH9EclRyW8JbyVvJWTlZNZk1ne	Wd6i3qKBooFngWeAZ4DQgNDM0MxHzEcARwAPAA8iDyI4IjjOOM5VzlWeVZ5qnmqp	aqn9qf1h_WGMYYztjO1A7UDqQOrn6ufa59rB2sEhwSHTIdNQ01AKUAqHCoeTh5Ml	kyWgJaAkoCQSJBLQEtAu0C4sLiy-LL5zvnOic6IDogOaA5rlmuXv5e-M74zNjM1Y	zVjvWO8H7weTB5MYkxhCGEJTQlOlU6VppWmkaaTtpO1C7UK0QrRAtEClQKV2pXa5	drlnuWeFZ4VfhV8RXxGpEanuqe717vVC9UK2QrZ-tn4tfi1TLVPyU_Iy8jJPMk8U	TxQtFC2PLY-Zj5l3mXebd5vGm8adxp0bnRucG5zvnO-V75VblVvmW-bg5uDI4MhH	yEdIR0giSCJCIkIQQhAJEAmmCaZqpmrUatTC1MKWwpYLlgtyC3Kucq6IrojkiOS9	5L0EvQSdBJ1tnW3sbezt7O0A7QDYANiS2JKJkokqiSr6KvoE-gThBOFD4UNuQ26X	bpc1lzV2NXZMdkxgTGCCYIL4gvig-KAnoCeaJ5o0mjRqNGpAakAaQBqXGpeUl5SZ	lJmgmaCMoIx0jHQAdACgAKBzoHNZc1koWSjpKOma6Zr-mv7i_uIQ4hA6EDrLOsvf	y98O3w56DnqieqJxonGHcYdDh0OZQ5n8mfyC_IJigmLlYuV85Xz0fPR49HjAeMDU	wNR_1H8tfy2ILYgyiDJ8MnzlfOVX5VfsV-ys7KxRrFHdUd1x3XGzcbPAs8CgwKDQ	oNCp0KmLqYuui65arlrAWsCUwJSHlId9h33TfdPO087UztTQ1NDO0M40zjTiNOK-	4r75vvku-S7YLtjR2NFV0VXUVdSC1IKGgoYYhhisGKwVrBV4FXhjeGO2Y7YbthsL	GwvMC8wgzCD-IP56_nqcepyKnIpqimr3aveW95Ztlm3tbe1H7UcqRyp-Kn5CfkLI	QsgKyArNCs3UzdRE1ERtRG3zbfNR81GTUZNBk0F5QXk8eTy8PLyLvIt-i37FfsUE	xQSVBJXqlepj6mOzY7NUs1QdVB1XHVd3V3fEd8RXxFdSV1LJUsm2ybYstiywLLAD	sAN7A3ube5tUm1TUVNQJ1AlHCUcYRxhbGFtjW2MWYxa_Fr8Lvwv1C_Xy9fLa8tqs	2qxprGmbaZurm6vvq-9073S_dL92v3aXdpd6l3q1erVxtXHHccevx6_fr9-S35Ic	khxoHGjoaOiS6JLHkseyx7Imsib7Jvvx-_Gx8bFXsVdpV2lVaVUpVSnWKdaO1o69	jr2FvYVGhUYMRgw9DD1zPXMFcwUXBRe6F7pjumNgY2CwYLBBsEG_Qb9pv2nTadPP	088lzyXfJd__3_93_3eod6hkqGR5ZHnneefd593N3c0KzQorCiuPK489jz1nPWcs	ZywNLA1sDWwUbBRKFEoTShM1EzUTNRMlEyW0JbQUtBTVFNX11fUX9RfGF8bnxufM	58x5zHnYediK2Io6ijoyOjITMhP4E_jf-N_i3-LP4s_lz-X15fWw9bBdsF3vXe8i	7yJdIl1FXUVkRWRCZELKQsooyih2KHZZdlnMWcypzKkCqQIjAiOII4gSiBJAEkBs	QGwfbB_nH-dC50JOQk4GTgalBqW7pbvLu8sRyxEOEQ6DDoMhgyHhIeGS4ZIBkgEF	AQXYBdgH2Ad-B36GfoZUhlTJVMnCycLqwupF6kXkReQF5AUtBS2WLZZ4lnhKeEpe	Sl4zXjNKM0psSmztbO3m7eb05vQx9DFAMUBYQFhEWEQpRCm_Kb9-v359fn3_ff_4	__it-K29rb1KvUoCSgKOAo6wjrCJsIn3ifen96eDp4MVgxVfFV8iXyLGIsa2xrZv	tm-Zb5ljmWNfY18wXzAqMCpeKl7OXs7JzsmQyZD7kPvm--YL5gunC6fap9rt2u1-	7X4ZfhlmGWZ3ZndRd1GiUaJGokaxRrFisWJbYlu3W7dyt3IPcg8ODw5XDlfrV-uG	64b_hv-m_6YApgAdAB2YHZilmKWjpaPGo8atxq3QrdDq0Opk6mSQZJDXkNdN100W	TRboFuhw6HC4cLhpuGlkaWQGZAaqBqrZqtko2SjVKNUj1SP-I_4E_gSiBKJhomGH	YYc0hzTqNOoB6gF_AX-vf6_8r_z6_PqJ-olgiWAjYCOlI6VypXJRclFbUVtaW1qq	Wqrcqtwi3CLZItld2V3WXdZF1kVnRWf1Z_Vr9Wupa6l3qXeVd5WOlY7TjtOA04C7	gLtg]	> but was:<[9IPNKwUvdLiIAp6ctz12SiQmOGstWyYvSPeevufDhrzaws65voykKjbIj33YWTa9	xA7c_FHypWclrZhQ7onfc3JE93BJ5fT4R9zAEdjbjy1hv4ZYNnET4WJeXMLJ_5p-	qBpTsPpepW8DNVYy1c02_1wyC-kgA6CvRUd9cSr_lt88AEdsTV4GMCn1-EwuAiYd	ivxuzn-cLM8q2jewqlI52tP9J7Cs8vqG71s6-WAELKvm_UovvyaOi-OdMUfjQ0JL	iLkHu6p9OwUgvQqiDKzEv_Augo0dTPZzYGEyCP5GVrle3QQdgciIHnpdd4VUTPGR	UbXeKbh--U3fbJIng_sQXM3IYByMZ7xt9HWS1LUcRdQ7Prwn_IlQWxOMeq-KZJSo	AviWtdserXyHbIEa__hmr4p_j80k0g9q35hq1ayGM9984ALTSaZ8WeyFbZx1CxC_	Qoqf92UH_ylBRnSJNn4sS0oa3uUbNvOnpkB4D9V7Ut9atinCJrw-wiJcMl-9kp25	1IUxBGA4cUxh0eaxk3ODWnwI95EktmWOKwCSP0xjWwIMxDjygwAG5R8fk9H9bVi1	thMavm4nDc4vaNoSE1RnZNYwbiUVlVPM9EclvJWTWd6igWeA0MxHAA8iOM5Vnmqp	_WGM7UDq59rBIdNQCoeTJaAkEtAuLL5zogOa5e-MzVjvB5MYQlOlaaTtQrRApXa5	Z4VfEanu9UK2fi1T8jJPFC2PmXebxp0bnO-VW-bgyEdIIkIQCaZq1MKWC3KuiOS9	BJ1t7O0A2JKJKvoE4UNulzV2TGCC-KAnmjRqQBqXlJmgjHQAoHNZKOma_uIQOsvf	DnqicYdDmfyCYuV89HjA1H8tiDJ85VfsrFHdcbPAoNCpi65awJSHfdPO1NDONOK-	-S7Y0VXUgoYYrBV4Y7YbC8wg_nqcimr3lm3tRyp-QsgKzdREbfNRk0F5PLyLfsUE	lepjs1QdV3fEV1LJtiywA3ubVNQJRxhbYxa_C_Xy2qxpm6vvdL92l3q1ccev35Ic	aOiSx7Im-_GxV2lVKdaOvYVGDD1zBRe6Y2CwQb9p088l3_93qGR5593NCiuPPWcs	DWwUShM1EyW0FNX1F8bnzHnYijoyE_jf4s_l9bBd7yJdRWRCyih2WcypAiOIEkBs	H-dCTgalu8sRDoMh4ZIBBdgHfoZUycLqReQFLZZ4Sl4zSmzt5vQxQFhEKb9-ff_4	rb1KAo6wifengxVfIsa2b5ljXzAqXs7JkPvmC6fa7X4ZZndRokaxYlu3cg8OV-uG	_6YAHZilo8at0OpkkNdNFuhwuGlkBqrZKNUj_gSiYYc06gF_r_z6iWAjpXJRW1qq	3CLZXdZFZ_VrqXeVjtOAu2A]	>
	at org.junit.Assert.assertEquals(Assert.java:115)
	at org.apache.commons.codec.binary.Base64Test.testConstructor_Int_ByteArray_Boolean_UrlSafe(Base64Test.java:264)

testSingletonsChunked(org.apache.commons.codec.binary.Base64Test)  Time elapsed: 0 sec  <<< FAILURE!
org.junit.ComparisonFailure: expected:<AA[==]
> but was:<AA[AA]
>
	at org.junit.Assert.assertEquals(Assert.java:115)
	at org.junit.Assert.assertEquals(Assert.java:144)
	at org.apache.commons.codec.binary.Base64Test.testSingletonsChunked(Base64Test.java:831)

testPairs(org.apache.commons.codec.binary.Base64Test)  Time elapsed: 0 sec  <<< FAILURE!
org.junit.ComparisonFailure: expected:<AAA[=]> but was:<AAA[AAAAA]>
	at org.junit.Assert.assertEquals(Assert.java:115)
	at org.junit.Assert.assertEquals(Assert.java:144)
	at org.apache.commons.codec.binary.Base64Test.testPairs(Base64Test.java:547)

testUUID(org.apache.commons.codec.binary.Base64Test)  Time elapsed: 0 sec  <<< FAILURE!
java.lang.AssertionError: standard encode uuid
	at org.junit.Assert.fail(Assert.java:88)
	at org.junit.Assert.assertTrue(Assert.java:41)
	at org.apache.commons.codec.binary.Base64Test.testUUID(Base64Test.java:1180)

testEncodeDecodeSmall(org.apache.commons.codec.binary.Base64Test)  Time elapsed: 0.001 sec  <<< FAILURE!
java.lang.AssertionError: -82 equals 0,0,-82
	at org.junit.Assert.fail(Assert.java:88)
	at org.junit.Assert.assertTrue(Assert.java:41)
	at org.apache.commons.codec.binary.Base64Test.testEncodeDecodeSmall(Base64Test.java:365)

testObjectDecodeWithValidParameter(org.apache.commons.codec.binary.Base64Test)  Time elapsed: 0 sec  <<< FAILURE!
org.junit.ComparisonFailure: dest string does not equal original expected:<[Hello Wor]ld!> but was:<[  H HeHelellllolo o W WoWororlrld]ld!>
	at org.junit.Assert.assertEquals(Assert.java:115)
	at org.apache.commons.codec.binary.Base64Test.testObjectDecodeWithValidParameter(Base64Test.java:511)

testCodeInteger1(org.apache.commons.codec.binary.Base64Test)  Time elapsed: 0.003 sec  <<< FAILURE!
org.junit.ComparisonFailure: expected:<[li7dzDacuo67Jg7mtqEm2TRuOMU=]> but was:<[AACWAJYuli7dLt3M3cw2zDacNpy6nLqOuo67jrsmuyYOJg7mDua25rahtqEmoSbZJtk02TRuNG44bjjF]>
	at org.junit.Assert.assertEquals(Assert.java:115)
	at org.junit.Assert.assertEquals(Assert.java:144)
	at org.apache.commons.codec.binary.Base64Test.testCodeInteger1(Base64Test.java:149)

testCodeInteger2(org.apache.commons.codec.binary.Base64Test)  Time elapsed: 0 sec  <<< FAILURE!
org.junit.ComparisonFailure: expected:<[9B5ypLY9pMOmtxCeTDHgwdNFeGs=]> but was:<[AAD0APQe9B5yHnKkcqS2pLY9tj2kPaTDpMOmw6a3prcQtxCeEJ5MnkwxTDHgMeDB4MHTwdNF00V4RXhr]>
	at org.junit.Assert.assertEquals(Assert.java:115)
	at org.junit.Assert.assertEquals(Assert.java:144)
	at org.apache.commons.codec.binary.Base64Test.testCodeInteger2(Base64Test.java:158)

testCodeInteger3(org.apache.commons.codec.binary.Base64Test)  Time elapsed: 0 sec  <<< FAILURE!
org.junit.ComparisonFailure: expected:<[FKIhdgaG5LGKiEtF1vHy4f3y700zaD6QwDS3IrNVGzNp2rY+1LFWTK6D44AyiC1n8uWz1itkYMZF0/aKDK0Yjg==]> but was:<[AAAUABSiFKIhoiF2IXYGdgaGBobkhuSx5LGKsYqIiohLiEtFS0XWRdbx1vHy8fLh8uH94f3y/fLv8u9N700zTTNoM2g+aD6QPpDAkMA0wDS3NLcityKzIrNVs1UbVRszGzNpM2naadq22rY+tj7UPtSx1LFWsVZMVkyuTK6DroPjg+OA44AygDKIMogtiC1nLWfyZ/Ll8uWz5bPWs9Yr1itkK2RgZGDGYMZFxkXTRdP20/aK9ooMigytDK0YrRiO]>
	at org.junit.Assert.assertEquals(Assert.java:115)
	at org.junit.Assert.assertEquals(Assert.java:144)
	at org.apache.commons.codec.binary.Base64Test.testCodeInteger3(Base64Test.java:169)

testCodeInteger4(org.apache.commons.codec.binary.Base64Test)  Time elapsed: 0.002 sec  <<< FAILURE!
org.junit.ComparisonFailure: expected:<[ctA8YGxrtngg/zKVvqEOefnwmViFztcnPBYPlJsvh6yKI4iDm68fnp4Mi3RrJ6bZAygFrUIQLxLjV+OJtgJAEto0xAs+Mehuq1DkSFEpP3oDzCTOsrOiS1DwQe4oIb7zVk/9l7aPtJMHW0LVlMdwZNFNNJoqMcT2ZfCPrfvYvQ0=]> but was:<[AAByAHLQctA80DxgPGBsYGxrbGu2a7Z4tnggeCD/IP8y/zKVMpW+lb6hvqEOoQ55Dnn5efnw+fCZ8JlYmViFWIXOhc7Xztcn1yc8JzwWPBYPFg+UD5SblJsvmy+HL4esh6yKrIojiiOII4iDiIObg5uvm68frx+eH56enp4MngyLDIt0i3RrdGsnayemJ6bZptkD2QMoAygFKAWtBa1CrUIQQhAvEC8SLxLjEuNX41fjV+OJ44m2ibYCtgJAAkASQBLaEto02jTENMQLxAs+Cz4xPjHoMehu6G6rbqtQq1DkUORI5EhRSFEpUSk/KT96P3oDegPMA8wkzCTOJM6yzrKzsrOis6JLoktQS1DwUPBB8EHuQe4o7ighKCG+Ib7zvvNW81ZPVk/9T/2X/Ze2l7aPto+0j7STtJMHkwdbB1tCW0LVQtWU1ZTHlMdwx3BkcGTRZNFN0U00TTSaNJoqmioxKjHEMcT2xPZl9mXwZfCP8I+tj637rfvY+9i92L0N]>
	at org.junit.Assert.assertEquals(Assert.java:115)
	at org.junit.Assert.assertEquals(Assert.java:144)
	at org.apache.commons.codec.binary.Base64Test.testCodeInteger4(Base64Test.java:186)

testObjectEncode(org.apache.commons.codec.binary.Base64Test)  Time elapsed: 0.001 sec  <<< FAILURE!
org.junit.ComparisonFailure: expected:<[SGVsbG8gV29ybGQ=]> but was:<[AABIAEhlSGVsZWxsbGxvbG8gbyBXIFdvV29yb3Jscmxk]>
	at org.junit.Assert.assertEquals(Assert.java:115)
	at org.junit.Assert.assertEquals(Assert.java:144)
	at org.apache.commons.codec.binary.Base64Test.testObjectEncode(Base64Test.java:542)

testUrlSafe(org.apache.commons.codec.binary.Base64Test)  Time elapsed: 0.001 sec  <<< FAILURE!
java.lang.AssertionError: url-safe i=1
	at org.junit.Assert.fail(Assert.java:88)
	at org.junit.Assert.assertTrue(Assert.java:41)
	at org.apache.commons.codec.binary.Base64Test.testUrlSafe(Base64Test.java:1085)

testEncodeDecodeRandom(org.apache.commons.codec.binary.Base64Test)  Time elapsed: 0.004 sec  <<< FAILURE!
java.lang.AssertionError: null
	at org.junit.Assert.fail(Assert.java:86)
	at org.junit.Assert.assertTrue(Assert.java:41)
	at org.junit.Assert.assertTrue(Assert.java:52)
	at org.apache.commons.codec.binary.Base64Test.testEncodeDecodeRandom(Base64Test.java:352)

testDecodeWithWhitespace(org.apache.commons.codec.binary.Base64Test)  Time elapsed: 0 sec  <<< FAILURE!
org.junit.ComparisonFailure: Dest string doesn't equal the original expected:<[I am a late night cod]er.> but was:<[  I I I a amam m a a a l lalatatete e n ninigighghtht t c cocododeder]er.>
	at org.junit.Assert.assertEquals(Assert.java:115)
	at org.apache.commons.codec.binary.Base64Test.testDecodeWithWhitespace(Base64Test.java:324)

testKnownEncodings(org.apache.commons.codec.binary.Base64Test)  Time elapsed: 0.001 sec  <<< FAILURE!
org.junit.ComparisonFailure: expected:<[VGhlIHF1aWNrIGJyb3duIGZveCBqdW1wZWQgb3ZlciB0aGUgbGF6eSBkb2dzLg==]> but was:<[AABUAFRoVGhlaGUgZSBxIHF1cXVpdWljaWNrY2sgayBiIGJyYnJvcm93b3dud24gbiBmIGZvZm94b3ggeCBqIGp1anVtdW1wbXBlcGVkZWQgZCBvIG92b3ZldmVyZXIgciB0IHRodGhlaGUgZSBsIGxhbGF6YXp5enkgeSBkIGRvZG9nb2dzZ3Mu]>
	at org.junit.Assert.assertEquals(Assert.java:115)
	at org.junit.Assert.assertEquals(Assert.java:144)
	at org.apache.commons.codec.binary.Base64Test.testKnownEncodings(Base64Test.java:446)

testSingletons(org.apache.commons.codec.binary.Base64Test)  Time elapsed: 0 sec  <<< FAILURE!
org.junit.ComparisonFailure: expected:<AA[==]> but was:<AA[AA]>
	at org.junit.Assert.assertEquals(Assert.java:115)
	at org.junit.Assert.assertEquals(Assert.java:144)
	at org.apache.commons.codec.binary.Base64Test.testSingletons(Base64Test.java:718)

testTripletsChunked(org.apache.commons.codec.binary.Base64Test)  Time elapsed: 0 sec  <<< FAILURE!
org.junit.ComparisonFailure: expected:<AAAA[]
> but was:<AAAA[AAAAAAAA]
>
	at org.junit.Assert.assertEquals(Assert.java:115)
	at org.junit.Assert.assertEquals(Assert.java:144)
	at org.apache.commons.codec.binary.Base64Test.testTripletsChunked(Base64Test.java:1008)

testRfc4648Section10DecodeEncode(org.apache.commons.codec.binary.Base64Test)  Time elapsed: 0.001 sec  <<< FAILURE!
org.junit.ComparisonFailure: expected:<[Zg==]> but was:<[AABm]>
	at org.junit.Assert.assertEquals(Assert.java:115)
	at org.junit.Assert.assertEquals(Assert.java:144)
	at org.apache.commons.codec.binary.Base64Test.testDecodeEncode(Base64Test.java:682)
	at org.apache.commons.codec.binary.Base64Test.testRfc4648Section10DecodeEncode(Base64Test.java:671)

testChunkedEncodeMultipleOf76(org.apache.commons.codec.binary.Base64Test)  Time elapsed: 0.001 sec  <<< FAILURE!
java.lang.AssertionError: chunkedEncodeMultipleOf76
	at org.junit.Assert.fail(Assert.java:88)
	at org.junit.Assert.assertTrue(Assert.java:41)
	at org.apache.commons.codec.binary.Base64Test.testChunkedEncodeMultipleOf76(Base64Test.java:132)

testBase64(org.apache.commons.codec.binary.Base64Test)  Time elapsed: 0 sec  <<< FAILURE!
org.junit.ComparisonFailure: encoding hello world expected:<[SGVsbG8gV29ybGQ=]> but was:<[AABIAEhlSGVsZWxsbGxvbG8gbyBXIFdvV29yb3Jscmxk]>
	at org.junit.Assert.assertEquals(Assert.java:115)
	at org.apache.commons.codec.binary.Base64Test.testBase64(Base64Test.java:84)

testConstructor_Int_ByteArray_Boolean(org.apache.commons.codec.binary.Base64Test)  Time elapsed: 0.002 sec  <<< FAILURE!
org.junit.ComparisonFailure: new Base64(65, \t, false) expected:<[9IPNKwUvdLiIAp6ctz12SiQmOGstWyYvSPeevufDhrzaws65voykKjbIj33YWTa9	xA7c/FHypWclrZhQ7onfc3JE93BJ5fT4R9zAEdjbjy1hv4ZYNnET4WJeXMLJ/5p+	qBpTsPpepW8DNVYy1c02/1wyC+kgA6CvRUd9cSr/lt88AEdsTV4GMCn1+EwuAiYd	ivxuzn+cLM8q2jewqlI52tP9J7Cs8vqG71s6+WAELKvm/UovvyaOi+OdMUfjQ0JL	iLkHu6p9OwUgvQqiDKzEv/Augo0dTPZzYGEyCP5GVrle3QQdgciIHnpdd4VUTPGR	UbXeKbh++U3fbJIng/sQXM3IYByMZ7xt9HWS1LUcRdQ7Prwn/IlQWxOMeq+KZJSo	AviWtdserXyHbIEa//hmr4p/j80k0g9q35hq1ayGM9984ALTSaZ8WeyFbZx1CxC/	Qoqf92UH/ylBRnSJNn4sS0oa3uUbNvOnpkB4D9V7Ut9atinCJrw+wiJcMl+9kp25	1IUxBGA4cUxh0eaxk3ODWnwI95EktmWOKwCSP0xjWwIMxDjygwAG5R8fk9H9bVi1	thMavm4nDc4vaNoSE1RnZNYwbiUVlVPM9EclvJWTWd6igWeA0MxHAA8iOM5Vnmqp	/WGM7UDq59rBIdNQCoeTJaAkEtAuLL5zogOa5e+MzVjvB5MYQlOlaaTtQrRApXa5	Z4VfEanu9UK2fi1T8jJPFC2PmXebxp0bnO+VW+bgyEdIIkIQCaZq1MKWC3KuiOS9	BJ1t7O0A2JKJKvoE4UNulzV2TGCC+KAnmjRqQBqXlJmgjHQAoHNZKOma/uIQOsvf	DnqicYdDmfyCYuV89HjA1H8tiDJ85VfsrFHdcbPAoNCpi65awJSHfdPO1NDONOK+	+S7Y0VXUgoYYrBV4Y7YbC8wg/nqcimr3lm3tRyp+QsgKzdREbfNRk0F5PLyLfsUE	lepjs1QdV3fEV1LJtiywA3ubVNQJRxhbYxa/C/Xy2qxpm6vvdL92l3q1ccev35Ic	aOiSx7Im+/GxV2lVKdaOvYVGDD1zBRe6Y2CwQb9p088l3/93qGR5593NCiuPPWcs	DWwUShM1EyW0FNX1F8bnzHnYijoyE/jf4s/l9bBd7yJdRWRCyih2WcypAiOIEkBs	H+dCTgalu8sRDoMh4ZIBBdgHfoZUycLqReQFLZZ4Sl4zSmzt5vQxQFhEKb9+ff/4	rb1KAo6wifengxVfIsa2b5ljXzAqXs7JkPvmC6fa7X4ZZndRokaxYlu3cg8OV+uG	/6YAHZilo8at0OpkkNdNFuhwuGlkBqrZKNUj/gSiYYc06gF/r/z6iWAjpXJRW1qq	3CLZXdZFZ/VrqXeVjtOAu2A=]	> but was:<[AAD0APSD9IPNg80rzSsFKwUvBS90L3S4dLiIuIgCiAKeAp6cnpy3nLc9tz12PXZK	dkokSiQmJCY4JjhrOGstay1bLVsmWyYvJi9IL0j3SPee956+nr7nvufD58OGw4a8	hrzavNrC2sLOws65zrm+ub6MvoykjKQqpCo2KjbINsiPyI99j33YfdhZ2Fk2WTa9	Nr3EvcQOxA7cDtz83PxR/FHyUfKl8qVnpWclZyWtJa2YrZhQmFDuUO6J7onfid9z	33Nyc3JEckT3RPdw93BJcEnlSeX05fT49PhH+EfcR9zA3MARwBHYEdjb2NuP248t	jy1hLWG/Yb+Gv4ZYhlg2WDZxNnETcRPhE+Fi4WJeYl5cXlzCXMLJwsn/yf+a/5p+	mn6ofqgaqBpTGlOwU7D6sPpe+l6lXqVvpW8DbwM1AzVWNVYyVjLVMtXN1c02zTb/	Nv9c/1wyXDILMgvpC+kg6SADIAOgA6CvoK9Fr0VHRUd9R31xfXEqcSr/Kv+W/5bf	lt883zwAPABHAEdsR2xNbE1eTV4GXgYwBjApMCn1KfX49fhM+EwuTC4CLgImAiYd	Jh2KHYr8ivxu/G7Obs5/zn+cf5wsnCzPLM8qzyraKto32jewN7CqsKpSqlI5Ujna	OdrT2tP90/0n/SewJ7CssKzyrPL68vqG+obvhu9b71s6Wzr5Ovlg+WAEYAQsBCyr	LKvmq+b95v1K/UovSi+/L78mvyaOJo6Ljovji+Od450xnTFHMUfjR+ND40NCQ0JL	QkuIS4i5iLkHuQe7B7uqu6p9qn07fTsFOwUgBSC9IL0KvQqiCqIMogysDKzErMS/	xL/wv/Au8C6CLoKNgo0djR1MHUz2TPZz9nNgc2BhYGEyYTIIMgj+CP5G/kZWRla5	VrleuV7dXt0E3QQdBB2BHYHIgciIyIgeiB56Hnpdel13XXeFd4VUhVRMVEzxTPGR	8ZFRkVG1UbXetd4p3im4Kbh+uH75fvlN+U3fTd9s32ySbJInkieDJ4P7g/sQ+xBc	EFzNXM3IzchgyGAcYByMHIxnjGe8Z7xtvG30bfR19HWSdZLUktS11LUctRxFHEXU	RdQ71Ds+Oz68PrwnvCf8J/yJ/IlQiVBbUFsTWxOME4x6jHqveq+Kr4pkimSUZJSo	lKgCqAL4AviW+Ja1lrXbtdse2x6tHq18rXyHfIdsh2yBbIEagRr/Gv/4//hm+Gav	Zq+Kr4p/in+Pf4/Nj80kzSTSJNIP0g9qD2rfat+Y35hqmGrVatWs1ayGrIYzhjPf	M99833zgfOAC4ALTAtNJ00mmSaZ8pnxZfFnsWeyF7IVthW2cbZx1nHULdQsQCxC/	EL9Cv0KKQoqfip/3n/dl92UHZQf/B/8p/ylBKUFGQUZ0RnSJdIk2iTZ+Nn4sfixL	LEtKS0oaShreGt7l3uUb5Rs2GzbzNvOn86emp6ZApkB4QHgPeA/VD9V71XtSe1Lf	Ut9a31q2WrYptinCKcImwia8Jrw+vD7CPsIiwiJcIlwyXDJfMl+9X72SvZKdkp25	nbnUudSF1IUxhTEEMQRgBGA4YDhxOHFMcUxhTGHRYdHm0eax5rGTsZNzk3ODc4Na	g1p8WnwIfAj3CPeR95EkkSS2JLZltmWOZY4rjisAKwCSAJI/kj9MP0xjTGNbY1sC	WwIMAgzEDMQ4xDjyOPKD8oMAgwAGAAblBuUf5R8fHx+TH5PRk9H90f1t/W1YbVi1	WLW2tbYTthMaExq+Gr5uvm4nbicNJw3ODc4vzi9oL2jaaNoS2hITEhNUE1RnVGdk	Z2TWZNYw1jBuMG4lbiUVJRWVFZVTlVPMU8z0zPRH9EclRyW8JbyVvJWTlZNZk1ne	Wd6i3qKBooFngWeAZ4DQgNDM0MxHzEcARwAPAA8iDyI4IjjOOM5VzlWeVZ5qnmqp	aqn9qf1h/WGMYYztjO1A7UDqQOrn6ufa59rB2sEhwSHTIdNQ01AKUAqHCoeTh5Ml	kyWgJaAkoCQSJBLQEtAu0C4sLiy+LL5zvnOic6IDogOaA5rlmuXv5e+M74zNjM1Y	zVjvWO8H7weTB5MYkxhCGEJTQlOlU6VppWmkaaTtpO1C7UK0QrRAtEClQKV2pXa5	drlnuWeFZ4VfhV8RXxGpEanuqe717vVC9UK2QrZ+tn4tfi1TLVPyU/Iy8jJPMk8U	TxQtFC2PLY+Zj5l3mXebd5vGm8adxp0bnRucG5zvnO+V75VblVvmW+bg5uDI4MhH	yEdIR0giSCJCIkIQQhAJEAmmCaZqpmrUatTC1MKWwpYLlgtyC3Kucq6IrojkiOS9	5L0EvQSdBJ1tnW3sbezt7O0A7QDYANiS2JKJkokqiSr6KvoE+gThBOFD4UNuQ26X	bpc1lzV2NXZMdkxgTGCCYIL4gvig+KAnoCeaJ5o0mjRqNGpAakAaQBqXGpeUl5SZ	lJmgmaCMoIx0jHQAdACgAKBzoHNZc1koWSjpKOma6Zr+mv7i/uIQ4hA6EDrLOsvf	y98O3w56DnqieqJxonGHcYdDh0OZQ5n8mfyC/IJigmLlYuV85Xz0fPR49HjAeMDU	wNR/1H8tfy2ILYgyiDJ8MnzlfOVX5VfsV+ys7KxRrFHdUd1x3XGzcbPAs8CgwKDQ	oNCp0KmLqYuui65arlrAWsCUwJSHlId9h33TfdPO087UztTQ1NDO0M40zjTiNOK+	4r75vvku+S7YLtjR2NFV0VXUVdSC1IKGgoYYhhisGKwVrBV4FXhjeGO2Y7YbthsL	GwvMC8wgzCD+IP56/nqcepyKnIpqimr3aveW95Ztlm3tbe1H7UcqRyp+Kn5CfkLI	QsgKyArNCs3UzdRE1ERtRG3zbfNR81GTUZNBk0F5QXk8eTy8PLyLvIt+i37FfsUE	xQSVBJXqlepj6mOzY7NUs1QdVB1XHVd3V3fEd8RXxFdSV1LJUsm2ybYstiywLLAD	sAN7A3ube5tUm1TUVNQJ1AlHCUcYRxhbGFtjW2MWYxa/Fr8Lvwv1C/Xy9fLa8tqs	2qxprGmbaZurm6vvq+9073S/dL92v3aXdpd6l3q1erVxtXHHccevx6/fr9+S35Ic	khxoHGjoaOiS6JLHkseyx7Imsib7Jvvx+/Gx8bFXsVdpV2lVaVUpVSnWKdaO1o69	jr2FvYVGhUYMRgw9DD1zPXMFcwUXBRe6F7pjumNgY2CwYLBBsEG/Qb9pv2nTadPP	088lzyXfJd//3/93/3eod6hkqGR5ZHnneefd593N3c0KzQorCiuPK489jz1nPWcs	ZywNLA1sDWwUbBRKFEoTShM1EzUTNRMlEyW0JbQUtBTVFNX11fUX9RfGF8bnxufM	58x5zHnYediK2Io6ijoyOjITMhP4E/jf+N/i3+LP4s/lz+X15fWw9bBdsF3vXe8i	7yJdIl1FXUVkRWRCZELKQsooyih2KHZZdlnMWcypzKkCqQIjAiOII4gSiBJAEkBs	QGwfbB/nH+dC50JOQk4GTgalBqW7pbvLu8sRyxEOEQ6DDoMhgyHhIeGS4ZIBkgEF	AQXYBdgH2Ad+B36GfoZUhlTJVMnCycLqwupF6kXkReQF5AUtBS2WLZZ4lnhKeEpe	Sl4zXjNKM0psSmztbO3m7eb05vQx9DFAMUBYQFhEWEQpRCm/Kb9+v359fn3/ff/4	//it+K29rb1KvUoCSgKOAo6wjrCJsIn3ifen96eDp4MVgxVfFV8iXyLGIsa2xrZv	tm+Zb5ljmWNfY18wXzAqMCpeKl7OXs7JzsmQyZD7kPvm++YL5gunC6fap9rt2u1+	7X4ZfhlmGWZ3ZndRd1GiUaJGokaxRrFisWJbYlu3W7dyt3IPcg8ODw5XDlfrV+uG	64b/hv+m/6YApgAdAB2YHZilmKWjpaPGo8atxq3QrdDq0Opk6mSQZJDXkNdN100W	TRboFuhw6HC4cLhpuGlkaWQGZAaqBqrZqtko2SjVKNUj1SP+I/4E/gSiBKJhomGH	YYc0hzTqNOoB6gF/AX+vf6/8r/z6/PqJ+olgiWAjYCOlI6VypXJRclFbUVtaW1qq	Wqrcqtwi3CLZItld2V3WXdZF1kVnRWf1Z/Vr9Wupa6l3qXeVd5WOlY7TjtOA04C7	gLtg]	>
	at org.junit.Assert.assertEquals(Assert.java:115)
	at org.apache.commons.codec.binary.Base64Test.testConstructor_Int_ByteArray_Boolean(Base64Test.java:250)

testByteToStringVariations(org.apache.commons.codec.binary.Base64Test)  Time elapsed: 0.003 sec  <<< FAILURE!
org.junit.ComparisonFailure: byteToString Hello World expected:<[SGVsbG8gV29ybGQ=]> but was:<[AABIAEhlSGVsZWxsbGxvbG8gbyBXIFdvV29yb3Jscmxk]>
	at org.junit.Assert.assertEquals(Assert.java:115)
	at org.apache.commons.codec.binary.Base64Test.testByteToStringVariations(Base64Test.java:1197)

testObjectEncodeWithValidParameter(org.apache.commons.codec.binary.Base64Test)  Time elapsed: 0 sec  <<< FAILURE!
org.junit.ComparisonFailure: dest string does not equal original expected:<[Hello Wor]ld!> but was:<[  H HeHelellllolo o W WoWororlrld]ld!>
	at org.junit.Assert.assertEquals(Assert.java:115)
	at org.apache.commons.codec.binary.Base64Test.testObjectEncodeWithValidParameter(Base64Test.java:536)

testRfc4648Section10Encode(org.apache.commons.codec.binary.Base64Test)  Time elapsed: 0 sec  <<< FAILURE!
org.junit.ComparisonFailure: expected:<[Zg==]> but was:<[AABm]>
	at org.junit.Assert.assertEquals(Assert.java:115)
	at org.junit.Assert.assertEquals(Assert.java:144)
	at org.apache.commons.codec.binary.Base64Test.testRfc4648Section10Encode(Base64Test.java:646)

testRfc4648Section10EncodeDecode(org.apache.commons.codec.binary.Base64Test)  Time elapsed: 0 sec  <<< FAILURE!
org.junit.ComparisonFailure: expected:<[]f> but was:<[  ]f>
	at org.junit.Assert.assertEquals(Assert.java:115)
	at org.junit.Assert.assertEquals(Assert.java:144)
	at org.apache.commons.codec.binary.Base64Test.testEncodeDecode(Base64Test.java:713)
	at org.apache.commons.codec.binary.Base64Test.testRfc4648Section10EncodeDecode(Base64Test.java:702)

Running org.apache.commons.codec.binary.HexTest
Tests run: 19, Failures: 0, Errors: 0, Skipped: 0, Time elapsed: 0.176 sec - in org.apache.commons.codec.binary.HexTest
Running org.apache.commons.codec.DecoderExceptionTest
Tests run: 4, Failures: 0, Errors: 0, Skipped: 0, Time elapsed: 0 sec - in org.apache.commons.codec.DecoderExceptionTest
Running org.apache.commons.codec.EncoderExceptionTest
Tests run: 4, Failures: 0, Errors: 0, Skipped: 0, Time elapsed: 0 sec - in org.apache.commons.codec.EncoderExceptionTest
Running org.apache.commons.codec.net.BCodecTest
Tests run: 9, Failures: 3, Errors: 0, Skipped: 0, Time elapsed: 0.007 sec <<< FAILURE! - in org.apache.commons.codec.net.BCodecTest
testUTF8RoundTrip(org.apache.commons.codec.net.BCodecTest)  Time elapsed: 0.002 sec  <<< FAILURE!
org.junit.ComparisonFailure: expected:<=?UTF-8?B?[0JLRgdC10Lxf0L/RgNC40LLQ]tdGC?=> but was:<=?UTF-8?B?[AADQANCS0JLRktGB0YHQgdC10LXQtdC80LxfvF/QX9C/0L/Rv9GA0YDQgNC40LjQuNCy0LLQstC10LXR]tdGC?=>
	at org.junit.Assert.assertEquals(Assert.java:115)
	at org.junit.Assert.assertEquals(Assert.java:144)
	at org.apache.commons.codec.net.BCodecTest.testUTF8RoundTrip(BCodecTest.java:69)

testBasicEncodeDecode(org.apache.commons.codec.net.BCodecTest)  Time elapsed: 0.001 sec  <<< FAILURE!
org.junit.ComparisonFailure: Basic B encoding test expected:<=?UTF-8?B?[SGVsbG8gdGhlcmU=]?=> but was:<=?UTF-8?B?[AABIAEhlSGVsZWxsbGxvbG8gbyB0IHRodGhlaGVyZXJl]?=>
	at org.junit.Assert.assertEquals(Assert.java:115)
	at org.apache.commons.codec.net.BCodecTest.testBasicEncodeDecode(BCodecTest.java:81)

testEncodeObjects(org.apache.commons.codec.net.BCodecTest)  Time elapsed: 0.001 sec  <<< FAILURE!
org.junit.ComparisonFailure: Basic B encoding test expected:<=?UTF-8?B?[d2hhdCBub3Q=]?=> but was:<=?UTF-8?B?[AAB3AHdod2hhaGF0YXQgdCBuIG5vbm90]?=>
	at org.junit.Assert.assertEquals(Assert.java:115)
	at org.apache.commons.codec.net.BCodecTest.testEncodeObjects(BCodecTest.java:114)

Running org.apache.commons.codec.net.QCodecTest
Tests run: 12, Failures: 0, Errors: 0, Skipped: 0, Time elapsed: 0.008 sec - in org.apache.commons.codec.net.QCodecTest
Running org.apache.commons.codec.net.UtilsTest
Tests run: 1, Failures: 0, Errors: 0, Skipped: 0, Time elapsed: 0 sec - in org.apache.commons.codec.net.UtilsTest
Running org.apache.commons.codec.net.RFC1522CodecTest
Tests run: 2, Failures: 0, Errors: 0, Skipped: 0, Time elapsed: 0 sec - in org.apache.commons.codec.net.RFC1522CodecTest
Running org.apache.commons.codec.net.URLCodecTest
Tests run: 16, Failures: 0, Errors: 0, Skipped: 0, Time elapsed: 0.002 sec - in org.apache.commons.codec.net.URLCodecTest
Running org.apache.commons.codec.net.QuotedPrintableCodecTest
Tests run: 21, Failures: 0, Errors: 0, Skipped: 0, Time elapsed: 0.01 sec - in org.apache.commons.codec.net.QuotedPrintableCodecTest
Running org.apache.commons.codec.StringEncoderComparatorTest
Tests run: 3, Failures: 0, Errors: 0, Skipped: 0, Time elapsed: 0.003 sec - in org.apache.commons.codec.StringEncoderComparatorTest
Running org.apache.commons.codec.language.Caverphone1Test
Tests run: 9, Failures: 0, Errors: 0, Skipped: 0, Time elapsed: 0.029 sec - in org.apache.commons.codec.language.Caverphone1Test
Running org.apache.commons.codec.language.NysiisTest
Tests run: 23, Failures: 0, Errors: 0, Skipped: 0, Time elapsed: 0.014 sec - in org.apache.commons.codec.language.NysiisTest
Running org.apache.commons.codec.language.Caverphone2Test
Tests run: 13, Failures: 0, Errors: 0, Skipped: 0, Time elapsed: 0.135 sec - in org.apache.commons.codec.language.Caverphone2Test
Running org.apache.commons.codec.language.DaitchMokotoffSoundexTest
Tests run: 13, Failures: 0, Errors: 0, Skipped: 0, Time elapsed: 0.051 sec - in org.apache.commons.codec.language.DaitchMokotoffSoundexTest
Running org.apache.commons.codec.language.bm.BeiderMorseEncoderTest
Tests run: 22, Failures: 0, Errors: 0, Skipped: 0, Time elapsed: 3.062 sec - in org.apache.commons.codec.language.bm.BeiderMorseEncoderTest
Running org.apache.commons.codec.language.bm.PhoneticEngineTest
Tests run: 8, Failures: 0, Errors: 0, Skipped: 0, Time elapsed: 0.045 sec - in org.apache.commons.codec.language.bm.PhoneticEngineTest
Running org.apache.commons.codec.language.bm.PhoneticEngineRegressionTest
Tests run: 4, Failures: 0, Errors: 0, Skipped: 0, Time elapsed: 0 sec - in org.apache.commons.codec.language.bm.PhoneticEngineRegressionTest
Running org.apache.commons.codec.language.bm.RuleTest
Tests run: 3, Failures: 0, Errors: 0, Skipped: 0, Time elapsed: 0.002 sec - in org.apache.commons.codec.language.bm.RuleTest
Running org.apache.commons.codec.language.bm.LanguageGuessingTest
Tests run: 18, Failures: 0, Errors: 0, Skipped: 0, Time elapsed: 0.015 sec - in org.apache.commons.codec.language.bm.LanguageGuessingTest
Running org.apache.commons.codec.language.DoubleMetaphoneTest
Tests run: 16, Failures: 0, Errors: 0, Skipped: 0, Time elapsed: 0.055 sec - in org.apache.commons.codec.language.DoubleMetaphoneTest
Running org.apache.commons.codec.language.SoundexTest
Tests run: 28, Failures: 0, Errors: 0, Skipped: 0, Time elapsed: 0.016 sec - in org.apache.commons.codec.language.SoundexTest
Running org.apache.commons.codec.language.RefinedSoundexTest
Tests run: 10, Failures: 0, Errors: 0, Skipped: 0, Time elapsed: 0.004 sec - in org.apache.commons.codec.language.RefinedSoundexTest
Running org.apache.commons.codec.language.MatchRatingApproachEncoderTest
Tests run: 96, Failures: 0, Errors: 0, Skipped: 0, Time elapsed: 0.037 sec - in org.apache.commons.codec.language.MatchRatingApproachEncoderTest
Running org.apache.commons.codec.language.ColognePhoneticTest
Tests run: 13, Failures: 0, Errors: 0, Skipped: 0, Time elapsed: 0.007 sec - in org.apache.commons.codec.language.ColognePhoneticTest
Running org.apache.commons.codec.language.DoubleMetaphone2Test
Tests run: 6, Failures: 0, Errors: 0, Skipped: 0, Time elapsed: 0.023 sec - in org.apache.commons.codec.language.DoubleMetaphone2Test
Running org.apache.commons.codec.language.MetaphoneTest
Tests run: 34, Failures: 0, Errors: 0, Skipped: 0, Time elapsed: 0.087 sec - in org.apache.commons.codec.language.MetaphoneTest
Running org.apache.commons.codec.CharEncodingTest
Tests run: 7, Failures: 0, Errors: 0, Skipped: 0, Time elapsed: 0 sec - in org.apache.commons.codec.CharEncodingTest

Results :

Failed tests: 
  Base64OutputStreamTest.testBase64OutputStreamByteByByte:144->testByteByByte:249 Streaming byte-by-byte base64 encode
  Base64OutputStreamTest.testBase64OutputStreamByChunk:106->testByChunk:197 Streaming chunked base64 encode
  Base64Codec13Test.testEncoder:372 Encoder test-1
  Base64Codec13Test.testBinaryEncoder:410 BinaryEncoder test-1
  Base64Codec13Test.testStaticEncodeChunked:483 static Base64.encodeBase64Chunked() test-1
  Base64Codec13Test.testStaticEncode:447 static Base64.encodeBase64() test-1
  Base64InputStreamTest.testBase64InputStreamByChunk:216->testByChunk:308 Streaming base64 encode
  Base64InputStreamTest.testCodec130:73 expected:<[ello Wo]rld> but was:<[ H HeHelellllolo o W WoWororl]rld>
  Base64InputStreamTest.testBase64InputStreamByteByByte:254->testByteByByte:362 EOF expected:<-1> but was:<120>
  Base64Test.testTriplets:940 expected:<AAAA[]> but was:<AAAA[AAAAAAAA]>
  Base64Test.testConstructor_Int_ByteArray_Boolean_UrlSafe:264 new Base64(64, \t, true) expected:<[AAD0APSD9IPNg80rzSsFKwUvBS90L3S4dLiIuIgCiAKeAp6cnpy3nLc9tz12PXZK	dkokSiQmJCY4JjhrOGstay1bLVsmWyYvJi9IL0j3SPee956-nr7nvufD58OGw4a8	hrzavNrC2sLOws65zrm-ub6MvoykjKQqpCo2KjbINsiPyI99j33YfdhZ2Fk2WTa9	Nr3EvcQOxA7cDtz83PxR_FHyUfKl8qVnpWclZyWtJa2YrZhQmFDuUO6J7onfid9z	33Nyc3JEckT3RPdw93BJcEnlSeX05fT49PhH-EfcR9zA3MARwBHYEdjb2NuP248t	jy1hLWG_Yb-Gv4ZYhlg2WDZxNnETcRPhE-Fi4WJeYl5cXlzCXMLJwsn_yf-a_5p-	mn6ofqgaqBpTGlOwU7D6sPpe-l6lXqVvpW8DbwM1AzVWNVYyVjLVMtXN1c02zTb_	Nv9c_1wyXDILMgvpC-kg6SADIAOgA6CvoK9Fr0VHRUd9R31xfXEqcSr_Kv-W_5bf	lt883zwAPABHAEdsR2xNbE1eTV4GXgYwBjApMCn1KfX49fhM-EwuTC4CLgImAiYd	Jh2KHYr8ivxu_G7Obs5_zn-cf5wsnCzPLM8qzyraKto32jewN7CqsKpSqlI5Ujna	OdrT2tP90_0n_SewJ7CssKzyrPL68vqG-obvhu9b71s6Wzr5Ovlg-WAEYAQsBCyr	LKvmq-b95v1K_UovSi-_L78mvyaOJo6Ljovji-Od450xnTFHMUfjR-ND40NCQ0JL	QkuIS4i5iLkHuQe7B7uqu6p9qn07fTsFOwUgBSC9IL0KvQqiCqIMogysDKzErMS_	xL_wv_Au8C6CLoKNgo0djR1MHUz2TPZz9nNgc2BhYGEyYTIIMgj-CP5G_kZWRla5	VrleuV7dXt0E3QQdBB2BHYHIgciIyIgeiB56Hnpdel13XXeFd4VUhVRMVEzxTPGR	8ZFRkVG1UbXetd4p3im4Kbh-uH75fvlN-U3fTd9s32ySbJInkieDJ4P7g_sQ-xBc	EFzNXM3IzchgyGAcYByMHIxnjGe8Z7xtvG30bfR19HWSdZLUktS11LUctRxFHEXU	RdQ71Ds-Oz68PrwnvCf8J_yJ_IlQiVBbUFsTWxOME4x6jHqveq-Kr4pkimSUZJSo	lKgCqAL4AviW-Ja1lrXbtdse2x6tHq18rXyHfIdsh2yBbIEagRr_Gv_4__hm-Gav	Zq-Kr4p_in-Pf4_Nj80kzSTSJNIP0g9qD2rfat-Y35hqmGrVatWs1ayGrIYzhjPf	M99833zgfOAC4ALTAtNJ00mmSaZ8pnxZfFnsWeyF7IVthW2cbZx1nHULdQsQCxC_	EL9Cv0KKQoqfip_3n_dl92UHZQf_B_8p_ylBKUFGQUZ0RnSJdIk2iTZ-Nn4sfixL	LEtKS0oaShreGt7l3uUb5Rs2GzbzNvOn86emp6ZApkB4QHgPeA_VD9V71XtSe1Lf	Ut9a31q2WrYptinCKcImwia8Jrw-vD7CPsIiwiJcIlwyXDJfMl-9X72SvZKdkp25	nbnUudSF1IUxhTEEMQRgBGA4YDhxOHFMcUxhTGHRYdHm0eax5rGTsZNzk3ODc4Na	g1p8WnwIfAj3CPeR95EkkSS2JLZltmWOZY4rjisAKwCSAJI_kj9MP0xjTGNbY1sC	WwIMAgzEDMQ4xDjyOPKD8oMAgwAGAAblBuUf5R8fHx-TH5PRk9H90f1t_W1YbVi1	WLW2tbYTthMaExq-Gr5uvm4nbicNJw3ODc4vzi9oL2jaaNoS2hITEhNUE1RnVGdk	Z2TWZNYw1jBuMG4lbiUVJRWVFZVTlVPMU8z0zPRH9EclRyW8JbyVvJWTlZNZk1ne	Wd6i3qKBooFngWeAZ4DQgNDM0MxHzEcARwAPAA8iDyI4IjjOOM5VzlWeVZ5qnmqp	aqn9qf1h_WGMYYztjO1A7UDqQOrn6ufa59rB2sEhwSHTIdNQ01AKUAqHCoeTh5Ml	kyWgJaAkoCQSJBLQEtAu0C4sLiy-LL5zvnOic6IDogOaA5rlmuXv5e-M74zNjM1Y	zVjvWO8H7weTB5MYkxhCGEJTQlOlU6VppWmkaaTtpO1C7UK0QrRAtEClQKV2pXa5	drlnuWeFZ4VfhV8RXxGpEanuqe717vVC9UK2QrZ-tn4tfi1TLVPyU_Iy8jJPMk8U	TxQtFC2PLY-Zj5l3mXebd5vGm8adxp0bnRucG5zvnO-V75VblVvmW-bg5uDI4MhH	yEdIR0giSCJCIkIQQhAJEAmmCaZqpmrUatTC1MKWwpYLlgtyC3Kucq6IrojkiOS9	5L0EvQSdBJ1tnW3sbezt7O0A7QDYANiS2JKJkokqiSr6KvoE-gThBOFD4UNuQ26X	bpc1lzV2NXZMdkxgTGCCYIL4gvig-KAnoCeaJ5o0mjRqNGpAakAaQBqXGpeUl5SZ	lJmgmaCMoIx0jHQAdACgAKBzoHNZc1koWSjpKOma6Zr-mv7i_uIQ4hA6EDrLOsvf	y98O3w56DnqieqJxonGHcYdDh0OZQ5n8mfyC_IJigmLlYuV85Xz0fPR49HjAeMDU	wNR_1H8tfy2ILYgyiDJ8MnzlfOVX5VfsV-ys7KxRrFHdUd1x3XGzcbPAs8CgwKDQ	oNCp0KmLqYuui65arlrAWsCUwJSHlId9h33TfdPO087UztTQ1NDO0M40zjTiNOK-	4r75vvku-S7YLtjR2NFV0VXUVdSC1IKGgoYYhhisGKwVrBV4FXhjeGO2Y7YbthsL	GwvMC8wgzCD-IP56_nqcepyKnIpqimr3aveW95Ztlm3tbe1H7UcqRyp-Kn5CfkLI	QsgKyArNCs3UzdRE1ERtRG3zbfNR81GTUZNBk0F5QXk8eTy8PLyLvIt-i37FfsUE	xQSVBJXqlepj6mOzY7NUs1QdVB1XHVd3V3fEd8RXxFdSV1LJUsm2ybYstiywLLAD	sAN7A3ube5tUm1TUVNQJ1AlHCUcYRxhbGFtjW2MWYxa_Fr8Lvwv1C_Xy9fLa8tqs	2qxprGmbaZurm6vvq-9073S_dL92v3aXdpd6l3q1erVxtXHHccevx6_fr9-S35Ic	khxoHGjoaOiS6JLHkseyx7Imsib7Jvvx-_Gx8bFXsVdpV2lVaVUpVSnWKdaO1o69	jr2FvYVGhUYMRgw9DD1zPXMFcwUXBRe6F7pjumNgY2CwYLBBsEG_Qb9pv2nTadPP	088lzyXfJd__3_93_3eod6hkqGR5ZHnneefd593N3c0KzQorCiuPK489jz1nPWcs	ZywNLA1sDWwUbBRKFEoTShM1EzUTNRMlEyW0JbQUtBTVFNX11fUX9RfGF8bnxufM	58x5zHnYediK2Io6ijoyOjITMhP4E_jf-N_i3-LP4s_lz-X15fWw9bBdsF3vXe8i	7yJdIl1FXUVkRWRCZELKQsooyih2KHZZdlnMWcypzKkCqQIjAiOII4gSiBJAEkBs	QGwfbB_nH-dC50JOQk4GTgalBqW7pbvLu8sRyxEOEQ6DDoMhgyHhIeGS4ZIBkgEF	AQXYBdgH2Ad-B36GfoZUhlTJVMnCycLqwupF6kXkReQF5AUtBS2WLZZ4lnhKeEpe	Sl4zXjNKM0psSmztbO3m7eb05vQx9DFAMUBYQFhEWEQpRCm_Kb9-v359fn3_ff_4	__it-K29rb1KvUoCSgKOAo6wjrCJsIn3ifen96eDp4MVgxVfFV8iXyLGIsa2xrZv	tm-Zb5ljmWNfY18wXzAqMCpeKl7OXs7JzsmQyZD7kPvm--YL5gunC6fap9rt2u1-	7X4ZfhlmGWZ3ZndRd1GiUaJGokaxRrFisWJbYlu3W7dyt3IPcg8ODw5XDlfrV-uG	64b_hv-m_6YApgAdAB2YHZilmKWjpaPGo8atxq3QrdDq0Opk6mSQZJDXkNdN100W	TRboFuhw6HC4cLhpuGlkaWQGZAaqBqrZqtko2SjVKNUj1SP-I_4E_gSiBKJhomGH	YYc0hzTqNOoB6gF_AX-vf6_8r_z6_PqJ-olgiWAjYCOlI6VypXJRclFbUVtaW1qq	Wqrcqtwi3CLZItld2V3WXdZF1kVnRWf1Z_Vr9Wupa6l3qXeVd5WOlY7TjtOA04C7	gLtg]	> but was:<[9IPNKwUvdLiIAp6ctz12SiQmOGstWyYvSPeevufDhrzaws65voykKjbIj33YWTa9	xA7c_FHypWclrZhQ7onfc3JE93BJ5fT4R9zAEdjbjy1hv4ZYNnET4WJeXMLJ_5p-	qBpTsPpepW8DNVYy1c02_1wyC-kgA6CvRUd9cSr_lt88AEdsTV4GMCn1-EwuAiYd	ivxuzn-cLM8q2jewqlI52tP9J7Cs8vqG71s6-WAELKvm_UovvyaOi-OdMUfjQ0JL	iLkHu6p9OwUgvQqiDKzEv_Augo0dTPZzYGEyCP5GVrle3QQdgciIHnpdd4VUTPGR	UbXeKbh--U3fbJIng_sQXM3IYByMZ7xt9HWS1LUcRdQ7Prwn_IlQWxOMeq-KZJSo	AviWtdserXyHbIEa__hmr4p_j80k0g9q35hq1ayGM9984ALTSaZ8WeyFbZx1CxC_	Qoqf92UH_ylBRnSJNn4sS0oa3uUbNvOnpkB4D9V7Ut9atinCJrw-wiJcMl-9kp25	1IUxBGA4cUxh0eaxk3ODWnwI95EktmWOKwCSP0xjWwIMxDjygwAG5R8fk9H9bVi1	thMavm4nDc4vaNoSE1RnZNYwbiUVlVPM9EclvJWTWd6igWeA0MxHAA8iOM5Vnmqp	_WGM7UDq59rBIdNQCoeTJaAkEtAuLL5zogOa5e-MzVjvB5MYQlOlaaTtQrRApXa5	Z4VfEanu9UK2fi1T8jJPFC2PmXebxp0bnO-VW-bgyEdIIkIQCaZq1MKWC3KuiOS9	BJ1t7O0A2JKJKvoE4UNulzV2TGCC-KAnmjRqQBqXlJmgjHQAoHNZKOma_uIQOsvf	DnqicYdDmfyCYuV89HjA1H8tiDJ85VfsrFHdcbPAoNCpi65awJSHfdPO1NDONOK-	-S7Y0VXUgoYYrBV4Y7YbC8wg_nqcimr3lm3tRyp-QsgKzdREbfNRk0F5PLyLfsUE	lepjs1QdV3fEV1LJtiywA3ubVNQJRxhbYxa_C_Xy2qxpm6vvdL92l3q1ccev35Ic	aOiSx7Im-_GxV2lVKdaOvYVGDD1zBRe6Y2CwQb9p088l3_93qGR5593NCiuPPWcs	DWwUShM1EyW0FNX1F8bnzHnYijoyE_jf4s_l9bBd7yJdRWRCyih2WcypAiOIEkBs	H-dCTgalu8sRDoMh4ZIBBdgHfoZUycLqReQFLZZ4Sl4zSmzt5vQxQFhEKb9-ff_4	rb1KAo6wifengxVfIsa2b5ljXzAqXs7JkPvmC6fa7X4ZZndRokaxYlu3cg8OV-uG	_6YAHZilo8at0OpkkNdNFuhwuGlkBqrZKNUj_gSiYYc06gF_r_z6iWAjpXJRW1qq	3CLZXdZFZ_VrqXeVjtOAu2A]	>
  Base64Test.testSingletonsChunked:831 expected:<AA[==]
> but was:<AA[AA]
>
  Base64Test.testPairs:547 expected:<AAA[=]> but was:<AAA[AAAAA]>
  Base64Test.testUUID:1180 standard encode uuid
  Base64Test.testEncodeDecodeSmall:365 -82 equals 0,0,-82
  Base64Test.testObjectDecodeWithValidParameter:511 dest string does not equal original expected:<[Hello Wor]ld!> but was:<[  H HeHelellllolo o W WoWororlrld]ld!>
  Base64Test.testCodeInteger1:149 expected:<[li7dzDacuo67Jg7mtqEm2TRuOMU=]> but was:<[AACWAJYuli7dLt3M3cw2zDacNpy6nLqOuo67jrsmuyYOJg7mDua25rahtqEmoSbZJtk02TRuNG44bjjF]>
  Base64Test.testCodeInteger2:158 expected:<[9B5ypLY9pMOmtxCeTDHgwdNFeGs=]> but was:<[AAD0APQe9B5yHnKkcqS2pLY9tj2kPaTDpMOmw6a3prcQtxCeEJ5MnkwxTDHgMeDB4MHTwdNF00V4RXhr]>
  Base64Test.testCodeInteger3:169 expected:<[FKIhdgaG5LGKiEtF1vHy4f3y700zaD6QwDS3IrNVGzNp2rY+1LFWTK6D44AyiC1n8uWz1itkYMZF0/aKDK0Yjg==]> but was:<[AAAUABSiFKIhoiF2IXYGdgaGBobkhuSx5LGKsYqIiohLiEtFS0XWRdbx1vHy8fLh8uH94f3y/fLv8u9N700zTTNoM2g+aD6QPpDAkMA0wDS3NLcityKzIrNVs1UbVRszGzNpM2naadq22rY+tj7UPtSx1LFWsVZMVkyuTK6DroPjg+OA44AygDKIMogtiC1nLWfyZ/Ll8uWz5bPWs9Yr1itkK2RgZGDGYMZFxkXTRdP20/aK9ooMigytDK0YrRiO]>
  Base64Test.testCodeInteger4:186 expected:<[ctA8YGxrtngg/zKVvqEOefnwmViFztcnPBYPlJsvh6yKI4iDm68fnp4Mi3RrJ6bZAygFrUIQLxLjV+OJtgJAEto0xAs+Mehuq1DkSFEpP3oDzCTOsrOiS1DwQe4oIb7zVk/9l7aPtJMHW0LVlMdwZNFNNJoqMcT2ZfCPrfvYvQ0=]> but was:<[AAByAHLQctA80DxgPGBsYGxrbGu2a7Z4tnggeCD/IP8y/zKVMpW+lb6hvqEOoQ55Dnn5efnw+fCZ8JlYmViFWIXOhc7Xztcn1yc8JzwWPBYPFg+UD5SblJsvmy+HL4esh6yKrIojiiOII4iDiIObg5uvm68frx+eH56enp4MngyLDIt0i3RrdGsnayemJ6bZptkD2QMoAygFKAWtBa1CrUIQQhAvEC8SLxLjEuNX41fjV+OJ44m2ibYCtgJAAkASQBLaEto02jTENMQLxAs+Cz4xPjHoMehu6G6rbqtQq1DkUORI5EhRSFEpUSk/KT96P3oDegPMA8wkzCTOJM6yzrKzsrOis6JLoktQS1DwUPBB8EHuQe4o7ighKCG+Ib7zvvNW81ZPVk/9T/2X/Ze2l7aPto+0j7STtJMHkwdbB1tCW0LVQtWU1ZTHlMdwx3BkcGTRZNFN0U00TTSaNJoqmioxKjHEMcT2xPZl9mXwZfCP8I+tj637rfvY+9i92L0N]>
  Base64Test.testObjectEncode:542 expected:<[SGVsbG8gV29ybGQ=]> but was:<[AABIAEhlSGVsZWxsbGxvbG8gbyBXIFdvV29yb3Jscmxk]>
  Base64Test.testUrlSafe:1085 url-safe i=1
  Base64Test.testEncodeDecodeRandom:352 null
  Base64Test.testDecodeWithWhitespace:324 Dest string doesn't equal the original expected:<[I am a late night cod]er.> but was:<[  I I I a amam m a a a l lalatatete e n ninigighghtht t c cocododeder]er.>
  Base64Test.testKnownEncodings:446 expected:<[VGhlIHF1aWNrIGJyb3duIGZveCBqdW1wZWQgb3ZlciB0aGUgbGF6eSBkb2dzLg==]> but was:<[AABUAFRoVGhlaGUgZSBxIHF1cXVpdWljaWNrY2sgayBiIGJyYnJvcm93b3dud24gbiBmIGZvZm94b3ggeCBqIGp1anVtdW1wbXBlcGVkZWQgZCBvIG92b3ZldmVyZXIgciB0IHRodGhlaGUgZSBsIGxhbGF6YXp5enkgeSBkIGRvZG9nb2dzZ3Mu]>
  Base64Test.testSingletons:718 expected:<AA[==]> but was:<AA[AA]>
  Base64Test.testTripletsChunked:1008 expected:<AAAA[]
> but was:<AAAA[AAAAAAAA]
>
  Base64Test.testRfc4648Section10DecodeEncode:671->testDecodeEncode:682 expected:<[Zg==]> but was:<[AABm]>
  Base64Test.testChunkedEncodeMultipleOf76:132 chunkedEncodeMultipleOf76
  Base64Test.testBase64:84 encoding hello world expected:<[SGVsbG8gV29ybGQ=]> but was:<[AABIAEhlSGVsZWxsbGxvbG8gbyBXIFdvV29yb3Jscmxk]>
  Base64Test.testConstructor_Int_ByteArray_Boolean:250 new Base64(65, \t, false) expected:<[9IPNKwUvdLiIAp6ctz12SiQmOGstWyYvSPeevufDhrzaws65voykKjbIj33YWTa9	xA7c/FHypWclrZhQ7onfc3JE93BJ5fT4R9zAEdjbjy1hv4ZYNnET4WJeXMLJ/5p+	qBpTsPpepW8DNVYy1c02/1wyC+kgA6CvRUd9cSr/lt88AEdsTV4GMCn1+EwuAiYd	ivxuzn+cLM8q2jewqlI52tP9J7Cs8vqG71s6+WAELKvm/UovvyaOi+OdMUfjQ0JL	iLkHu6p9OwUgvQqiDKzEv/Augo0dTPZzYGEyCP5GVrle3QQdgciIHnpdd4VUTPGR	UbXeKbh++U3fbJIng/sQXM3IYByMZ7xt9HWS1LUcRdQ7Prwn/IlQWxOMeq+KZJSo	AviWtdserXyHbIEa//hmr4p/j80k0g9q35hq1ayGM9984ALTSaZ8WeyFbZx1CxC/	Qoqf92UH/ylBRnSJNn4sS0oa3uUbNvOnpkB4D9V7Ut9atinCJrw+wiJcMl+9kp25	1IUxBGA4cUxh0eaxk3ODWnwI95EktmWOKwCSP0xjWwIMxDjygwAG5R8fk9H9bVi1	thMavm4nDc4vaNoSE1RnZNYwbiUVlVPM9EclvJWTWd6igWeA0MxHAA8iOM5Vnmqp	/WGM7UDq59rBIdNQCoeTJaAkEtAuLL5zogOa5e+MzVjvB5MYQlOlaaTtQrRApXa5	Z4VfEanu9UK2fi1T8jJPFC2PmXebxp0bnO+VW+bgyEdIIkIQCaZq1MKWC3KuiOS9	BJ1t7O0A2JKJKvoE4UNulzV2TGCC+KAnmjRqQBqXlJmgjHQAoHNZKOma/uIQOsvf	DnqicYdDmfyCYuV89HjA1H8tiDJ85VfsrFHdcbPAoNCpi65awJSHfdPO1NDONOK+	+S7Y0VXUgoYYrBV4Y7YbC8wg/nqcimr3lm3tRyp+QsgKzdREbfNRk0F5PLyLfsUE	lepjs1QdV3fEV1LJtiywA3ubVNQJRxhbYxa/C/Xy2qxpm6vvdL92l3q1ccev35Ic	aOiSx7Im+/GxV2lVKdaOvYVGDD1zBRe6Y2CwQb9p088l3/93qGR5593NCiuPPWcs	DWwUShM1EyW0FNX1F8bnzHnYijoyE/jf4s/l9bBd7yJdRWRCyih2WcypAiOIEkBs	H+dCTgalu8sRDoMh4ZIBBdgHfoZUycLqReQFLZZ4Sl4zSmzt5vQxQFhEKb9+ff/4	rb1KAo6wifengxVfIsa2b5ljXzAqXs7JkPvmC6fa7X4ZZndRokaxYlu3cg8OV+uG	/6YAHZilo8at0OpkkNdNFuhwuGlkBqrZKNUj/gSiYYc06gF/r/z6iWAjpXJRW1qq	3CLZXdZFZ/VrqXeVjtOAu2A=]	> but was:<[AAD0APSD9IPNg80rzSsFKwUvBS90L3S4dLiIuIgCiAKeAp6cnpy3nLc9tz12PXZK	dkokSiQmJCY4JjhrOGstay1bLVsmWyYvJi9IL0j3SPee956+nr7nvufD58OGw4a8	hrzavNrC2sLOws65zrm+ub6MvoykjKQqpCo2KjbINsiPyI99j33YfdhZ2Fk2WTa9	Nr3EvcQOxA7cDtz83PxR/FHyUfKl8qVnpWclZyWtJa2YrZhQmFDuUO6J7onfid9z	33Nyc3JEckT3RPdw93BJcEnlSeX05fT49PhH+EfcR9zA3MARwBHYEdjb2NuP248t	jy1hLWG/Yb+Gv4ZYhlg2WDZxNnETcRPhE+Fi4WJeYl5cXlzCXMLJwsn/yf+a/5p+	mn6ofqgaqBpTGlOwU7D6sPpe+l6lXqVvpW8DbwM1AzVWNVYyVjLVMtXN1c02zTb/	Nv9c/1wyXDILMgvpC+kg6SADIAOgA6CvoK9Fr0VHRUd9R31xfXEqcSr/Kv+W/5bf	lt883zwAPABHAEdsR2xNbE1eTV4GXgYwBjApMCn1KfX49fhM+EwuTC4CLgImAiYd	Jh2KHYr8ivxu/G7Obs5/zn+cf5wsnCzPLM8qzyraKto32jewN7CqsKpSqlI5Ujna	OdrT2tP90/0n/SewJ7CssKzyrPL68vqG+obvhu9b71s6Wzr5Ovlg+WAEYAQsBCyr	LKvmq+b95v1K/UovSi+/L78mvyaOJo6Ljovji+Od450xnTFHMUfjR+ND40NCQ0JL	QkuIS4i5iLkHuQe7B7uqu6p9qn07fTsFOwUgBSC9IL0KvQqiCqIMogysDKzErMS/	xL/wv/Au8C6CLoKNgo0djR1MHUz2TPZz9nNgc2BhYGEyYTIIMgj+CP5G/kZWRla5	VrleuV7dXt0E3QQdBB2BHYHIgciIyIgeiB56Hnpdel13XXeFd4VUhVRMVEzxTPGR	8ZFRkVG1UbXetd4p3im4Kbh+uH75fvlN+U3fTd9s32ySbJInkieDJ4P7g/sQ+xBc	EFzNXM3IzchgyGAcYByMHIxnjGe8Z7xtvG30bfR19HWSdZLUktS11LUctRxFHEXU	RdQ71Ds+Oz68PrwnvCf8J/yJ/IlQiVBbUFsTWxOME4x6jHqveq+Kr4pkimSUZJSo	lKgCqAL4AviW+Ja1lrXbtdse2x6tHq18rXyHfIdsh2yBbIEagRr/Gv/4//hm+Gav	Zq+Kr4p/in+Pf4/Nj80kzSTSJNIP0g9qD2rfat+Y35hqmGrVatWs1ayGrIYzhjPf	M99833zgfOAC4ALTAtNJ00mmSaZ8pnxZfFnsWeyF7IVthW2cbZx1nHULdQsQCxC/	EL9Cv0KKQoqfip/3n/dl92UHZQf/B/8p/ylBKUFGQUZ0RnSJdIk2iTZ+Nn4sfixL	LEtKS0oaShreGt7l3uUb5Rs2GzbzNvOn86emp6ZApkB4QHgPeA/VD9V71XtSe1Lf	Ut9a31q2WrYptinCKcImwia8Jrw+vD7CPsIiwiJcIlwyXDJfMl+9X72SvZKdkp25	nbnUudSF1IUxhTEEMQRgBGA4YDhxOHFMcUxhTGHRYdHm0eax5rGTsZNzk3ODc4Na	g1p8WnwIfAj3CPeR95EkkSS2JLZltmWOZY4rjisAKwCSAJI/kj9MP0xjTGNbY1sC	WwIMAgzEDMQ4xDjyOPKD8oMAgwAGAAblBuUf5R8fHx+TH5PRk9H90f1t/W1YbVi1	WLW2tbYTthMaExq+Gr5uvm4nbicNJw3ODc4vzi9oL2jaaNoS2hITEhNUE1RnVGdk	Z2TWZNYw1jBuMG4lbiUVJRWVFZVTlVPMU8z0zPRH9EclRyW8JbyVvJWTlZNZk1ne	Wd6i3qKBooFngWeAZ4DQgNDM0MxHzEcARwAPAA8iDyI4IjjOOM5VzlWeVZ5qnmqp	aqn9qf1h/WGMYYztjO1A7UDqQOrn6ufa59rB2sEhwSHTIdNQ01AKUAqHCoeTh5Ml	kyWgJaAkoCQSJBLQEtAu0C4sLiy+LL5zvnOic6IDogOaA5rlmuXv5e+M74zNjM1Y	zVjvWO8H7weTB5MYkxhCGEJTQlOlU6VppWmkaaTtpO1C7UK0QrRAtEClQKV2pXa5	drlnuWeFZ4VfhV8RXxGpEanuqe717vVC9UK2QrZ+tn4tfi1TLVPyU/Iy8jJPMk8U	TxQtFC2PLY+Zj5l3mXebd5vGm8adxp0bnRucG5zvnO+V75VblVvmW+bg5uDI4MhH	yEdIR0giSCJCIkIQQhAJEAmmCaZqpmrUatTC1MKWwpYLlgtyC3Kucq6IrojkiOS9	5L0EvQSdBJ1tnW3sbezt7O0A7QDYANiS2JKJkokqiSr6KvoE+gThBOFD4UNuQ26X	bpc1lzV2NXZMdkxgTGCCYIL4gvig+KAnoCeaJ5o0mjRqNGpAakAaQBqXGpeUl5SZ	lJmgmaCMoIx0jHQAdACgAKBzoHNZc1koWSjpKOma6Zr+mv7i/uIQ4hA6EDrLOsvf	y98O3w56DnqieqJxonGHcYdDh0OZQ5n8mfyC/IJigmLlYuV85Xz0fPR49HjAeMDU	wNR/1H8tfy2ILYgyiDJ8MnzlfOVX5VfsV+ys7KxRrFHdUd1x3XGzcbPAs8CgwKDQ	oNCp0KmLqYuui65arlrAWsCUwJSHlId9h33TfdPO087UztTQ1NDO0M40zjTiNOK+	4r75vvku+S7YLtjR2NFV0VXUVdSC1IKGgoYYhhisGKwVrBV4FXhjeGO2Y7YbthsL	GwvMC8wgzCD+IP56/nqcepyKnIpqimr3aveW95Ztlm3tbe1H7UcqRyp+Kn5CfkLI	QsgKyArNCs3UzdRE1ERtRG3zbfNR81GTUZNBk0F5QXk8eTy8PLyLvIt+i37FfsUE	xQSVBJXqlepj6mOzY7NUs1QdVB1XHVd3V3fEd8RXxFdSV1LJUsm2ybYstiywLLAD	sAN7A3ube5tUm1TUVNQJ1AlHCUcYRxhbGFtjW2MWYxa/Fr8Lvwv1C/Xy9fLa8tqs	2qxprGmbaZurm6vvq+9073S/dL92v3aXdpd6l3q1erVxtXHHccevx6/fr9+S35Ic	khxoHGjoaOiS6JLHkseyx7Imsib7Jvvx+/Gx8bFXsVdpV2lVaVUpVSnWKdaO1o69	jr2FvYVGhUYMRgw9DD1zPXMFcwUXBRe6F7pjumNgY2CwYLBBsEG/Qb9pv2nTadPP	088lzyXfJd//3/93/3eod6hkqGR5ZHnneefd593N3c0KzQorCiuPK489jz1nPWcs	ZywNLA1sDWwUbBRKFEoTShM1EzUTNRMlEyW0JbQUtBTVFNX11fUX9RfGF8bnxufM	58x5zHnYediK2Io6ijoyOjITMhP4E/jf+N/i3+LP4s/lz+X15fWw9bBdsF3vXe8i	7yJdIl1FXUVkRWRCZELKQsooyih2KHZZdlnMWcypzKkCqQIjAiOII4gSiBJAEkBs	QGwfbB/nH+dC50JOQk4GTgalBqW7pbvLu8sRyxEOEQ6DDoMhgyHhIeGS4ZIBkgEF	AQXYBdgH2Ad+B36GfoZUhlTJVMnCycLqwupF6kXkReQF5AUtBS2WLZZ4lnhKeEpe	Sl4zXjNKM0psSmztbO3m7eb05vQx9DFAMUBYQFhEWEQpRCm/Kb9+v359fn3/ff/4	//it+K29rb1KvUoCSgKOAo6wjrCJsIn3ifen96eDp4MVgxVfFV8iXyLGIsa2xrZv	tm+Zb5ljmWNfY18wXzAqMCpeKl7OXs7JzsmQyZD7kPvm++YL5gunC6fap9rt2u1+	7X4ZfhlmGWZ3ZndRd1GiUaJGokaxRrFisWJbYlu3W7dyt3IPcg8ODw5XDlfrV+uG	64b/hv+m/6YApgAdAB2YHZilmKWjpaPGo8atxq3QrdDq0Opk6mSQZJDXkNdN100W	TRboFuhw6HC4cLhpuGlkaWQGZAaqBqrZqtko2SjVKNUj1SP+I/4E/gSiBKJhomGH	YYc0hzTqNOoB6gF/AX+vf6/8r/z6/PqJ+olgiWAjYCOlI6VypXJRclFbUVtaW1qq	Wqrcqtwi3CLZItld2V3WXdZF1kVnRWf1Z/Vr9Wupa6l3qXeVd5WOlY7TjtOA04C7	gLtg]	>
  Base64Test.testByteToStringVariations:1197 byteToString Hello World expected:<[SGVsbG8gV29ybGQ=]> but was:<[AABIAEhlSGVsZWxsbGxvbG8gbyBXIFdvV29yb3Jscmxk]>
  Base64Test.testObjectEncodeWithValidParameter:536 dest string does not equal original expected:<[Hello Wor]ld!> but was:<[  H HeHelellllolo o W WoWororlrld]ld!>
  Base64Test.testRfc4648Section10Encode:646 expected:<[Zg==]> but was:<[AABm]>
  Base64Test.testRfc4648Section10EncodeDecode:702->testEncodeDecode:713 expected:<[]f> but was:<[  ]f>
  BCodecTest.testUTF8RoundTrip:69 expected:<=?UTF-8?B?[0JLRgdC10Lxf0L/RgNC40LLQ]tdGC?=> but was:<=?UTF-8?B?[AADQANCS0JLRktGB0YHQgdC10LXQtdC80LxfvF/QX9C/0L/Rv9GA0YDQgNC40LjQuNCy0LLQstC10LXR]tdGC?=>
  BCodecTest.testBasicEncodeDecode:81 Basic B encoding test expected:<=?UTF-8?B?[SGVsbG8gdGhlcmU=]?=> but was:<=?UTF-8?B?[AABIAEhlSGVsZWxsbGxvbG8gbyB0IHRodGhlaGVyZXJl]?=>
  BCodecTest.testEncodeObjects:114 Basic B encoding test expected:<=?UTF-8?B?[d2hhdCBub3Q=]?=> but was:<=?UTF-8?B?[AAB3AHdod2hhaGF0YXQgdCBuIG5vbm90]?=>

Tests run: 662, Failures: 38, Errors: 0, Skipped: 1

[INFO] ------------------------------------------------------------------------
[INFO] BUILD FAILURE
[INFO] ------------------------------------------------------------------------
[INFO] Total time: 13.430s
[INFO] Finished at: Sun Aug 02 06:23:40 BST 2015
[INFO] Final Memory: 22M/335M
[INFO] ------------------------------------------------------------------------
[ERROR] Failed to execute goal org.apache.maven.plugins:maven-surefire-plugin:2.17:test (default-test) on project commons-codec: There are test failures.
[ERROR] 
[ERROR] Please refer to /home/perham/Study/LittleDarwin/Cases/commons-codec-1.10-src/target/surefire-reports for the individual test results.
[ERROR] -> [Help 1]
[ERROR] 
[ERROR] To see the full stack trace of the errors, re-run Maven with the -e switch.
[ERROR] Re-run Maven using the -X switch to enable full debug logging.
[ERROR] 
[ERROR] For more information about the errors and possible solutions, please read the following articles:
[ERROR] [Help 1] http://cwiki.apache.org/confluence/display/MAVEN/MojoFailureException
