[INFO] Scanning for projects...
[INFO]                                                                         
[INFO] ------------------------------------------------------------------------
[INFO] Building Apache Commons Codec 1.10
[INFO] ------------------------------------------------------------------------
[INFO] 
[INFO] --- maven-enforcer-plugin:1.3.1:enforce (enforce-maven-3) @ commons-codec ---
[INFO] 
[INFO] --- maven-antrun-plugin:1.7:run (javadoc.resources) @ commons-codec ---
[INFO] Executing tasks

main:
[INFO] Executed tasks
[INFO] 
[INFO] --- maven-remote-resources-plugin:1.5:process (default) @ commons-codec ---
[INFO] 
[INFO] --- buildnumber-maven-plugin:1.3:create (default) @ commons-codec ---
[INFO] Executing: /bin/sh -c cd /home/perham/Study/LittleDarwin/Cases/commons-codec-1.10-src && svn --non-interactive info
[INFO] Working directory: /home/perham/Study/LittleDarwin/Cases/commons-codec-1.10-src
[INFO] Storing buildNumber: ?????? at timestamp: 1438495119426
[INFO] Executing: /bin/sh -c cd /home/perham/Study/LittleDarwin/Cases/commons-codec-1.10-src && svn --non-interactive info
[INFO] Working directory: /home/perham/Study/LittleDarwin/Cases/commons-codec-1.10-src
[INFO] Storing buildScmBranch: UNKNOWN_BRANCH
[INFO] 
[INFO] --- maven-resources-plugin:2.7:resources (default-resources) @ commons-codec ---
[INFO] Using 'UTF-8' encoding to copy filtered resources.
[INFO] Copying 128 resources
[INFO] Copying 2 resources to META-INF
[INFO] 
[INFO] --- maven-compiler-plugin:3.2:compile (default-compile) @ commons-codec ---
[INFO] Changes detected - recompiling the module!
[INFO] Compiling 60 source files to /home/perham/Study/LittleDarwin/Cases/commons-codec-1.10-src/target/classes
[INFO] /home/perham/Study/LittleDarwin/Cases/commons-codec-1.10-src/src/main/java/org/apache/commons/codec/digest/Sha2Crypt.java: Some input files use or override a deprecated API.
[INFO] /home/perham/Study/LittleDarwin/Cases/commons-codec-1.10-src/src/main/java/org/apache/commons/codec/digest/Sha2Crypt.java: Recompile with -Xlint:deprecation for details.
[INFO] 
[INFO] --- maven-bundle-plugin:2.5.3:manifest (bundle-manifest) @ commons-codec ---
[INFO] 
[INFO] --- maven-resources-plugin:2.7:testResources (default-testResources) @ commons-codec ---
[INFO] Using 'UTF-8' encoding to copy filtered resources.
[INFO] skip non existing resourceDirectory /home/perham/Study/LittleDarwin/Cases/commons-codec-1.10-src/src/test/resources
[INFO] Copying 2 resources to META-INF
[INFO] 
[INFO] --- maven-compiler-plugin:3.2:testCompile (default-testCompile) @ commons-codec ---
[INFO] Nothing to compile - all classes are up to date
[INFO] 
[INFO] --- maven-surefire-plugin:2.17:test (default-test) @ commons-codec ---
[INFO] Surefire report directory: /home/perham/Study/LittleDarwin/Cases/commons-codec-1.10-src/target/surefire-reports

-------------------------------------------------------
 T E S T S
-------------------------------------------------------
Running org.apache.commons.codec.digest.B64Test
Tests run: 2, Failures: 0, Errors: 0, Skipped: 0, Time elapsed: 0.026 sec - in org.apache.commons.codec.digest.B64Test
Running org.apache.commons.codec.digest.DigestUtilsTest
Tests run: 17, Failures: 0, Errors: 0, Skipped: 0, Time elapsed: 0.672 sec - in org.apache.commons.codec.digest.DigestUtilsTest
Running org.apache.commons.codec.digest.Sha512CryptTest
Tests run: 8, Failures: 0, Errors: 0, Skipped: 0, Time elapsed: 0.52 sec - in org.apache.commons.codec.digest.Sha512CryptTest
Running org.apache.commons.codec.digest.Apr1CryptTest
Tests run: 8, Failures: 0, Errors: 0, Skipped: 0, Time elapsed: 0.086 sec - in org.apache.commons.codec.digest.Apr1CryptTest
Running org.apache.commons.codec.digest.HmacUtilsTest
Tests run: 24, Failures: 0, Errors: 0, Skipped: 0, Time elapsed: 0.032 sec - in org.apache.commons.codec.digest.HmacUtilsTest
Running org.apache.commons.codec.digest.Sha2CryptTest
Tests run: 1, Failures: 0, Errors: 0, Skipped: 0, Time elapsed: 0 sec - in org.apache.commons.codec.digest.Sha2CryptTest
Running org.apache.commons.codec.digest.CryptTest
Tests run: 4, Failures: 0, Errors: 0, Skipped: 0, Time elapsed: 0.098 sec - in org.apache.commons.codec.digest.CryptTest
Running org.apache.commons.codec.digest.Sha256CryptTest
Tests run: 7, Failures: 0, Errors: 0, Skipped: 0, Time elapsed: 0.098 sec - in org.apache.commons.codec.digest.Sha256CryptTest
Running org.apache.commons.codec.digest.Md5CryptTest
Tests run: 7, Failures: 0, Errors: 0, Skipped: 0, Time elapsed: 0.018 sec - in org.apache.commons.codec.digest.Md5CryptTest
Running org.apache.commons.codec.digest.UnixCryptTest
Tests run: 9, Failures: 0, Errors: 0, Skipped: 0, Time elapsed: 0.007 sec - in org.apache.commons.codec.digest.UnixCryptTest
Running org.apache.commons.codec.CharsetsTest
Tests run: 7, Failures: 0, Errors: 0, Skipped: 0, Time elapsed: 0.001 sec - in org.apache.commons.codec.CharsetsTest
Running org.apache.commons.codec.binary.Base32Test
Tests run: 8, Failures: 0, Errors: 0, Skipped: 0, Time elapsed: 0.003 sec - in org.apache.commons.codec.binary.Base32Test
Running org.apache.commons.codec.binary.Base64OutputStreamTest
Tests run: 7, Failures: 3, Errors: 2, Skipped: 0, Time elapsed: 0.014 sec <<< FAILURE! - in org.apache.commons.codec.binary.Base64OutputStreamTest
testCodec98NPE(org.apache.commons.codec.binary.Base64OutputStreamTest)  Time elapsed: 0.007 sec  <<< FAILURE!
org.junit.ComparisonFailure: codec-98 NPE Base64OutputStream expected:<...IJKLMNOPQRSTUVWXYZ01[23]> but was:<...IJKLMNOPQRSTUVWXYZ01[]>
	at org.junit.Assert.assertEquals(Assert.java:115)
	at org.apache.commons.codec.binary.Base64OutputStreamTest.testCodec98NPE(Base64OutputStreamTest.java:60)

testBase64OutputStreamByteByByte(org.apache.commons.codec.binary.Base64OutputStreamTest)  Time elapsed: 0.001 sec  <<< FAILURE!
java.lang.AssertionError: Streaming byte-by-byte base64 decode
	at org.junit.Assert.fail(Assert.java:88)
	at org.junit.Assert.assertTrue(Assert.java:41)
	at org.apache.commons.codec.binary.Base64OutputStreamTest.testByteByByte(Base64OutputStreamTest.java:259)
	at org.apache.commons.codec.binary.Base64OutputStreamTest.testBase64OutputStreamByteByByte(Base64OutputStreamTest.java:144)

testBase64EmptyOutputStreamMimeChunkSize(org.apache.commons.codec.binary.Base64OutputStreamTest)  Time elapsed: 0.003 sec  <<< ERROR!
java.lang.IllegalStateException: Impossible modulus 0
	at org.apache.commons.codec.binary.Base64.decode(Base64.java:98)
	at org.apache.commons.codec.binary.BaseNCodecOutputStream.close(BaseNCodecOutputStream.java:147)
	at org.apache.commons.codec.binary.Base64OutputStreamTest.testByteByByte(Base64OutputStreamTest.java:257)
	at org.apache.commons.codec.binary.Base64OutputStreamTest.testBase64EmptyOutputStream(Base64OutputStreamTest.java:91)
	at org.apache.commons.codec.binary.Base64OutputStreamTest.testBase64EmptyOutputStreamMimeChunkSize(Base64OutputStreamTest.java:74)

testBase64EmptyOutputStreamPemChunkSize(org.apache.commons.codec.binary.Base64OutputStreamTest)  Time elapsed: 0 sec  <<< ERROR!
java.lang.IllegalStateException: Impossible modulus 0
	at org.apache.commons.codec.binary.Base64.decode(Base64.java:98)
	at org.apache.commons.codec.binary.BaseNCodecOutputStream.close(BaseNCodecOutputStream.java:147)
	at org.apache.commons.codec.binary.Base64OutputStreamTest.testByteByByte(Base64OutputStreamTest.java:257)
	at org.apache.commons.codec.binary.Base64OutputStreamTest.testBase64EmptyOutputStream(Base64OutputStreamTest.java:91)
	at org.apache.commons.codec.binary.Base64OutputStreamTest.testBase64EmptyOutputStreamPemChunkSize(Base64OutputStreamTest.java:85)

testBase64OutputStreamByChunk(org.apache.commons.codec.binary.Base64OutputStreamTest)  Time elapsed: 0.001 sec  <<< FAILURE!
java.lang.AssertionError: Streaming chunked base64 decode
	at org.junit.Assert.fail(Assert.java:88)
	at org.junit.Assert.assertTrue(Assert.java:41)
	at org.apache.commons.codec.binary.Base64OutputStreamTest.testByChunk(Base64OutputStreamTest.java:205)
	at org.apache.commons.codec.binary.Base64OutputStreamTest.testBase64OutputStreamByChunk(Base64OutputStreamTest.java:106)

Running org.apache.commons.codec.binary.Base64Codec13Test
Tests run: 8, Failures: 4, Errors: 0, Skipped: 0, Time elapsed: 0.016 sec <<< FAILURE! - in org.apache.commons.codec.binary.Base64Codec13Test
testDecoder(org.apache.commons.codec.binary.Base64Codec13Test)  Time elapsed: 0 sec  <<< FAILURE!
java.lang.AssertionError: Decoder test-1
	at org.junit.Assert.fail(Assert.java:88)
	at org.junit.Assert.assertTrue(Assert.java:41)
	at org.apache.commons.codec.binary.Base64Codec13Test.testDecoder(Base64Codec13Test.java:391)

testBinaryDecoder(org.apache.commons.codec.binary.Base64Codec13Test)  Time elapsed: 0.001 sec  <<< FAILURE!
java.lang.AssertionError: BinaryDecoder test-1
	at org.junit.Assert.fail(Assert.java:88)
	at org.junit.Assert.assertTrue(Assert.java:41)
	at org.apache.commons.codec.binary.Base64Codec13Test.testBinaryDecoder(Base64Codec13Test.java:429)

testStaticDecodeChunked(org.apache.commons.codec.binary.Base64Codec13Test)  Time elapsed: 0 sec  <<< FAILURE!
java.lang.AssertionError: static Base64.decodeBase64Chunked() test-1
	at org.junit.Assert.fail(Assert.java:88)
	at org.junit.Assert.assertTrue(Assert.java:41)
	at org.apache.commons.codec.binary.Base64Codec13Test.testStaticDecodeChunked(Base64Codec13Test.java:502)

testStaticDecode(org.apache.commons.codec.binary.Base64Codec13Test)  Time elapsed: 0.001 sec  <<< FAILURE!
java.lang.AssertionError: static Base64.decodeBase64() test-1
	at org.junit.Assert.fail(Assert.java:88)
	at org.junit.Assert.assertTrue(Assert.java:41)
	at org.apache.commons.codec.binary.Base64Codec13Test.testStaticDecode(Base64Codec13Test.java:465)

Running org.apache.commons.codec.binary.Base64InputStreamTest
Tests run: 19, Failures: 6, Errors: 7, Skipped: 0, Time elapsed: 0.012 sec <<< FAILURE! - in org.apache.commons.codec.binary.Base64InputStreamTest
testSkipToEnd(org.apache.commons.codec.binary.Base64InputStreamTest)  Time elapsed: 0.001 sec  <<< ERROR!
java.lang.IllegalStateException: Impossible modulus 0
	at org.apache.commons.codec.binary.Base64.decode(Base64.java:98)
	at org.apache.commons.codec.binary.BaseNCodecInputStream.read(BaseNCodecInputStream.java:162)
	at org.apache.commons.codec.binary.BaseNCodecInputStream.read(BaseNCodecInputStream.java:97)
	at org.apache.commons.codec.binary.Base64InputStreamTest.testSkipToEnd(Base64InputStreamTest.java:554)

testSkipNone(org.apache.commons.codec.binary.Base64InputStreamTest)  Time elapsed: 0.001 sec  <<< ERROR!
java.lang.IllegalStateException: Impossible modulus 0
	at org.apache.commons.codec.binary.Base64.decode(Base64.java:98)
	at org.apache.commons.codec.binary.BaseNCodecInputStream.read(BaseNCodecInputStream.java:162)
	at org.apache.commons.codec.binary.BaseNCodecInputStream.read(BaseNCodecInputStream.java:97)
	at org.apache.commons.codec.binary.Base64InputStreamTest.testSkipNone(Base64InputStreamTest.java:521)

testCodec98NPE(org.apache.commons.codec.binary.Base64InputStreamTest)  Time elapsed: 0.001 sec  <<< FAILURE!
org.junit.ComparisonFailure: codec-98 NPE Base64InputStream expected:<...IJKLMNOPQRSTUVWXYZ01[23]> but was:<...IJKLMNOPQRSTUVWXYZ01[]>
	at org.junit.Assert.assertEquals(Assert.java:115)
	at org.apache.commons.codec.binary.Base64InputStreamTest.testCodec98NPE(Base64InputStreamTest.java:154)

testBase64InputStreamByChunk(org.apache.commons.codec.binary.Base64InputStreamTest)  Time elapsed: 0.001 sec  <<< FAILURE!
java.lang.AssertionError: Streaming base64 decode
	at org.junit.Assert.fail(Assert.java:88)
	at org.junit.Assert.assertTrue(Assert.java:41)
	at org.apache.commons.codec.binary.Base64InputStreamTest.testByChunk(Base64InputStreamTest.java:318)
	at org.apache.commons.codec.binary.Base64InputStreamTest.testBase64InputStreamByChunk(Base64InputStreamTest.java:216)

testInputStreamReader(org.apache.commons.codec.binary.Base64InputStreamTest)  Time elapsed: 0 sec  <<< FAILURE!
java.lang.AssertionError: Codec101:  InputStreamReader works!
	at org.junit.Assert.fail(Assert.java:88)
	at org.junit.Assert.assertTrue(Assert.java:41)
	at org.junit.Assert.assertNotNull(Assert.java:621)
	at org.apache.commons.codec.binary.Base64InputStreamTest.testInputStreamReader(Base64InputStreamTest.java:134)

testCodec101(org.apache.commons.codec.binary.Base64InputStreamTest)  Time elapsed: 0 sec  <<< FAILURE!
java.lang.AssertionError: Codec101: First read successful [c=-1]
	at org.junit.Assert.fail(Assert.java:88)
	at org.junit.Assert.assertTrue(Assert.java:41)
	at org.apache.commons.codec.binary.Base64InputStreamTest.testCodec101(Base64InputStreamTest.java:104)

testCodec130(org.apache.commons.codec.binary.Base64InputStreamTest)  Time elapsed: 0 sec  <<< FAILURE!
org.junit.ComparisonFailure: expected:<ello Wor[ld]> but was:<ello Wor[]>
	at org.junit.Assert.assertEquals(Assert.java:115)
	at org.junit.Assert.assertEquals(Assert.java:144)
	at org.apache.commons.codec.binary.Base64InputStreamTest.testCodec130(Base64InputStreamTest.java:73)

testAvailable(org.apache.commons.codec.binary.Base64InputStreamTest)  Time elapsed: 0 sec  <<< ERROR!
java.lang.IllegalStateException: Impossible modulus 0
	at org.apache.commons.codec.binary.Base64.decode(Base64.java:98)
	at org.apache.commons.codec.binary.BaseNCodecInputStream.read(BaseNCodecInputStream.java:162)
	at org.apache.commons.codec.binary.BaseNCodecInputStream.skip(BaseNCodecInputStream.java:202)
	at org.apache.commons.codec.binary.Base64InputStreamTest.testAvailable(Base64InputStreamTest.java:167)

testBase64EmptyInputStreamPemChuckSize(org.apache.commons.codec.binary.Base64InputStreamTest)  Time elapsed: 0 sec  <<< ERROR!
java.lang.IllegalStateException: Impossible modulus 0
	at org.apache.commons.codec.binary.Base64.decode(Base64.java:98)
	at org.apache.commons.codec.binary.BaseNCodecInputStream.read(BaseNCodecInputStream.java:162)
	at org.apache.commons.codec.binary.BaseNCodecInputStream.read(BaseNCodecInputStream.java:97)
	at org.apache.commons.codec.binary.Base64InputStreamTest.testByteByByte(Base64InputStreamTest.java:374)
	at org.apache.commons.codec.binary.Base64InputStreamTest.testBase64EmptyInputStream(Base64InputStreamTest.java:201)
	at org.apache.commons.codec.binary.Base64InputStreamTest.testBase64EmptyInputStreamPemChuckSize(Base64InputStreamTest.java:195)

testBase64EmptyInputStreamMimeChuckSize(org.apache.commons.codec.binary.Base64InputStreamTest)  Time elapsed: 0 sec  <<< ERROR!
java.lang.IllegalStateException: Impossible modulus 0
	at org.apache.commons.codec.binary.Base64.decode(Base64.java:98)
	at org.apache.commons.codec.binary.BaseNCodecInputStream.read(BaseNCodecInputStream.java:162)
	at org.apache.commons.codec.binary.BaseNCodecInputStream.read(BaseNCodecInputStream.java:97)
	at org.apache.commons.codec.binary.Base64InputStreamTest.testByteByByte(Base64InputStreamTest.java:374)
	at org.apache.commons.codec.binary.Base64InputStreamTest.testBase64EmptyInputStream(Base64InputStreamTest.java:201)
	at org.apache.commons.codec.binary.Base64InputStreamTest.testBase64EmptyInputStreamMimeChuckSize(Base64InputStreamTest.java:184)

testSkipPastEnd(org.apache.commons.codec.binary.Base64InputStreamTest)  Time elapsed: 0 sec  <<< ERROR!
java.lang.IllegalStateException: Impossible modulus 0
	at org.apache.commons.codec.binary.Base64.decode(Base64.java:98)
	at org.apache.commons.codec.binary.BaseNCodecInputStream.read(BaseNCodecInputStream.java:162)
	at org.apache.commons.codec.binary.BaseNCodecInputStream.skip(BaseNCodecInputStream.java:202)
	at org.apache.commons.codec.binary.Base64InputStreamTest.testSkipPastEnd(Base64InputStreamTest.java:535)

testSkipBig(org.apache.commons.codec.binary.Base64InputStreamTest)  Time elapsed: 0 sec  <<< ERROR!
java.lang.IllegalStateException: Impossible modulus 0
	at org.apache.commons.codec.binary.Base64.decode(Base64.java:98)
	at org.apache.commons.codec.binary.BaseNCodecInputStream.read(BaseNCodecInputStream.java:162)
	at org.apache.commons.codec.binary.BaseNCodecInputStream.skip(BaseNCodecInputStream.java:202)
	at org.apache.commons.codec.binary.Base64InputStreamTest.testSkipBig(Base64InputStreamTest.java:500)

testBase64InputStreamByteByByte(org.apache.commons.codec.binary.Base64InputStreamTest)  Time elapsed: 0.001 sec  <<< FAILURE!
java.lang.AssertionError: Streaming base64 decode
	at org.junit.Assert.fail(Assert.java:88)
	at org.junit.Assert.assertTrue(Assert.java:41)
	at org.apache.commons.codec.binary.Base64InputStreamTest.testByteByByte(Base64InputStreamTest.java:376)
	at org.apache.commons.codec.binary.Base64InputStreamTest.testBase64InputStreamByteByByte(Base64InputStreamTest.java:254)

Running org.apache.commons.codec.binary.Base32InputStreamTest
Tests run: 16, Failures: 0, Errors: 0, Skipped: 0, Time elapsed: 0.146 sec - in org.apache.commons.codec.binary.Base32InputStreamTest
Running org.apache.commons.codec.binary.Base32OutputStreamTest
Tests run: 6, Failures: 0, Errors: 0, Skipped: 0, Time elapsed: 0.098 sec - in org.apache.commons.codec.binary.Base32OutputStreamTest
Running org.apache.commons.codec.binary.BinaryCodecTest
Tests run: 13, Failures: 0, Errors: 0, Skipped: 0, Time elapsed: 0.012 sec - in org.apache.commons.codec.binary.BinaryCodecTest
Running org.apache.commons.codec.binary.BaseNCodecTest
Tests run: 7, Failures: 0, Errors: 0, Skipped: 0, Time elapsed: 0.004 sec - in org.apache.commons.codec.binary.BaseNCodecTest
Running org.apache.commons.codec.binary.StringUtilsTest
Tests run: 17, Failures: 0, Errors: 0, Skipped: 0, Time elapsed: 0.023 sec - in org.apache.commons.codec.binary.StringUtilsTest
Running org.apache.commons.codec.binary.Base64Test
Tests run: 53, Failures: 21, Errors: 6, Skipped: 1, Time elapsed: 0.044 sec <<< FAILURE! - in org.apache.commons.codec.binary.Base64Test
testStringToByteVariations(org.apache.commons.codec.binary.Base64Test)  Time elapsed: 0.001 sec  <<< FAILURE!
org.junit.ComparisonFailure: StringToByte Hello World expected:<Hello Wor[ld]> but was:<Hello Wor[]>
	at org.junit.Assert.assertEquals(Assert.java:115)
	at org.apache.commons.codec.binary.Base64Test.testStringToByteVariations(Base64Test.java:1218)

testKnownDecodings(org.apache.commons.codec.binary.Base64Test)  Time elapsed: 0 sec  <<< FAILURE!
org.junit.ComparisonFailure: expected:<...d over the lazy dogs[.]> but was:<...d over the lazy dogs[]>
	at org.junit.Assert.assertEquals(Assert.java:115)
	at org.junit.Assert.assertEquals(Assert.java:144)
	at org.apache.commons.codec.binary.Base64Test.testKnownDecodings(Base64Test.java:431)

testPairs(org.apache.commons.codec.binary.Base64Test)  Time elapsed: 0.001 sec  <<< FAILURE!
java.lang.AssertionError: null
	at org.junit.Assert.fail(Assert.java:86)
	at org.junit.Assert.assertTrue(Assert.java:41)
	at org.junit.Assert.assertTrue(Assert.java:52)
	at org.apache.commons.codec.binary.Base64Test.testPairs(Base64Test.java:550)

testUUID(org.apache.commons.codec.binary.Base64Test)  Time elapsed: 0 sec  <<< FAILURE!
java.lang.AssertionError: standard decode uuid
	at org.junit.Assert.fail(Assert.java:88)
	at org.junit.Assert.assertTrue(Assert.java:41)
	at org.apache.commons.codec.binary.Base64Test.testUUID(Base64Test.java:1182)

testEncodeDecodeSmall(org.apache.commons.codec.binary.Base64Test)  Time elapsed: 0.001 sec  <<< FAILURE!
java.lang.AssertionError: -32 equals 
	at org.junit.Assert.fail(Assert.java:88)
	at org.junit.Assert.assertTrue(Assert.java:41)
	at org.apache.commons.codec.binary.Base64Test.testEncodeDecodeSmall(Base64Test.java:365)

testObjectDecodeWithValidParameter(org.apache.commons.codec.binary.Base64Test)  Time elapsed: 0 sec  <<< ERROR!
java.lang.IllegalStateException: Impossible modulus 0
	at org.apache.commons.codec.binary.Base64.decode(Base64.java:98)
	at org.apache.commons.codec.binary.BaseNCodec.decode(BaseNCodec.java:411)
	at org.apache.commons.codec.binary.BaseNCodec.decode(BaseNCodec.java:378)
	at org.apache.commons.codec.binary.Base64Test.testObjectDecodeWithValidParameter(Base64Test.java:507)

testCodeInteger1(org.apache.commons.codec.binary.Base64Test)  Time elapsed: 0.003 sec  <<< FAILURE!
java.lang.AssertionError: expected:<857393771208094202104259627990318636601332086981> but was:<13082790698365695222538141296238992868062318>
	at org.junit.Assert.fail(Assert.java:88)
	at org.junit.Assert.failNotEquals(Assert.java:743)
	at org.junit.Assert.assertEquals(Assert.java:118)
	at org.junit.Assert.assertEquals(Assert.java:144)
	at org.apache.commons.codec.binary.Base64Test.testCodeInteger1(Base64Test.java:150)

testCodeInteger2(org.apache.commons.codec.binary.Base64Test)  Time elapsed: 0.001 sec  <<< FAILURE!
java.lang.AssertionError: expected:<1393672757286116725466646726891466679477132949611> but was:<21265758625581615073648784284842936393388869>
	at org.junit.Assert.fail(Assert.java:88)
	at org.junit.Assert.failNotEquals(Assert.java:743)
	at org.junit.Assert.assertEquals(Assert.java:118)
	at org.junit.Assert.assertEquals(Assert.java:144)
	at org.apache.commons.codec.binary.Base64Test.testCodeInteger2(Base64Test.java:159)

testCodeInteger3(org.apache.commons.codec.binary.Base64Test)  Time elapsed: 0.001 sec  <<< FAILURE!
java.lang.AssertionError: expected:<1080654815409387346195174854511969891364164488058190793635243098977490449581124171362405574495062430572478766856090958495998158114332651671116876320938126> but was:<4221307872692919321074901775437382388141267531477307787637668355380822068676266294384396775371337619423745183031605306624992805134111920590300298128664>
	at org.junit.Assert.fail(Assert.java:88)
	at org.junit.Assert.failNotEquals(Assert.java:743)
	at org.junit.Assert.assertEquals(Assert.java:118)
	at org.junit.Assert.assertEquals(Assert.java:144)
	at org.apache.commons.codec.binary.Base64Test.testCodeInteger3(Base64Test.java:170)

testCodeInteger4(org.apache.commons.codec.binary.Base64Test)  Time elapsed: 0.002 sec  <<< FAILURE!
java.lang.AssertionError: expected:<80624726256040348115552042320696813500187275370942441977258669395023235020055564647117594451929708788598704081077890850726227289270230377442285367559774800853404089092381420228663316324808605521697655145608801533888071381819208887705771753016938104409283940243801509765453542091716518238707344493641683483917> but was:<1230235691162725038384277989512585655215259939131812163959635458298084030457390817979699622374415722482280030534025434123630177143405614890171590691524884046225037980535605167063344060131967247340357286767712425749024526700122205928127620743056306524799864810849022060630089448420967380351369392297999320>
	at org.junit.Assert.fail(Assert.java:88)
	at org.junit.Assert.failNotEquals(Assert.java:743)
	at org.junit.Assert.assertEquals(Assert.java:118)
	at org.junit.Assert.assertEquals(Assert.java:144)
	at org.apache.commons.codec.binary.Base64Test.testCodeInteger4(Base64Test.java:187)

testUrlSafe(org.apache.commons.codec.binary.Base64Test)  Time elapsed: 0 sec  <<< FAILURE!
java.lang.AssertionError: url-safe i=1
	at org.junit.Assert.fail(Assert.java:88)
	at org.junit.Assert.assertTrue(Assert.java:41)
	at org.apache.commons.codec.binary.Base64Test.testUrlSafe(Base64Test.java:1085)

testEncodeDecodeRandom(org.apache.commons.codec.binary.Base64Test)  Time elapsed: 0.003 sec  <<< FAILURE!
java.lang.AssertionError: null
	at org.junit.Assert.fail(Assert.java:86)
	at org.junit.Assert.assertTrue(Assert.java:41)
	at org.junit.Assert.assertTrue(Assert.java:52)
	at org.apache.commons.codec.binary.Base64Test.testEncodeDecodeRandom(Base64Test.java:352)

testDecodeWithWhitespace(org.apache.commons.codec.binary.Base64Test)  Time elapsed: 0.003 sec  <<< ERROR!
java.lang.IllegalStateException: Impossible modulus 0
	at org.apache.commons.codec.binary.Base64.decode(Base64.java:98)
	at org.apache.commons.codec.binary.BaseNCodec.decode(BaseNCodec.java:411)
	at org.apache.commons.codec.binary.Base64.decodeBase64(Base64.java:119)
	at org.apache.commons.codec.binary.Base64Test.testDecodeWithWhitespace(Base64Test.java:320)

testDecodePadOnlyChunked(org.apache.commons.codec.binary.Base64Test)  Time elapsed: 0 sec  <<< ERROR!
java.lang.IllegalStateException: Impossible modulus 0
	at org.apache.commons.codec.binary.Base64.decode(Base64.java:98)
	at org.apache.commons.codec.binary.BaseNCodec.decode(BaseNCodec.java:410)
	at org.apache.commons.codec.binary.Base64.decodeBase64(Base64.java:119)
	at org.apache.commons.codec.binary.Base64Test.testDecodePadOnlyChunked(Base64Test.java:297)

testIgnoringNonBase64InDecode(org.apache.commons.codec.binary.Base64Test)  Time elapsed: 0 sec  <<< FAILURE!
org.junit.ComparisonFailure: expected:<...d over the lazy dogs[.]> but was:<...d over the lazy dogs[]>
	at org.junit.Assert.assertEquals(Assert.java:115)
	at org.junit.Assert.assertEquals(Assert.java:144)
	at org.apache.commons.codec.binary.Base64Test.testIgnoringNonBase64InDecode(Base64Test.java:395)

testDecodePadMarkerIndex2(org.apache.commons.codec.binary.Base64Test)  Time elapsed: 0 sec  <<< FAILURE!
org.junit.ComparisonFailure: expected:<[A]> but was:<[]>
	at org.junit.Assert.assertEquals(Assert.java:115)
	at org.junit.Assert.assertEquals(Assert.java:144)
	at org.apache.commons.codec.binary.Base64Test.testDecodePadMarkerIndex2(Base64Test.java:272)

testDecodePadMarkerIndex3(org.apache.commons.codec.binary.Base64Test)  Time elapsed: 0 sec  <<< FAILURE!
org.junit.ComparisonFailure: expected:<[AA]> but was:<[]>
	at org.junit.Assert.assertEquals(Assert.java:115)
	at org.junit.Assert.assertEquals(Assert.java:144)
	at org.apache.commons.codec.binary.Base64Test.testDecodePadMarkerIndex3(Base64Test.java:280)

testSingletons(org.apache.commons.codec.binary.Base64Test)  Time elapsed: 0.002 sec  <<< FAILURE!
java.lang.AssertionError: null
	at org.junit.Assert.fail(Assert.java:86)
	at org.junit.Assert.assertTrue(Assert.java:41)
	at org.junit.Assert.assertTrue(Assert.java:52)
	at org.apache.commons.codec.binary.Base64Test.testSingletons(Base64Test.java:825)

testRfc4648Section10DecodeEncode(org.apache.commons.codec.binary.Base64Test)  Time elapsed: 0.001 sec  <<< FAILURE!
org.junit.ComparisonFailure: expected:<[Zg==]> but was:<[]>
	at org.junit.Assert.assertEquals(Assert.java:115)
	at org.junit.Assert.assertEquals(Assert.java:144)
	at org.apache.commons.codec.binary.Base64Test.testDecodeEncode(Base64Test.java:682)
	at org.apache.commons.codec.binary.Base64Test.testRfc4648Section10DecodeEncode(Base64Test.java:671)

testDecodePadOnly(org.apache.commons.codec.binary.Base64Test)  Time elapsed: 0 sec  <<< ERROR!
java.lang.IllegalStateException: Impossible modulus 0
	at org.apache.commons.codec.binary.Base64.decode(Base64.java:98)
	at org.apache.commons.codec.binary.BaseNCodec.decode(BaseNCodec.java:410)
	at org.apache.commons.codec.binary.Base64.decodeBase64(Base64.java:119)
	at org.apache.commons.codec.binary.Base64Test.testDecodePadOnly(Base64Test.java:286)

testBase64(org.apache.commons.codec.binary.Base64Test)  Time elapsed: 0.001 sec  <<< FAILURE!
org.junit.ComparisonFailure: decode hello world expected:<Hello Wor[ld]> but was:<Hello Wor[]>
	at org.junit.Assert.assertEquals(Assert.java:115)
	at org.apache.commons.codec.binary.Base64Test.testBase64(Base64Test.java:99)

testNonBase64Test(org.apache.commons.codec.binary.Base64Test)  Time elapsed: 0.001 sec  <<< FAILURE!
java.lang.AssertionError: Exception was thrown when trying to decode invalid base64 encoded data - RFC 2045 requires that all non base64 character be discarded, an exception should not have been thrown
	at org.junit.Assert.fail(Assert.java:88)
	at org.apache.commons.codec.binary.Base64Test.testNonBase64Test(Base64Test.java:480)

testObjectEncodeWithValidParameter(org.apache.commons.codec.binary.Base64Test)  Time elapsed: 0 sec  <<< ERROR!
java.lang.IllegalStateException: Impossible modulus 0
	at org.apache.commons.codec.binary.Base64.decode(Base64.java:98)
	at org.apache.commons.codec.binary.BaseNCodec.decode(BaseNCodec.java:411)
	at org.apache.commons.codec.binary.Base64.decodeBase64(Base64.java:119)
	at org.apache.commons.codec.binary.Base64Test.testObjectEncodeWithValidParameter(Base64Test.java:533)

testRfc4648Section10DecodeWithCrLf(org.apache.commons.codec.binary.Base64Test)  Time elapsed: 0.001 sec  <<< ERROR!
java.lang.IllegalStateException: Impossible modulus 0
	at org.apache.commons.codec.binary.Base64.decode(Base64.java:98)
	at org.apache.commons.codec.binary.BaseNCodec.decode(BaseNCodec.java:411)
	at org.apache.commons.codec.binary.BaseNCodec.decode(BaseNCodec.java:394)
	at org.apache.commons.codec.binary.Base64.decodeBase64(Base64.java:118)
	at org.apache.commons.codec.binary.Base64Test.testRfc4648Section10DecodeWithCrLf(Base64Test.java:620)

testRfc4648Section10Decode(org.apache.commons.codec.binary.Base64Test)  Time elapsed: 0 sec  <<< FAILURE!
org.junit.ComparisonFailure: expected:<[f]> but was:<[]>
	at org.junit.Assert.assertEquals(Assert.java:115)
	at org.junit.Assert.assertEquals(Assert.java:144)
	at org.apache.commons.codec.binary.Base64Test.testRfc4648Section10Decode(Base64Test.java:595)

testRfc4648Section10EncodeDecode(org.apache.commons.codec.binary.Base64Test)  Time elapsed: 0 sec  <<< FAILURE!
org.junit.ComparisonFailure: expected:<[f]> but was:<[]>
	at org.junit.Assert.assertEquals(Assert.java:115)
	at org.junit.Assert.assertEquals(Assert.java:144)
	at org.apache.commons.codec.binary.Base64Test.testEncodeDecode(Base64Test.java:713)
	at org.apache.commons.codec.binary.Base64Test.testRfc4648Section10EncodeDecode(Base64Test.java:702)

testDecodeWithInnerPad(org.apache.commons.codec.binary.Base64Test)  Time elapsed: 0.001 sec  <<< FAILURE!
java.lang.AssertionError: decode should halt at pad (=)
	at org.junit.Assert.fail(Assert.java:88)
	at org.junit.Assert.assertTrue(Assert.java:41)
	at org.apache.commons.codec.binary.Base64Test.testDecodeWithInnerPad(Base64Test.java:119)

Running org.apache.commons.codec.binary.HexTest
Tests run: 19, Failures: 0, Errors: 0, Skipped: 0, Time elapsed: 0.175 sec - in org.apache.commons.codec.binary.HexTest
Running org.apache.commons.codec.DecoderExceptionTest
Tests run: 4, Failures: 0, Errors: 0, Skipped: 0, Time elapsed: 0.026 sec - in org.apache.commons.codec.DecoderExceptionTest
Running org.apache.commons.codec.EncoderExceptionTest
Tests run: 4, Failures: 0, Errors: 0, Skipped: 0, Time elapsed: 0 sec - in org.apache.commons.codec.EncoderExceptionTest
Running org.apache.commons.codec.net.BCodecTest
Tests run: 9, Failures: 2, Errors: 1, Skipped: 0, Time elapsed: 0.001 sec <<< FAILURE! - in org.apache.commons.codec.net.BCodecTest
testUTF8RoundTrip(org.apache.commons.codec.net.BCodecTest)  Time elapsed: 0 sec  <<< ERROR!
java.lang.IllegalStateException: Impossible modulus 0
	at org.apache.commons.codec.binary.Base64.decode(Base64.java:98)
	at org.apache.commons.codec.binary.BaseNCodec.decode(BaseNCodec.java:411)
	at org.apache.commons.codec.binary.Base64.decodeBase64(Base64.java:119)
	at org.apache.commons.codec.net.BCodec.doDecoding(BCodec.java:104)
	at org.apache.commons.codec.net.RFC1522Codec.decodeText(RFC1522Codec.java:154)
	at org.apache.commons.codec.net.BCodec.decode(BCodec.java:181)
	at org.apache.commons.codec.net.BCodecTest.testUTF8RoundTrip(BCodecTest.java:72)

testBasicEncodeDecode(org.apache.commons.codec.net.BCodecTest)  Time elapsed: 0 sec  <<< FAILURE!
org.junit.ComparisonFailure: Basic B decoding test expected:<Hello the[re]> but was:<Hello the[]>
	at org.junit.Assert.assertEquals(Assert.java:115)
	at org.apache.commons.codec.net.BCodecTest.testBasicEncodeDecode(BCodecTest.java:82)

testDecodeObjects(org.apache.commons.codec.net.BCodecTest)  Time elapsed: 0 sec  <<< FAILURE!
org.junit.ComparisonFailure: Basic B decoding test expected:<what n[ot]> but was:<what n[]>
	at org.junit.Assert.assertEquals(Assert.java:115)
	at org.apache.commons.codec.net.BCodecTest.testDecodeObjects(BCodecTest.java:138)

Running org.apache.commons.codec.net.QCodecTest
Tests run: 12, Failures: 0, Errors: 0, Skipped: 0, Time elapsed: 0 sec - in org.apache.commons.codec.net.QCodecTest
Running org.apache.commons.codec.net.UtilsTest
Tests run: 1, Failures: 0, Errors: 0, Skipped: 0, Time elapsed: 0.001 sec - in org.apache.commons.codec.net.UtilsTest
Running org.apache.commons.codec.net.RFC1522CodecTest
Tests run: 2, Failures: 0, Errors: 0, Skipped: 0, Time elapsed: 0 sec - in org.apache.commons.codec.net.RFC1522CodecTest
Running org.apache.commons.codec.net.URLCodecTest
Tests run: 16, Failures: 0, Errors: 0, Skipped: 0, Time elapsed: 0.001 sec - in org.apache.commons.codec.net.URLCodecTest
Running org.apache.commons.codec.net.QuotedPrintableCodecTest
Tests run: 21, Failures: 0, Errors: 0, Skipped: 0, Time elapsed: 0.012 sec - in org.apache.commons.codec.net.QuotedPrintableCodecTest
Running org.apache.commons.codec.StringEncoderComparatorTest
Tests run: 3, Failures: 0, Errors: 0, Skipped: 0, Time elapsed: 0.001 sec - in org.apache.commons.codec.StringEncoderComparatorTest
Running org.apache.commons.codec.language.Caverphone1Test
Tests run: 9, Failures: 0, Errors: 0, Skipped: 0, Time elapsed: 0.031 sec - in org.apache.commons.codec.language.Caverphone1Test
Running org.apache.commons.codec.language.NysiisTest
Tests run: 23, Failures: 0, Errors: 0, Skipped: 0, Time elapsed: 0.018 sec - in org.apache.commons.codec.language.NysiisTest
Running org.apache.commons.codec.language.Caverphone2Test
Tests run: 13, Failures: 0, Errors: 0, Skipped: 0, Time elapsed: 0.136 sec - in org.apache.commons.codec.language.Caverphone2Test
Running org.apache.commons.codec.language.DaitchMokotoffSoundexTest
Tests run: 13, Failures: 0, Errors: 0, Skipped: 0, Time elapsed: 0.055 sec - in org.apache.commons.codec.language.DaitchMokotoffSoundexTest
Running org.apache.commons.codec.language.bm.BeiderMorseEncoderTest
Tests run: 22, Failures: 0, Errors: 0, Skipped: 0, Time elapsed: 2.906 sec - in org.apache.commons.codec.language.bm.BeiderMorseEncoderTest
Running org.apache.commons.codec.language.bm.PhoneticEngineTest
Tests run: 8, Failures: 0, Errors: 0, Skipped: 0, Time elapsed: 0.02 sec - in org.apache.commons.codec.language.bm.PhoneticEngineTest
Running org.apache.commons.codec.language.bm.PhoneticEngineRegressionTest
Tests run: 4, Failures: 0, Errors: 0, Skipped: 0, Time elapsed: 0.01 sec - in org.apache.commons.codec.language.bm.PhoneticEngineRegressionTest
Running org.apache.commons.codec.language.bm.RuleTest
Tests run: 3, Failures: 0, Errors: 0, Skipped: 0, Time elapsed: 0.002 sec - in org.apache.commons.codec.language.bm.RuleTest
Running org.apache.commons.codec.language.bm.LanguageGuessingTest
Tests run: 18, Failures: 0, Errors: 0, Skipped: 0, Time elapsed: 0.012 sec - in org.apache.commons.codec.language.bm.LanguageGuessingTest
Running org.apache.commons.codec.language.DoubleMetaphoneTest
Tests run: 16, Failures: 0, Errors: 0, Skipped: 0, Time elapsed: 0.057 sec - in org.apache.commons.codec.language.DoubleMetaphoneTest
Running org.apache.commons.codec.language.SoundexTest
Tests run: 28, Failures: 0, Errors: 0, Skipped: 0, Time elapsed: 0.002 sec - in org.apache.commons.codec.language.SoundexTest
Running org.apache.commons.codec.language.RefinedSoundexTest
Tests run: 10, Failures: 0, Errors: 0, Skipped: 0, Time elapsed: 0.001 sec - in org.apache.commons.codec.language.RefinedSoundexTest
Running org.apache.commons.codec.language.MatchRatingApproachEncoderTest
Tests run: 96, Failures: 0, Errors: 0, Skipped: 0, Time elapsed: 0.031 sec - in org.apache.commons.codec.language.MatchRatingApproachEncoderTest
Running org.apache.commons.codec.language.ColognePhoneticTest
Tests run: 13, Failures: 0, Errors: 0, Skipped: 0, Time elapsed: 0.002 sec - in org.apache.commons.codec.language.ColognePhoneticTest
Running org.apache.commons.codec.language.DoubleMetaphone2Test
Tests run: 6, Failures: 0, Errors: 0, Skipped: 0, Time elapsed: 0.026 sec - in org.apache.commons.codec.language.DoubleMetaphone2Test
Running org.apache.commons.codec.language.MetaphoneTest
Tests run: 34, Failures: 0, Errors: 0, Skipped: 0, Time elapsed: 0.125 sec - in org.apache.commons.codec.language.MetaphoneTest
Running org.apache.commons.codec.CharEncodingTest
Tests run: 7, Failures: 0, Errors: 0, Skipped: 0, Time elapsed: 0 sec - in org.apache.commons.codec.CharEncodingTest

Results :

Failed tests: 
  Base64OutputStreamTest.testCodec98NPE:60 codec-98 NPE Base64OutputStream expected:<...IJKLMNOPQRSTUVWXYZ01[23]> but was:<...IJKLMNOPQRSTUVWXYZ01[]>
  Base64OutputStreamTest.testBase64OutputStreamByteByByte:144->testByteByByte:259 Streaming byte-by-byte base64 decode
  Base64OutputStreamTest.testBase64OutputStreamByChunk:106->testByChunk:205 Streaming chunked base64 decode
  Base64Codec13Test.testDecoder:391 Decoder test-1
  Base64Codec13Test.testBinaryDecoder:429 BinaryDecoder test-1
  Base64Codec13Test.testStaticDecodeChunked:502 static Base64.decodeBase64Chunked() test-1
  Base64Codec13Test.testStaticDecode:465 static Base64.decodeBase64() test-1
  Base64InputStreamTest.testCodec98NPE:154 codec-98 NPE Base64InputStream expected:<...IJKLMNOPQRSTUVWXYZ01[23]> but was:<...IJKLMNOPQRSTUVWXYZ01[]>
  Base64InputStreamTest.testBase64InputStreamByChunk:216->testByChunk:318 Streaming base64 decode
  Base64InputStreamTest.testInputStreamReader:134 Codec101:  InputStreamReader works!
  Base64InputStreamTest.testCodec101:104 Codec101: First read successful [c=-1]
  Base64InputStreamTest.testCodec130:73 expected:<ello Wor[ld]> but was:<ello Wor[]>
  Base64InputStreamTest.testBase64InputStreamByteByByte:254->testByteByByte:376 Streaming base64 decode
  Base64Test.testStringToByteVariations:1218 StringToByte Hello World expected:<Hello Wor[ld]> but was:<Hello Wor[]>
  Base64Test.testKnownDecodings:431 expected:<...d over the lazy dogs[.]> but was:<...d over the lazy dogs[]>
  Base64Test.testPairs:550 null
  Base64Test.testUUID:1182 standard decode uuid
  Base64Test.testEncodeDecodeSmall:365 -32 equals 
  Base64Test.testCodeInteger1:150 expected:<857393771208094202104259627990318636601332086981> but was:<13082790698365695222538141296238992868062318>
  Base64Test.testCodeInteger2:159 expected:<1393672757286116725466646726891466679477132949611> but was:<21265758625581615073648784284842936393388869>
  Base64Test.testCodeInteger3:170 expected:<1080654815409387346195174854511969891364164488058190793635243098977490449581124171362405574495062430572478766856090958495998158114332651671116876320938126> but was:<4221307872692919321074901775437382388141267531477307787637668355380822068676266294384396775371337619423745183031605306624992805134111920590300298128664>
  Base64Test.testCodeInteger4:187 expected:<80624726256040348115552042320696813500187275370942441977258669395023235020055564647117594451929708788598704081077890850726227289270230377442285367559774800853404089092381420228663316324808605521697655145608801533888071381819208887705771753016938104409283940243801509765453542091716518238707344493641683483917> but was:<1230235691162725038384277989512585655215259939131812163959635458298084030457390817979699622374415722482280030534025434123630177143405614890171590691524884046225037980535605167063344060131967247340357286767712425749024526700122205928127620743056306524799864810849022060630089448420967380351369392297999320>
  Base64Test.testUrlSafe:1085 url-safe i=1
  Base64Test.testEncodeDecodeRandom:352 null
  Base64Test.testIgnoringNonBase64InDecode:395 expected:<...d over the lazy dogs[.]> but was:<...d over the lazy dogs[]>
  Base64Test.testDecodePadMarkerIndex2:272 expected:<[A]> but was:<[]>
  Base64Test.testDecodePadMarkerIndex3:280 expected:<[AA]> but was:<[]>
  Base64Test.testSingletons:825 null
  Base64Test.testRfc4648Section10DecodeEncode:671->testDecodeEncode:682 expected:<[Zg==]> but was:<[]>
  Base64Test.testBase64:99 decode hello world expected:<Hello Wor[ld]> but was:<Hello Wor[]>
  Base64Test.testNonBase64Test:480 Exception was thrown when trying to decode invalid base64 encoded data - RFC 2045 requires that all non base64 character be discarded, an exception should not have been thrown
  Base64Test.testRfc4648Section10Decode:595 expected:<[f]> but was:<[]>
  Base64Test.testRfc4648Section10EncodeDecode:702->testEncodeDecode:713 expected:<[f]> but was:<[]>
  Base64Test.testDecodeWithInnerPad:119 decode should halt at pad (=)
  BCodecTest.testBasicEncodeDecode:82 Basic B decoding test expected:<Hello the[re]> but was:<Hello the[]>
  BCodecTest.testDecodeObjects:138 Basic B decoding test expected:<what n[ot]> but was:<what n[]>

Tests in error: 
  Base64OutputStreamTest.testBase64EmptyOutputStreamMimeChunkSize:74->testBase64EmptyOutputStream:91->testByteByByte:257 » IllegalState
  Base64OutputStreamTest.testBase64EmptyOutputStreamPemChunkSize:85->testBase64EmptyOutputStream:91->testByteByByte:257 » IllegalState
  Base64InputStreamTest.testSkipToEnd:554 » IllegalState Impossible modulus 0
  Base64InputStreamTest.testSkipNone:521 » IllegalState Impossible modulus 0
  Base64InputStreamTest.testAvailable:167 » IllegalState Impossible modulus 0
  Base64InputStreamTest.testBase64EmptyInputStreamPemChuckSize:195->testBase64EmptyInputStream:201->testByteByByte:374 » IllegalState
  Base64InputStreamTest.testBase64EmptyInputStreamMimeChuckSize:184->testBase64EmptyInputStream:201->testByteByByte:374 » IllegalState
  Base64InputStreamTest.testSkipPastEnd:535 » IllegalState Impossible modulus 0
  Base64InputStreamTest.testSkipBig:500 » IllegalState Impossible modulus 0
  Base64Test.testObjectDecodeWithValidParameter:507 » IllegalState Impossible mo...
  Base64Test.testDecodeWithWhitespace:320 » IllegalState Impossible modulus 0
  Base64Test.testDecodePadOnlyChunked:297 » IllegalState Impossible modulus 0
  Base64Test.testDecodePadOnly:286 » IllegalState Impossible modulus 0
  Base64Test.testObjectEncodeWithValidParameter:533 » IllegalState Impossible mo...
  Base64Test.testRfc4648Section10DecodeWithCrLf:620 » IllegalState Impossible mo...
  BCodecTest.testUTF8RoundTrip:72 » IllegalState Impossible modulus 0

Tests run: 662, Failures: 36, Errors: 16, Skipped: 1

[INFO] ------------------------------------------------------------------------
[INFO] BUILD FAILURE
[INFO] ------------------------------------------------------------------------
[INFO] Total time: 13.710s
[INFO] Finished at: Sun Aug 02 06:58:50 BST 2015
[INFO] Final Memory: 22M/336M
[INFO] ------------------------------------------------------------------------
[ERROR] Failed to execute goal org.apache.maven.plugins:maven-surefire-plugin:2.17:test (default-test) on project commons-codec: There are test failures.
[ERROR] 
[ERROR] Please refer to /home/perham/Study/LittleDarwin/Cases/commons-codec-1.10-src/target/surefire-reports for the individual test results.
[ERROR] -> [Help 1]
[ERROR] 
[ERROR] To see the full stack trace of the errors, re-run Maven with the -e switch.
[ERROR] Re-run Maven using the -X switch to enable full debug logging.
[ERROR] 
[ERROR] For more information about the errors and possible solutions, please read the following articles:
[ERROR] [Help 1] http://cwiki.apache.org/confluence/display/MAVEN/MojoFailureException
